<?xml version="1.0" encoding="UTF-8" standalone="no"?>
<!-- Created with Inkscape (http://www.inkscape.org/) -->

<svg
   width="136.22424mm"
   height="69.230446mm"
   viewBox="0 0 136.22424 69.230444"
   version="1.1"
   id="svg5"
   inkscape:version="1.1.2 (0a00cf5339, 2022-02-04)"
   sodipodi:docname="RSA.svg"
   xmlns:inkscape="http://www.inkscape.org/namespaces/inkscape"
   xmlns:sodipodi="http://sodipodi.sourceforge.net/DTD/sodipodi-0.dtd"
   xmlns="http://www.w3.org/2000/svg"
   xmlns:svg="http://www.w3.org/2000/svg">
  <sodipodi:namedview
     id="namedview7"
     pagecolor="#ffffff"
     bordercolor="#666666"
     borderopacity="1.0"
     inkscape:pageshadow="2"
     inkscape:pageopacity="0.0"
     inkscape:pagecheckerboard="0"
     inkscape:document-units="mm"
     showgrid="false"
     fit-margin-top="10"
     fit-margin-left="10"
     fit-margin-right="10"
     fit-margin-bottom="10"
     inkscape:zoom="2"
     inkscape:cx="200.25"
     inkscape:cy="179.75"
     inkscape:window-width="2486"
     inkscape:window-height="1376"
     inkscape:window-x="0"
     inkscape:window-y="0"
     inkscape:window-maximized="1"
     inkscape:current-layer="layer1"
     lock-margins="true" />
  <defs
     id="defs2">
    <inkscape:path-effect
       effect="powerclip"
       id="path-effect21664"
       is_visible="true"
       lpeversion="1"
       inverse="true"
       flatten="false"
       hide_clip="false"
       message="Use fill-rule evenodd on &lt;b&gt;fill and stroke&lt;/b&gt; dialog if no flatten result after convert clip to paths." />
    <linearGradient
       id="linearGradient2403"
       inkscape:swatch="gradient">
      <stop
         style="stop-color:#ff7f04;stop-opacity:1;"
         offset="0"
         id="stop2399" />
      <stop
         style="stop-color:#ff7f04;stop-opacity:0;"
         offset="1"
         id="stop2401" />
    </linearGradient>
  </defs>
  <g
     inkscape:label="Layer 1"
     inkscape:groupmode="layer"
     id="layer1"
     transform="translate(4.5950938,5.6893544)">
    <text
       xml:space="preserve"
       style="font-size:70.5556px;line-height:1.25;font-family:'Noto Sans CJK JP';-inkscape-font-specification:'Noto Sans CJK JP, Normal';stroke-width:0.264583"
       x="-0.38285816"
       y="52.852074"
       id="text3290"><tspan
         sodipodi:role="line"
         style="font-style:normal;font-variant:normal;font-weight:normal;font-stretch:normal;font-size:70.5556px;font-family:'Liberation Sans';-inkscape-font-specification:'Liberation Sans';stroke-width:0.264583"
         x="-0.38285816"
         y="52.852074"
         id="tspan43203">Rs</tspan></text>
    <ellipse
       style="display:none;opacity:1;fill:none;fill-opacity:1;fill-rule:evenodd;stroke:#000000;stroke-width:0.342886;stroke-linecap:round;stroke-miterlimit:4;stroke-dasharray:none"
       id="ellipse21662"
       cx="84.54245"
       cy="77.052086"
       rx="10.906842"
       ry="10.906843" />
    <rect
       style="opacity:1;fill:#ffb400;fill-opacity:1;fill-rule:evenodd;stroke:none;stroke-width:0.999998;stroke-linecap:square;stroke-linejoin:miter;stroke-miterlimit:4;stroke-dasharray:none;paint-order:fill markers stroke"
       id="rect36707"
       width="29.353258"
       height="17.980961"
       x="91.250015"
       y="32.594559" />
    <ellipse
       style="opacity:1;fill:#ffb400;fill-opacity:1;fill-rule:evenodd;stroke:#000000;stroke-width:2;stroke-linejoin:round;stroke-miterlimit:4;stroke-dasharray:none;paint-order:fill markers stroke"
       id="path33658-6"
       cx="105.93951"
       cy="32.615292"
       rx="14.689488"
       ry="2.2975867" />
    <path
       style="opacity:1;fill:#ffb400;fill-opacity:1;fill-rule:evenodd;stroke:#000000;stroke-width:2;stroke-linecap:round;stroke-linejoin:round;stroke-miterlimit:4;stroke-dasharray:none;paint-order:fill markers stroke"
       id="path33658-6-3"
       sodipodi:type="arc"
       sodipodi:cx="105.93951"
       sodipodi:cy="50.120552"
       sodipodi:rx="14.689488"
       sodipodi:ry="2.2975867"
       sodipodi:start="0"
       sodipodi:end="3.14159"
       sodipodi:open="true"
       sodipodi:arc-type="arc"
       d="M 120.62899,50.120552 A 14.689488,2.2975867 0 0 1 105.93953,52.418139 14.689488,2.2975867 0 0 1 91.250018,50.120558" />
    <path
       style="fill:#000000;fill-opacity:1;fill-rule:evenodd;stroke:#000000;stroke-width:0.0676184;stroke-linejoin:round;stroke-miterlimit:4;stroke-dasharray:none;paint-order:fill markers stroke"
       id="path33658-6-1"
       transform="scale(1,-1)"
       sodipodi:type="arc"
       sodipodi:cx="115.59175"
       sodipodi:cy="-32.619629"
       sodipodi:rx="1.4661791"
       sodipodi:ry="0.34581798"
       sodipodi:start="3.14159"
       sodipodi:end="0"
       sodipodi:arc-type="arc"
       sodipodi:open="true"
       d="m 114.12557,-32.619628 a 1.4661791,0.34581798 0 0 1 0.73309,-0.299488 1.4661791,0.34581798 0 0 1 1.46618,0 1.4661791,0.34581798 0 0 1 0.73309,0.299487" />
    <path
       style="fill:#000000;fill-opacity:1;fill-rule:evenodd;stroke:#000000;stroke-width:0.0676184;stroke-linejoin:round;stroke-miterlimit:4;stroke-dasharray:none;paint-order:fill markers stroke"
       id="path33658-6-1-8"
       transform="scale(1,-1)"
       sodipodi:type="arc"
       sodipodi:cx="95.296738"
       sodipodi:cy="-26.210974"
       sodipodi:rx="1.4658673"
       sodipodi:ry="0.34596381"
       sodipodi:start="2.7019168"
       sodipodi:end="0.24532235"
       sodipodi:arc-type="arc"
       sodipodi:open="true"
       d="m 93.970289,-26.063716 a 1.4658673,0.34596381 0 0 1 0.34352,-0.403918 1.4658673,0.34596381 0 0 1 1.737323,-0.03997 1.4658673,0.34596381 0 0 1 0.667584,0.380655" />
    <path
       style="opacity:1;fill:none;fill-opacity:1;fill-rule:evenodd;stroke:#000000;stroke-width:3;stroke-linecap:square;stroke-linejoin:round;stroke-miterlimit:4;stroke-dasharray:none;paint-order:fill markers stroke"
       id="path35951"
       sodipodi:type="arc"
       sodipodi:cx="105.44373"
       sodipodi:cy="24.708561"
       sodipodi:rx="10.145593"
       sodipodi:ry="12.150625"
       sodipodi:start="3.1418486"
       sodipodi:end="6.2818722"
       sodipodi:open="true"
       sodipodi:arc-type="arc"
       d="M 95.298141,24.705451 A 10.145593,12.150625 0 0 1 105.43837,12.557937 10.145593,12.150625 0 0 1 115.58932,24.692606" />
    <path
       style="fill:none;stroke:#000000;stroke-width:3;stroke-linecap:square;stroke-linejoin:miter;stroke-miterlimit:4;stroke-dasharray:none;stroke-opacity:1"
       d="m 115.59128,26.777814 v 4.356111"
       id="path36286" />
    <path
       style="fill:none;stroke:#000000;stroke-width:2;stroke-linecap:butt;stroke-linejoin:miter;stroke-miterlimit:4;stroke-dasharray:none;stroke-opacity:1"
       d="m 91.250034,32.594568 v 17.52599"
       id="path37400" />
    <path
       style="fill:none;stroke:#000000;stroke-width:2;stroke-linecap:butt;stroke-linejoin:miter;stroke-miterlimit:4;stroke-dasharray:none;stroke-opacity:1"
       d="m 120.62915,32.577558 v 17.52599"
       id="path37400-1" />
  </g>
</svg>
