<?xml version="1.0" encoding="UTF-8" standalone="no"?>
<!-- Created with Inkscape (http://www.inkscape.org/) -->

<svg
   width="256"
   height="256"
   viewBox="0 0 67.733333 67.733335"
   version="1.1"
   id="svg5"
   inkscape:export-filename="/mnt/C06A8F4B6A8F3D62/Programming/GraphViewer/logo48.png"
   inkscape:export-xdpi="18.000002"
   inkscape:export-ydpi="18.000002"
   inkscape:version="1.1.2 (08b2f3d93c, 2022-04-05)"
   sodipodi:docname="logo.svg"
   xmlns:inkscape="http://www.inkscape.org/namespaces/inkscape"
   xmlns:sodipodi="http://sodipodi.sourceforge.net/DTD/sodipodi-0.dtd"
   xmlns="http://www.w3.org/2000/svg"
   xmlns:svg="http://www.w3.org/2000/svg">
  <sodipodi:namedview
     id="namedview7"
     pagecolor="#ffffff"
     bordercolor="#666666"
     borderopacity="1.0"
     inkscape:pageshadow="2"
     inkscape:pageopacity="0.0"
     inkscape:pagecheckerboard="0"
     inkscape:document-units="mm"
     showgrid="false"
     fit-margin-top="0"
     fit-margin-left="0"
     fit-margin-right="0"
     fit-margin-bottom="0"
     units="px"
     width="256px"
     inkscape:zoom="0.64052328"
     inkscape:cx="1229.4635"
     inkscape:cy="-47.617317"
     inkscape:window-width="2488"
     inkscape:window-height="1376"
     inkscape:window-x="72"
     inkscape:window-y="27"
     inkscape:window-maximized="1"
     inkscape:current-layer="layer1" />
  <defs
     id="defs2" />
  <g
     inkscape:label="Layer 1"
     inkscape:groupmode="layer"
     id="layer1"
     transform="translate(-93.824734,-92.23714)">
    <g
       id="g7800"
       style="stroke-width:3.96875;stroke-miterlimit:4;stroke-dasharray:none">
      <path
         style="fill:none;stroke:#ff7f0e;stroke-width:3.96875;stroke-linecap:round;stroke-linejoin:miter;stroke-miterlimit:4;stroke-dasharray:none;stroke-opacity:1"
         d="m 87.14429,148.4718 c 15.38157,0.32096 23.08072,2.41123 31.0229,-20.16772 1.31397,-3.73549 4.38219,-16.33298 9.41357,-16.33298"
         id="path869"
         sodipodi:nodetypes="csc" />
      <path
         style="fill:none;stroke:#ff7f0e;stroke-width:3.96875;stroke-linecap:round;stroke-linejoin:miter;stroke-miterlimit:4;stroke-dasharray:none;stroke-opacity:1"
         d="m 168.01723,148.4718 c -15.38157,0.32096 -23.08072,2.41123 -31.0229,-20.16772 -1.31397,-3.73549 -4.38219,-16.33298 -9.41357,-16.33298"
         id="path869-7"
         sodipodi:nodetypes="csc" />
    </g>
    <path
       style="fill:none;stroke:#2ca02c;stroke-width:3.96875;stroke-linecap:round;stroke-linejoin:miter;stroke-miterlimit:4;stroke-dasharray:none;stroke-opacity:1"
       d="m 98.175596,163.15375 c 0.61783,-9.23423 4.504194,-42.65003 13.355264,-42.65003 8.73355,0 12.96285,24.80691 21.60523,24.80691 9.29785,0 12.57899,-29.64383 14.12942,-46.209464"
       id="path2780"
       sodipodi:nodetypes="cccc" />
  </g>
</svg>
