<?xml version="1.0" ?>
<robot name="Tesla Webots">
    <webots>
        <device reference="gps" type="GPS">
            <ros>
                <enabled>true</enabled>
                <alwaysOn>true</alwaysOn>
            </ros>
        </device>

        <plugin type="acc_control.tesla_driver.TeslaDriver">
            <vehicle>TeslaModel3</vehicle>
        </plugin>
    </webots>
</robot>
