0.0	 0j
0.01	 0j
0.02	 0j
0.03	 0j
0.04	 0j
0.05	 0j
0.06	 0j
0.07	 0j
0.08	 0j
0.09	 0j
0.1	 0j
0.11	 0j
0.12	 0j
0.13	 0j
0.14	 0j
0.15	 0j
0.16	 0j
0.17	 0j
0.18	 0j
0.19	 0j
0.2	 0j
0.21	 0j
0.22	 0j
0.23	 0j
0.24	 0j
0.25	 0j
0.26	 0j
0.27	 0j
0.28	 0j
0.29	 0j
0.3	 0j
0.31	 0j
0.32	 0j
0.33	 0j
0.34	 0j
0.35000000000000003	 0j
0.36	 0j
0.37	 0j
0.38	 0j
0.39	 0j
0.4	 0j
0.41000000000000003	 0j
0.42	 0j
0.43	 0j
0.44	 0j
0.45	 0j
0.46	 0j
0.47000000000000003	 0j
0.48	 0j
0.49	 0j
0.5	 0j
0.51	 0j
0.52	 0j
0.53	 0j
0.54	 0j
0.55	 0j
0.56	 0j
0.5700000000000001	 0j
0.58	 0j
0.59	 0j
0.6	 0j
0.61	 0j
0.62	 0j
0.63	 0j
0.64	 0j
0.65	 0j
0.66	 0j
0.67	 0j
0.68	 0j
0.6900000000000001	 0j
0.7000000000000001	 0j
0.71	 0j
0.72	 0j
0.73	 0j
0.74	 0j
0.75	 0j
0.76	 0j
0.77	 0j
0.78	 0j
0.79	 0j
0.8	 0j
0.81	 0j
0.8200000000000001	 0j
0.8300000000000001	 0j
0.84	 0j
0.85	 0j
0.86	 0j
0.87	 0j
0.88	 0j
0.89	 0j
0.9	 0j
0.91	 0j
0.92	 0j
0.93	 0j
0.9400000000000001	 0j
0.9500000000000001	 0j
0.96	 0j
0.97	 0j
0.98	 0j
0.99	 0j
1.0	 0j
1.01	 0j
1.02	 0j
1.03	 0j
1.04	 0j
1.05	 0j
1.06	 0j
1.07	 0j
1.08	 0j
1.09	 0j
1.1	 0j
1.11	 0j
1.12	 0j
1.1300000000000001	 0j
1.1400000000000001	 0j
1.1500000000000001	 0j
1.16	 0j
1.17	 0j
1.18	 0j
1.19	 0j
1.2	 0j
1.21	 0j
1.22	 0j
1.23	 0j
1.24	 0j
1.25	 0j
1.26	 0j
1.27	 0j
1.28	 0j
1.29	 0j
1.3	 0j
1.31	 0j
1.32	 0j
1.33	 0j
1.34	 0j
1.35	 0j
1.36	 0j
1.37	 0j
1.3800000000000001	 0j
1.3900000000000001	 0j
1.4000000000000001	 0j
1.41	 0j
1.42	 0j
1.43	 0j
1.44	 0j
1.45	 0j
1.46	 0j
1.47	 0j
1.48	 0j
1.49	 0j
1.5	 0j
1.51	 0j
1.52	 0j
1.53	 0j
1.54	 0j
1.55	 0j
1.56	 0j
1.57	 0j
1.58	 0j
1.59	 0j
1.6	 0j
1.61	 0j
1.62	 0j
1.6300000000000001	 0j
1.6400000000000001	 0j
1.6500000000000001	 0j
1.6600000000000001	 0j
1.67	 0j
1.68	 0j
1.69	 0j
1.7	 0j
1.71	 0j
1.72	 0j
1.73	 0j
1.74	 0j
1.75	 0j
1.76	 0j
1.77	 0j
1.78	 0j
1.79	 0j
1.8	 0j
1.81	 0j
1.82	 0j
1.83	 0j
1.84	 0j
1.85	 0j
1.86	 0j
1.87	 0j
1.8800000000000001	 0j
1.8900000000000001	 0j
1.9000000000000001	 0j
1.9100000000000001	 0j
1.92	 0j
1.93	 0j
1.94	 0j
1.95	 0j
1.96	 0j
1.97	 0j
1.98	 0j
1.99	 0j
2.0	 0j
2.0100000000000002	 0j
2.02	 0j
2.0300000000000002	 0j
2.04	 0j
2.05	 0j
2.06	 0j
2.07	 0j
2.08	 0j
2.09	 0j
2.1	 0j
2.11	 0j
2.12	 0j
2.13	 0j
2.14	 0j
2.15	 0j
2.16	 0j
2.17	 0j
2.18	 0j
2.19	 0j
2.2	 0j
2.21	 0j
2.22	 0j
2.23	 0j
2.24	 0j
2.25	 0j
2.2600000000000002	 0j
2.27	 0j
2.2800000000000002	 0j
2.29	 0j
2.3000000000000003	 0j
2.31	 0j
2.32	 0j
2.33	 0j
2.34	 0j
2.35	 0j
2.36	 0j
2.37	 0j
2.38	 0j
2.39	 0j
2.4	 0j
2.41	 0j
2.42	 0j
2.43	 0j
2.44	 0j
2.45	 0j
2.46	 0j
2.47	 0j
2.48	 0j
2.49	 0j
2.5	 0j
2.5100000000000002	 0j
2.52	 0j
2.5300000000000002	 0j
2.54	 0j
2.5500000000000003	 0j
2.56	 0j
2.57	 0j
2.58	 0j
2.59	 0j
2.6	 0j
2.61	 0j
2.62	 0j
2.63	 0j
2.64	 0j
2.65	 0j
2.66	 0j
2.67	 0j
2.68	 0j
2.69	 0j
2.7	 0j
2.71	 0j
2.72	 0j
2.73	 0j
2.74	 0j
2.75	 0j
2.7600000000000002	 0j
2.77	 0j
2.7800000000000002	 0j
2.79	 0j
2.8000000000000003	 0j
2.81	 0j
2.82	 0j
2.83	 0j
2.84	 0j
2.85	 0j
2.86	 0j
2.87	 0j
2.88	 0j
2.89	 0j
2.9	 0j
2.91	 0j
2.92	 0j
2.93	 0j
2.94	 0j
2.95	 0j
2.96	 0j
2.97	 0j
2.98	 0j
2.99	 0j
3.0	 0j
3.0100000000000002	 0j
3.02	 0j
3.0300000000000002	 0j
3.04	 0j
3.0500000000000003	 0j
3.06	 0j
3.0700000000000003	 0j
3.08	 0j
3.09	 0j
3.1	 0j
3.11	 0j
3.12	 0j
3.13	 0j
3.14	 0j
3.15	 0j
3.16	 0j
3.17	 0j
3.18	 0j
3.19	 0j
3.2	 0j
3.21	 0j
3.22	 0j
3.23	 0j
3.24	 0j
3.25	 0j
3.2600000000000002	 0j
3.27	 0j
3.2800000000000002	 0j
3.29	 0j
3.3000000000000003	 0j
3.31	 0j
3.3200000000000003	 0j
3.33	 0j
3.34	 0j
3.35	 0j
3.36	 0j
3.37	 0j
3.38	 0j
3.39	 0j
3.4	 0j
3.41	 0j
3.42	 0j
3.43	 0j
3.44	 0j
3.45	 0j
3.46	 0j
3.47	 0j
3.48	 0j
3.49	 0j
3.5	 0j
3.5100000000000002	 0j
3.52	 0j
3.5300000000000002	 0j
3.54	 0j
3.5500000000000003	 0j
3.56	 0j
3.5700000000000003	 0j
3.58	 0j
3.59	 0j
3.6	 0j
3.61	 0j
3.62	 0j
3.63	 0j
3.64	 0j
3.65	 0j
3.66	 0j
3.67	 0j
3.68	 0j
3.69	 0j
3.7	 0j
3.71	 0j
3.72	 0j
3.73	 0j
3.74	 0j
3.75	 0j
3.7600000000000002	 0j
3.77	 0j
3.7800000000000002	 0j
3.79	 0j
3.8000000000000003	 0j
3.81	 0j
3.8200000000000003	 0j
3.83	 0j
3.84	 0j
3.85	 0j
3.86	 0j
3.87	 0j
3.88	 0j
3.89	 0j
3.9	 0j
3.91	 0j
3.92	 0j
3.93	 0j
3.94	 0j
3.95	 0j
3.96	 0j
3.97	 0j
3.98	 0j
3.99	 0j
4.0	 0j
4.01	 0j
4.0200000000000005	 0j
4.03	 0j
4.04	 0j
4.05	 0j
4.0600000000000005	 0j
4.07	 0j
4.08	 0j
4.09	 0j
4.1	 0j
4.11	 0j
4.12	 0j
4.13	 0j
4.14	 0j
4.15	 0j
4.16	 0j
4.17	 0j
4.18	 0j
4.19	 0j
4.2	 0j
4.21	 0j
4.22	 0j
4.23	 0j
4.24	 0j
4.25	 0j
4.26	 0j
4.2700000000000005	 0j
4.28	 0j
4.29	 0j
4.3	 0j
4.3100000000000005	 0j
4.32	 0j
4.33	 0j
4.34	 0j
4.3500000000000005	 0j
4.36	 0j
4.37	 0j
4.38	 0j
4.39	 0j
4.4	 0j
4.41	 0j
4.42	 0j
4.43	 0j
4.44	 0j
4.45	 0j
4.46	 0j
4.47	 0j
4.48	 0j
4.49	 0j
4.5	 0j
4.51	 0j
4.5200000000000005	 0j
4.53	 0j
4.54	 0j
4.55	 0j
4.5600000000000005	 0j
4.57	 0j
4.58	 0j
4.59	 0j
4.6000000000000005	 0j
4.61	 0j
4.62	 0j
4.63	 0j
4.64	 0j
4.65	 0j
4.66	 0j
4.67	 0j
4.68	 0j
4.69	 0j
4.7	 0j
4.71	 0j
4.72	 0j
4.73	 0j
4.74	 0j
4.75	 0j
4.76	 0j
4.7700000000000005	 0j
4.78	 0j
4.79	 0j
4.8	 0j
4.8100000000000005	 0j
4.82	 0j
4.83	 0j
4.84	 0j
4.8500000000000005	 0j
4.86	 0j
4.87	 0j
4.88	 0j
4.89	 0j
4.9	 0j
4.91	 0j
4.92	 0j
4.93	 0j
4.94	 0j
4.95	 0j
4.96	 0j
4.97	 0j
4.98	 0j
4.99	 0j
5.0	 0j
5.01	 0j
5.0200000000000005	 0j
5.03	 0j
5.04	 0j
5.05	 0j
5.0600000000000005	 0j
5.07	 0j
5.08	 0j
5.09	 0j
5.1000000000000005	 0j
5.11	 0j
5.12	 0j
5.13	 0j
5.14	 0j
5.15	 0j
5.16	 0j
5.17	 0j
5.18	 0j
5.19	 0j
5.2	 0j
5.21	 0j
5.22	 0j
5.23	 0j
5.24	 0j
5.25	 0j
5.26	 0j
5.2700000000000005	 0j
5.28	 0j
5.29	 0j
5.3	 0j
5.3100000000000005	 0j
5.32	 0j
5.33	 0j
5.34	 0j
5.3500000000000005	 0j
5.36	 0j
5.37	 0j
5.38	 0j
5.39	 0j
5.4	 0j
5.41	 0j
5.42	 0j
5.43	 0j
5.44	 0j
5.45	 0j
5.46	 0j
5.47	 0j
5.48	 0j
5.49	 0j
5.5	 0j
5.51	 0j
5.5200000000000005	 0j
5.53	 0j
5.54	 0j
5.55	 0j
5.5600000000000005	 0j
5.57	 0j
5.58	 0j
5.59	 0j
5.6000000000000005	 0j
5.61	 0j
5.62	 0j
5.63	 0j
5.64	 0j
5.65	 0j
5.66	 0j
5.67	 0j
5.68	 0j
5.69	 0j
5.7	 0j
5.71	 0j
5.72	 0j
5.73	 0j
5.74	 0j
5.75	 0j
5.76	 0j
5.7700000000000005	 0j
5.78	 0j
5.79	 0j
5.8	 0j
5.8100000000000005	 0j
5.82	 0j
5.83	 0j
5.84	 0j
5.8500000000000005	 0j
5.86	 0j
5.87	 0j
5.88	 0j
5.89	 0j
5.9	 0j
5.91	 0j
5.92	 0j
5.93	 0j
5.94	 0j
5.95	 0j
5.96	 0j
5.97	 0j
5.98	 0j
5.99	 0j
6.0	 0j
6.01	 0j
6.0200000000000005	 0j
6.03	 0j
6.04	 0j
6.05	 0j
6.0600000000000005	 0j
6.07	 0j
6.08	 0j
6.09	 0j
6.1000000000000005	 0j
6.11	 0j
6.12	 0j
6.13	 0j
6.140000000000001	 0j
6.15	 0j
6.16	 0j
6.17	 0j
6.18	 0j
6.19	 0j
6.2	 0j
6.21	 0j
6.22	 0j
6.23	 0j
6.24	 0j
6.25	 0j
6.26	 0j
6.2700000000000005	 0j
6.28	 0j
6.29	 0j
6.3	 0j
6.3100000000000005	 0j
6.32	 0j
6.33	 0j
6.34	 0j
6.3500000000000005	 0j
6.36	 0j
6.37	 0j
6.38	 0j
6.390000000000001	 0j
6.4	 0j
6.41	 0j
6.42	 0j
6.43	 0j
6.44	 0j
6.45	 0j
6.46	 0j
6.47	 0j
6.48	 0j
6.49	 0j
6.5	 0j
6.51	 0j
6.5200000000000005	 0j
6.53	 0j
6.54	 0j
6.55	 0j
6.5600000000000005	 0j
6.57	 0j
6.58	 0j
6.59	 0j
6.6000000000000005	 0j
6.61	 0j
6.62	 0j
6.63	 0j
6.640000000000001	 0j
6.65	 0j
6.66	 0j
6.67	 0j
6.68	 0j
6.69	 0j
6.7	 0j
6.71	 0j
6.72	 0j
6.73	 0j
6.74	 0j
6.75	 0j
6.76	 0j
6.7700000000000005	 0j
6.78	 0j
6.79	 0j
6.8	 0j
6.8100000000000005	 0j
6.82	 0j
6.83	 0j
6.84	 0j
6.8500000000000005	 0j
6.86	 0j
6.87	 0j
6.88	 0j
6.890000000000001	 0j
6.9	 0j
6.91	 0j
6.92	 0j
6.93	 0j
6.94	 0j
6.95	 0j
6.96	 0j
6.97	 0j
6.98	 0j
6.99	 0j
7.0	 0j
7.01	 0j
7.0200000000000005	 0j
7.03	 0j
7.04	 0j
7.05	 0j
7.0600000000000005	 0j
7.07	 0j
7.08	 0j
7.09	 0j
7.1000000000000005	 0j
7.11	 0j
7.12	 0j
7.13	 0j
7.140000000000001	 0j
7.15	 0j
7.16	 0j
7.17	 0j
7.18	 0j
7.19	 0j
7.2	 0j
7.21	 0j
7.22	 0j
7.23	 0j
7.24	 0j
7.25	 0j
7.26	 0j
7.2700000000000005	 0j
7.28	 0j
7.29	 0j
7.3	 0j
7.3100000000000005	 0j
7.32	 0j
7.33	 0j
7.34	 0j
7.3500000000000005	 0j
7.36	 0j
7.37	 0j
7.38	 0j
7.390000000000001	 0j
7.4	 0j
7.41	 0j
7.42	 0j
7.43	 0j
7.44	 0j
7.45	 0j
7.46	 0j
7.47	 0j
7.48	 0j
7.49	 0j
7.5	 0j
7.51	 0j
7.5200000000000005	 0j
7.53	 0j
7.54	 0j
7.55	 0j
7.5600000000000005	 0j
7.57	 0j
7.58	 0j
7.59	 0j
7.6000000000000005	 0j
7.61	 0j
7.62	 0j
7.63	 0j
7.640000000000001	 0j
7.65	 0j
7.66	 0j
7.67	 0j
7.68	 0j
7.69	 0j
7.7	 0j
7.71	 0j
7.72	 0j
7.73	 0j
7.74	 0j
7.75	 0j
7.76	 0j
7.7700000000000005	 0j
7.78	 0j
7.79	 0j
7.8	 0j
7.8100000000000005	 0j
7.82	 0j
7.83	 0j
7.84	 0j
7.8500000000000005	 0j
7.86	 0j
7.87	 0j
7.88	 0j
7.890000000000001	 0j
7.9	 0j
7.91	 0j
7.92	 0j
7.930000000000001	 0j
7.94	 0j
7.95	 0j
7.96	 0j
7.97	 0j
7.98	 0j
7.99	 0j
8.0	 0j
8.01	 0j
8.02	 0j
8.03	 0j
8.040000000000001	 0j
8.05	 0j
8.06	 0j
8.07	 0j
8.08	 0j
8.09	 0j
8.1	 0j
8.11	 0j
8.120000000000001	 0j
8.13	 0j
8.14	 0j
8.15	 0j
8.16	 0j
8.17	 0j
8.18	 0j
8.19	 0j
8.2	 0j
8.21	 0j
8.22	 0j
8.23	 0j
8.24	 0j
8.25	 0j
8.26	 0j
8.27	 0j
8.28	 0j
8.290000000000001	 0j
8.3	 0j
8.31	 0j
8.32	 0j
8.33	 0j
8.34	 0j
8.35	 0j
8.36	 0j
8.370000000000001	 0j
8.38	 0j
8.39	 0j
8.4	 0j
8.41	 0j
8.42	 0j
8.43	 0j
8.44	 0j
8.45	 0j
8.46	 0j
8.47	 0j
8.48	 0j
8.49	 0j
8.5	 0j
8.51	 0j
8.52	 0j
8.53	 0j
8.540000000000001	 0j
8.55	 0j
8.56	 0j
8.57	 0j
8.58	 0j
8.59	 0j
8.6	 0j
8.61	 0j
8.620000000000001	 0j
8.63	 0j
8.64	 0j
8.65	 0j
8.66	 0j
8.67	 0j
8.68	 0j
8.69	 0j
8.700000000000001	 0j
8.71	 0j
8.72	 0j
8.73	 0j
8.74	 0j
8.75	 0j
8.76	 0j
8.77	 0j
8.78	 0j
8.790000000000001	 0j
8.8	 0j
8.81	 0j
8.82	 0j
8.83	 0j
8.84	 0j
8.85	 0j
8.86	 0j
8.870000000000001	 0j
8.88	 0j
8.89	 0j
8.9	 0j
8.91	 0j
8.92	 0j
8.93	 0j
8.94	 0j
8.950000000000001	 0j
8.96	 0j
8.97	 0j
8.98	 0j
8.99	 0j
9.0	 0j
9.01	 0j
9.02	 0j
9.03	 0j
9.040000000000001	 0j
9.05	 0j
9.06	 0j
9.07	 0j
9.08	 0j
9.09	 0j
9.1	 0j
9.11	 0j
9.120000000000001	 0j
9.13	 0j
9.14	 0j
9.15	 0j
9.16	 0j
9.17	 0j
9.18	 0j
9.19	 0j
9.200000000000001	 0j
9.21	 0j
9.22	 0j
9.23	 0j
9.24	 0j
9.25	 0j
9.26	 0j
9.27	 0j
9.28	 0j
9.290000000000001	 0j
9.3	 0j
9.31	 0j
9.32	 0j
9.33	 0j
9.34	 0j
9.35	 0j
9.36	 0j
9.370000000000001	 0j
9.38	 0j
9.39	 0j
9.4	 0j
9.41	 0j
9.42	 0j
9.43	 0j
9.44	 0j
9.450000000000001	 0j
9.46	 0j
9.47	 0j
9.48	 0j
9.49	 0j
9.5	 0j
9.51	 0j
9.52	 0j
9.53	 0j
9.540000000000001	 0j
9.55	 0j
9.56	 0j
9.57	 0j
9.58	 0j
9.59	 0j
9.6	 0j
9.61	 0j
9.620000000000001	 0j
9.63	 0j
9.64	 0j
9.65	 0j
9.66	 0j
9.67	 0j
9.68	 0j
9.69	 0j
9.700000000000001	 0j
9.71	 0j
9.72	 0j
9.73	 0j
9.74	 0j
9.75	 0j
9.76	 0j
9.77	 0j
9.78	 0j
9.790000000000001	 0j
9.8	 0j
9.81	 0j
9.82	 0j
9.83	 0j
9.84	 0j
9.85	 0j
9.86	 0j
9.870000000000001	 0j
9.88	 0j
9.89	 0j
9.9	 0j
9.91	 0j
9.92	 0j
9.93	 0j
9.94	 0j
9.950000000000001	 0j
9.96	 0j
9.97	 0j
9.98	 0j
9.99	 0j
10.0	 0j
10.01	 0j
10.02	 0j
10.03	 0j
10.040000000000001	 0j
10.05	 0j
10.06	 0j
10.07	 0j
10.08	 0j
10.09	 0j
10.1	 0j
10.11	 0j
10.120000000000001	 0j
10.13	 0j
10.14	 0j
10.15	 0j
10.16	 0j
10.17	 0j
10.18	 0j
10.19	 0j
10.200000000000001	 0j
10.21	 0j
10.22	 0j
10.23	 0j
10.24	 0j
10.25	 0j
10.26	 0j
10.27	 0j
10.28	 0j
10.290000000000001	 0j
10.3	 0j
10.31	 0j
10.32	 0j
10.33	 0j
10.34	 0j
10.35	 0j
10.36	 0j
10.370000000000001	 0j
10.38	 0j
10.39	 0j
10.4	 0j
10.41	 0j
10.42	 0j
10.43	 0j
10.44	 0j
10.450000000000001	 0j
10.46	 0j
10.47	 0j
10.48	 0j
10.49	 0j
10.5	 0j
10.51	 0j
10.52	 0j
10.53	 0j
10.540000000000001	 0j
10.55	 0j
10.56	 0j
10.57	 0j
10.58	 0j
10.59	 0j
10.6	 0j
10.61	 0j
10.620000000000001	 0j
10.63	 0j
10.64	 0j
10.65	 0j
10.66	 0j
10.67	 0j
10.68	 0j
10.69	 0j
10.700000000000001	 0j
10.71	 0j
10.72	 0j
10.73	 0j
10.74	 0j
10.75	 0j
10.76	 0j
10.77	 0j
10.78	 0j
10.790000000000001	 0j
10.8	 0j
10.81	 0j
10.82	 0j
10.83	 0j
10.84	 0j
10.85	 0j
10.86	 0j
10.870000000000001	 0j
10.88	 0j
10.89	 0j
10.9	 0j
10.91	 0j
10.92	 0j
10.93	 0j
10.94	 0j
10.950000000000001	 0j
10.96	 0j
10.97	 0j
10.98	 0j
10.99	 0j
11.0	 0j
11.01	 0j
11.02	 0j
11.03	 0j
11.040000000000001	 0j
11.05	 0j
11.06	 0j
11.07	 0j
11.08	 0j
11.09	 0j
11.1	 0j
11.11	 0j
11.120000000000001	 0j
11.13	 0j
11.14	 0j
11.15	 0j
11.16	 0j
11.17	 0j
11.18	 0j
11.19	 0j
11.200000000000001	 0j
11.21	 0j
11.22	 0j
11.23	 0j
11.24	 0j
11.25	 0j
11.26	 0j
11.27	 0j
11.28	 0j
11.290000000000001	 0j
11.3	 0j
11.31	 0j
11.32	 0j
11.33	 0j
11.34	 0j
11.35	 0j
11.36	 0j
11.370000000000001	 0j
11.38	 0j
11.39	 0j
11.4	 0j
11.41	 0j
11.42	 0j
11.43	 0j
11.44	 0j
11.450000000000001	 0j
11.46	 0j
11.47	 0j
11.48	 0j
11.49	 0j
11.5	 0j
11.51	 0j
11.52	 0j
11.53	 0j
11.540000000000001	 0j
11.55	 0j
11.56	 0j
11.57	 0j
11.58	 0j
11.59	 0j
11.6	 0j
11.61	 0j
11.620000000000001	 0j
11.63	 0j
11.64	 0j
11.65	 0j
11.66	 0j
11.67	 0j
11.68	 0j
11.69	 0j
11.700000000000001	 0j
11.71	 0j
11.72	 0j
11.73	 0j
11.74	 0j
11.75	 0j
11.76	 0j
11.77	 0j
11.78	 0j
11.790000000000001	 0j
11.8	 0j
11.81	 0j
11.82	 0j
11.83	 0j
11.84	 0j
11.85	 0j
11.86	 0j
11.870000000000001	 0j
11.88	 0j
11.89	 0j
11.9	 0j
11.91	 0j
11.92	 0j
11.93	 0j
11.94	 0j
11.950000000000001	 0j
11.96	 0j
11.97	 0j
11.98	 0j
11.99	 0j
12.0	 0j
12.01	 0j
12.02	 0j
12.030000000000001	 0j
12.040000000000001	 0j
12.05	 0j
12.06	 0j
12.07	 0j
12.08	 0j
12.09	 0j
12.1	 0j
12.11	 0j
12.120000000000001	 0j
12.13	 0j
12.14	 0j
12.15	 0j
12.16	 0j
12.17	 0j
12.18	 0j
12.19	 0j
12.200000000000001	 0j
12.21	 0j
12.22	 0j
12.23	 0j
12.24	 0j
12.25	 0j
12.26	 0j
12.27	 0j
12.280000000000001	 0j
12.290000000000001	 0j
12.3	 0j
12.31	 0j
12.32	 0j
12.33	 0j
12.34	 0j
12.35	 0j
12.36	 0j
12.370000000000001	 0j
12.38	 0j
12.39	 0j
12.4	 0j
12.41	 0j
12.42	 0j
12.43	 0j
12.44	 0j
12.450000000000001	 0j
12.46	 0j
12.47	 0j
12.48	 0j
12.49	 0j
12.5	 0j
12.51	 0j
12.52	 0j
12.530000000000001	 0j
12.540000000000001	 0j
12.55	 0j
12.56	 0j
12.57	 0j
12.58	 0j
12.59	 0j
12.6	 0j
12.61	 0j
12.620000000000001	 0j
12.63	 0j
12.64	 0j
12.65	 0j
12.66	 0j
12.67	 0j
12.68	 0j
12.69	 0j
12.700000000000001	 0j
12.71	 0j
12.72	 0j
12.73	 0j
12.74	 0j
12.75	 0j
12.76	 0j
12.77	 0j
12.780000000000001	 0j
12.790000000000001	 0j
12.8	 0j
12.81	 0j
12.82	 0j
12.83	 0j
12.84	 0j
12.85	 0j
12.86	 0j
12.870000000000001	 0j
12.88	 0j
12.89	 0j
12.9	 0j
12.91	 0j
12.92	 0j
12.93	 0j
12.94	 0j
12.950000000000001	 0j
12.96	 0j
12.97	 0j
12.98	 0j
12.99	 0j
13.0	 0j
13.01	 0j
13.02	 0j
13.030000000000001	 0j
13.040000000000001	 0j
13.05	 0j
13.06	 0j
13.07	 0j
13.08	 0j
13.09	 0j
13.1	 0j
13.11	 0j
13.120000000000001	 0j
13.13	 0j
13.14	 0j
13.15	 0j
13.16	 0j
13.17	 0j
13.18	 0j
13.19	 0j
13.200000000000001	 0j
13.21	 0j
13.22	 0j
13.23	 0j
13.24	 0j
13.25	 0j
13.26	 0j
13.27	 0j
13.280000000000001	 0j
13.290000000000001	 0j
13.3	 0j
13.31	 0j
13.32	 0j
13.33	 0j
13.34	 0j
13.35	 0j
13.36	 0j
13.370000000000001	 0j
13.38	 0j
13.39	 0j
13.4	 0j
13.41	 0j
13.42	 0j
13.43	 0j
13.44	 0j
13.450000000000001	 0j
13.46	 0j
13.47	 0j
13.48	 0j
13.49	 0j
13.5	 0j
13.51	 0j
13.52	 0j
13.530000000000001	 0j
13.540000000000001	 0j
13.55	 0j
13.56	 0j
13.57	 0j
13.58	 0j
13.59	 0j
13.6	 0j
13.61	 0j
13.620000000000001	 0j
13.63	 0j
13.64	 0j
13.65	 0j
13.66	 0j
13.67	 0j
13.68	 0j
13.69	 0j
13.700000000000001	 0j
13.71	 0j
13.72	 0j
13.73	 0j
13.74	 0j
13.75	 0j
13.76	 0j
13.77	 0j
13.780000000000001	 0j
13.790000000000001	 0j
13.8	 0j
13.81	 0j
13.82	 0j
13.83	 0j
13.84	 0j
13.85	 0j
13.86	 0j
13.870000000000001	 0j
13.88	 0j
13.89	 0j
13.9	 0j
13.91	 0j
13.92	 0j
13.93	 0j
13.94	 0j
13.950000000000001	 0j
13.96	 0j
13.97	 0j
13.98	 0j
13.99	 0j
14.0	 0j
14.01	 0j
14.02	 0j
14.030000000000001	 0j
14.040000000000001	 0j
14.05	 0j
14.06	 0j
14.07	 0j
14.08	 0j
14.09	 0j
14.1	 0j
14.11	 0j
14.120000000000001	 0j
14.13	 0j
14.14	 0j
14.15	 0j
14.16	 0j
14.17	 0j
14.18	 0j
14.19	 0j
14.200000000000001	 0j
14.21	 0j
14.22	 0j
14.23	 0j
14.24	 0j
14.25	 0j
14.26	 0j
14.27	 0j
14.280000000000001	 0j
14.290000000000001	 0j
14.3	 0j
14.31	 0j
14.32	 0j
14.33	 0j
14.34	 0j
14.35	 0j
14.36	 0j
14.370000000000001	 0j
14.38	 0j
14.39	 0j
14.4	 0j
14.41	 0j
14.42	 0j
14.43	 0j
14.44	 0j
14.450000000000001	 0j
14.46	 0j
14.47	 0j
14.48	 0j
14.49	 0j
14.5	 0j
14.51	 0j
14.52	 0j
14.530000000000001	 0j
14.540000000000001	 0j
14.55	 0j
14.56	 0j
14.57	 0j
14.58	 0j
14.59	 0j
14.6	 0j
14.61	 0j
14.620000000000001	 0j
14.63	 0j
14.64	 0j
14.65	 0j
14.66	 0j
14.67	 0j
14.68	 0j
14.69	 0j
14.700000000000001	 0j
14.71	 0j
14.72	 0j
14.73	 0j
14.74	 0j
14.75	 0j
14.76	 0j
14.77	 0j
14.780000000000001	 0j
14.790000000000001	 0j
14.8	 0j
14.81	 0j
14.82	 0j
14.83	 0j
14.84	 0j
14.85	 0j
14.86	 0j
14.870000000000001	 0j
14.88	 0j
14.89	 0j
14.9	 0j
14.91	 0j
14.92	 0j
14.93	 0j
14.94	 0j
14.950000000000001	 0j
14.96	 0j
14.97	 0j
14.98	 0j
14.99	 0j
15.0	 0j
15.01	 0j
15.02	 0j
15.030000000000001	 0j
15.040000000000001	 0j
15.05	 0j
15.06	 0j
15.07	 0j
15.08	 0j
15.09	 0j
15.1	 0j
15.11	 0j
15.120000000000001	 0j
15.13	 0j
15.14	 0j
15.15	 0j
15.16	 0j
15.17	 0j
15.18	 0j
15.19	 0j
15.200000000000001	 0j
15.21	 0j
15.22	 0j
15.23	 0j
15.24	 0j
15.25	 0j
15.26	 0j
15.27	 0j
15.280000000000001	 0j
15.290000000000001	 0j
15.3	 0j
15.31	 0j
15.32	 0j
15.33	 0j
15.34	 0j
15.35	 0j
15.36	 0j
15.370000000000001	 0j
15.38	 0j
15.39	 0j
15.4	 0j
15.41	 0j
15.42	 0j
15.43	 0j
15.44	 0j
15.450000000000001	 0j
15.46	 0j
15.47	 0j
15.48	 0j
15.49	 0j
15.5	 0j
15.51	 0j
15.52	 0j
15.530000000000001	 0j
15.540000000000001	 0j
15.55	 0j
15.56	 0j
15.57	 0j
15.58	 0j
15.59	 0j
15.6	 0j
15.610000000000001	 0j
15.620000000000001	 0j
15.63	 0j
15.64	 0j
15.65	 0j
15.66	 0j
15.67	 0j
15.68	 0j
15.69	 0j
15.700000000000001	 0j
15.71	 0j
15.72	 0j
15.73	 0j
15.74	 0j
15.75	 0j
15.76	 0j
15.77	 0j
15.780000000000001	 0j
15.790000000000001	 0j
15.8	 0j
15.81	 0j
15.82	 0j
15.83	 0j
15.84	 0j
15.85	 0j
15.860000000000001	 0j
15.870000000000001	 0j
15.88	 0j
15.89	 0j
15.9	 0j
15.91	 0j
15.92	 0j
15.93	 0j
15.94	 0j
15.950000000000001	 0j
15.96	 0j
15.97	 0j
15.98	 0j
15.99	 0j
16.0	 0j
16.01	 0j
16.02	 0j
16.03	 0j
16.04	 0j
16.05	 0j
16.06	 0j
16.07	 0j
16.080000000000002	 0j
16.09	 0j
16.1	 0j
16.11	 0j
16.12	 0j
16.13	 0j
16.14	 0j
16.15	 0j
16.16	 0j
16.17	 0j
16.18	 0j
16.19	 0j
16.2	 0j
16.21	 0j
16.22	 0j
16.23	 0j
16.240000000000002	 0j
16.25	 0j
16.26	 0j
16.27	 0j
16.28	 0j
16.29	 0j
16.3	 0j
16.31	 0j
16.32	 0j
16.330000000000002	 0j
16.34	 0j
16.35	 0j
16.36	 0j
16.37	 0j
16.38	 0j
16.39	 0j
16.4	 0j
16.41	 0j
16.42	 0j
16.43	 0j
16.44	 0j
16.45	 0j
16.46	 0j
16.47	 0j
16.48	 0j
16.490000000000002	 0j
16.5	 0j
16.51	 0j
16.52	 0j
16.53	 0j
16.54	 0j
16.55	 0j
16.56	 0j
16.57	 0j
16.580000000000002	 0j
16.59	 0j
16.6	 0j
16.61	 0j
16.62	 0j
16.63	 0j
16.64	 0j
16.65	 0j
16.66	 0j
16.67	 0j
16.68	 0j
16.69	 0j
16.7	 0j
16.71	 0j
16.72	 0j
16.73	 0j
16.740000000000002	 0j
16.75	 0j
16.76	 0j
16.77	 0j
16.78	 0j
16.79	 0j
16.8	 0j
16.81	 0j
16.82	 0j
16.830000000000002	 0j
16.84	 0j
16.85	 0j
16.86	 0j
16.87	 0j
16.88	 0j
16.89	 0j
16.9	 0j
16.91	 0j
16.92	 0j
16.93	 0j
16.94	 0j
16.95	 0j
16.96	 0j
16.97	 0j
16.98	 0j
16.990000000000002	 0j
17.0	 0j
17.01	 0j
17.02	 0j
17.03	 0j
17.04	 0j
17.05	 0j
17.06	 0j
17.07	 0j
17.080000000000002	 0j
17.09	 0j
17.1	 0j
17.11	 0j
17.12	 0j
17.13	 0j
17.14	 0j
17.150000000000002	 0j
17.16	 0j
17.17	 0j
17.18	 0j
17.19	 0j
17.2	 0j
17.21	 0j
17.22	 0j
17.23	 0j
17.240000000000002	 0j
17.25	 0j
17.26	 0j
17.27	 0j
17.28	 0j
17.29	 0j
17.3	 0j
17.31	 0j
17.32	 0j
17.330000000000002	 0j
17.34	 0j
17.35	 0j
17.36	 0j
17.37	 0j
17.38	 0j
17.39	 0j
17.400000000000002	 0j
17.41	 0j
17.42	 0j
17.43	 0j
17.44	 0j
17.45	 0j
17.46	 0j
17.47	 0j
17.48	 0j
17.490000000000002	 0j
17.5	 0j
17.51	 0j
17.52	 0j
17.53	 0j
17.54	 0j
17.55	 0j
17.56	 0j
17.57	 0j
17.580000000000002	 0j
17.59	 0j
17.6	 0j
17.61	 0j
17.62	 0j
17.63	 0j
17.64	 0j
17.650000000000002	 0j
17.66	 0j
17.67	 0j
17.68	 0j
17.69	 0j
17.7	 0j
17.71	 0j
17.72	 0j
17.73	 0j
17.740000000000002	 0j
17.75	 0j
17.76	 0j
17.77	 0j
17.78	 0j
17.79	 0j
17.8	 0j
17.81	 0j
17.82	 0j
17.830000000000002	 0j
17.84	 0j
17.85	 0j
17.86	 0j
17.87	 0j
17.88	 0j
17.89	 0j
17.900000000000002	 0j
17.91	 0j
17.92	 0j
17.93	 0j
17.94	 0j
17.95	 0j
17.96	 0j
17.97	 0j
17.98	 0j
17.990000000000002	 0j
18.0	 0j
18.01	 0j
18.02	 0j
18.03	 0j
18.04	 0j
18.05	 0j
18.06	 0j
18.07	 0j
18.080000000000002	 0j
18.09	 0j
18.1	 0j
18.11	 0j
18.12	 0j
18.13	 0j
18.14	 0j
18.150000000000002	 0j
18.16	 0j
18.17	 0j
18.18	 0j
18.19	 0j
18.2	 0j
18.21	 0j
18.22	 0j
18.23	 0j
18.240000000000002	 0j
18.25	 0j
18.26	 0j
18.27	 0j
18.28	 0j
18.29	 0j
18.3	 0j
18.31	 0j
18.32	 0j
18.330000000000002	 0j
18.34	 0j
18.35	 0j
18.36	 0j
18.37	 0j
18.38	 0j
18.39	 0j
18.400000000000002	 0j
18.41	 0j
18.42	 0j
18.43	 0j
18.44	 0j
18.45	 0j
18.46	 0j
18.47	 0j
18.48	 0j
18.490000000000002	 0j
18.5	 0j
18.51	 0j
18.52	 0j
18.53	 0j
18.54	 0j
18.55	 0j
18.56	 0j
18.57	 0j
18.580000000000002	 0j
18.59	 0j
18.6	 0j
18.61	 0j
18.62	 0j
18.63	 0j
18.64	 0j
18.650000000000002	 0j
18.66	 0j
18.67	 0j
18.68	 0j
18.69	 0j
18.7	 0j
18.71	 0j
18.72	 0j
18.73	 0j
18.740000000000002	 0j
18.75	 0j
18.76	 0j
18.77	 0j
18.78	 0j
18.79	 0j
18.8	 0j
18.81	 0j
18.82	 0j
18.830000000000002	 0j
18.84	 0j
18.85	 0j
18.86	 0j
18.87	 0j
18.88	 0j
18.89	 0j
18.900000000000002	 0j
18.91	 0j
18.92	 0j
18.93	 0j
18.94	 0j
18.95	 0j
18.96	 0j
18.97	 0j
18.98	 0j
18.990000000000002	 0j
19.0	 0j
19.01	 0j
19.02	 0j
19.03	 0j
19.04	 0j
19.05	 0j
19.06	 0j
19.07	 0j
19.080000000000002	 0j
19.09	 0j
19.1	 0j
19.11	 0j
19.12	 0j
19.13	 0j
19.14	 0j
19.150000000000002	 0j
19.16	 0j
19.17	 0j
19.18	 0j
19.19	 0j
19.2	 0j
19.21	 0j
19.22	 0j
19.23	 0j
19.240000000000002	 0j
19.25	 0j
19.26	 0j
19.27	 0j
19.28	 0j
19.29	 0j
19.3	 0j
19.31	 0j
19.32	 0j
19.330000000000002	 0j
19.34	 0j
19.35	 0j
19.36	 0j
19.37	 0j
19.38	 0j
19.39	 0j
19.400000000000002	 0j
19.41	 0j
19.42	 0j
19.43	 0j
19.44	 0j
19.45	 0j
19.46	 0j
19.47	 0j
19.48	 0j
19.490000000000002	 0j
19.5	 0j
19.51	 0j
19.52	 0j
19.53	 0j
19.54	 0j
19.55	 0j
19.56	 0j
19.57	 0j
19.580000000000002	 0j
19.59	 0j
19.6	 0j
19.61	 0j
19.62	 0j
19.63	 0j
19.64	 0j
19.650000000000002	 0j
19.66	 0j
19.67	 0j
19.68	 0j
19.69	 0j
19.7	 0j
19.71	 0j
19.72	 0j
19.73	 0j
19.740000000000002	 0j
19.75	 0j
19.76	 0j
19.77	 0j
19.78	 0j
19.79	 0j
19.8	 0j
19.81	 0j
19.82	 0j
19.830000000000002	 0j
19.84	 0j
19.85	 0j
19.86	 0j
19.87	 0j
19.88	 0j
19.89	 0j
19.900000000000002	 0j
19.91	 0j
19.92	 0j
19.93	 0j
19.94	 0j
19.95	 0j
19.96	 0j
19.97	 0j
19.98	 0j
19.990000000000002	 0j
20.0	 0j
20.01	 0j
20.02	 0j
20.03	 0j
20.04	 0j
20.05	 0j
20.06	 0j
20.07	 0j
20.080000000000002	 0j
20.09	 0j
20.1	 0j
20.11	 0j
20.12	 0j
20.13	 0j
20.14	 0j
20.150000000000002	 0j
20.16	 0j
20.17	 0j
20.18	 0j
20.19	 0j
20.2	 0j
20.21	 0j
20.22	 0j
20.23	 0j
20.240000000000002	 0j
20.25	 0j
20.26	 0j
20.27	 0j
20.28	 0j
20.29	 0j
20.3	 0j
20.31	 0j
20.32	 0j
20.330000000000002	 0j
20.34	 0j
20.35	 0j
20.36	 0j
20.37	 0j
20.38	 0j
20.39	 0j
20.400000000000002	 0j
20.41	 0j
20.42	 0j
20.43	 0j
20.44	 0j
20.45	 0j
20.46	 0j
20.47	 0j
20.48	 0j
20.490000000000002	 0j
20.5	 0j
20.51	 0j
20.52	 0j
20.53	 0j
20.54	 0j
20.55	 0j
20.56	 0j
20.57	 0j
20.580000000000002	 0j
20.59	 0j
20.6	 0j
20.61	 0j
20.62	 0j
20.63	 0j
20.64	 0j
20.650000000000002	 0j
20.66	 0j
20.67	 0j
20.68	 0j
20.69	 0j
20.7	 0j
20.71	 0j
20.72	 0j
20.73	 0j
20.740000000000002	 0j
20.75	 0j
20.76	 0j
20.77	 0j
20.78	 0j
20.79	 0j
20.8	 0j
20.81	 0j
20.82	 0j
20.830000000000002	 0j
20.84	 0j
20.85	 0j
20.86	 0j
20.87	 0j
20.88	 0j
20.89	 0j
20.900000000000002	 0j
20.91	 0j
20.92	 0j
20.93	 0j
20.94	 0j
20.95	 0j
20.96	 0j
20.97	 0j
20.98	 0j
20.990000000000002	 0j
21.0	 0j
21.01	 0j
21.02	 0j
21.03	 0j
21.04	 0j
21.05	 0j
21.06	 0j
21.07	 0j
21.080000000000002	 0j
21.09	 0j
21.1	 0j
21.11	 0j
21.12	 0j
21.13	 0j
21.14	 0j
21.150000000000002	 0j
21.16	 0j
21.17	 0j
21.18	 0j
21.19	 0j
21.2	 0j
21.21	 0j
21.22	 0j
21.23	 0j
21.240000000000002	 0j
21.25	 0j
21.26	 0j
21.27	 0j
21.28	 0j
21.29	 0j
21.3	 0j
21.31	 0j
21.32	 0j
21.330000000000002	 0j
21.34	 0j
21.35	 0j
21.36	 0j
21.37	 0j
21.38	 0j
21.39	 0j
21.400000000000002	 0j
21.41	 0j
21.42	 0j
21.43	 0j
21.44	 0j
21.45	 0j
21.46	 0j
21.47	 0j
21.48	 0j
21.490000000000002	 0j
21.5	 0j
21.51	 0j
21.52	 0j
21.53	 0j
21.54	 0j
21.55	 0j
21.56	 0j
21.57	 0j
21.580000000000002	 0j
21.59	 0j
21.6	 0j
21.61	 0j
21.62	 0j
21.63	 0j
21.64	 0j
21.650000000000002	 0j
21.66	 0j
21.67	 0j
21.68	 0j
21.69	 0j
21.7	 0j
21.71	 0j
21.72	 0j
21.73	 0j
21.740000000000002	 0j
21.75	 0j
21.76	 0j
21.77	 0j
21.78	 0j
21.79	 0j
21.8	 0j
21.81	 0j
21.82	 0j
21.830000000000002	 0j
21.84	 0j
21.85	 0j
21.86	 0j
21.87	 0j
21.88	 0j
21.89	 0j
21.900000000000002	 0j
21.91	 0j
21.92	 0j
21.93	 0j
21.94	 0j
21.95	 0j
21.96	 0j
21.97	 0j
21.98	 0j
21.990000000000002	 0j
22.0	 0j
22.01	 0j
22.02	 0j
22.03	 0j
22.04	 0j
22.05	 0j
22.06	 0j
22.07	 0j
22.080000000000002	 0j
22.09	 0j
22.1	 0j
22.11	 0j
22.12	 0j
22.13	 0j
22.14	 0j
22.150000000000002	 0j
22.16	 0j
22.17	 0j
22.18	 0j
22.19	 0j
22.2	 0j
22.21	 0j
22.22	 0j
22.23	 0j
22.240000000000002	 0j
22.25	 0j
22.26	 0j
22.27	 0j
22.28	 0j
22.29	 0j
22.3	 0j
22.31	 0j
22.32	 0j
22.330000000000002	 0j
22.34	 0j
22.35	 0j
22.36	 0j
22.37	 0j
22.38	 0j
22.39	 0j
22.400000000000002	 0j
22.41	 0j
22.42	 0j
22.43	 0j
22.44	 0j
22.45	 0j
22.46	 0j
22.47	 0j
22.48	 0j
22.490000000000002	 0j
22.5	 0j
22.51	 0j
22.52	 0j
22.53	 0j
22.54	 0j
22.55	 0j
22.56	 0j
22.57	 0j
22.580000000000002	 0j
22.59	 0j
22.6	 0j
22.61	 0j
22.62	 0j
22.63	 0j
22.64	 0j
22.650000000000002	 0j
22.66	 0j
22.67	 0j
22.68	 0j
22.69	 0j
22.7	 0j
22.71	 0j
22.72	 0j
22.73	 0j
22.740000000000002	 0j
22.75	 0j
22.76	 0j
22.77	 0j
22.78	 0j
22.79	 0j
22.8	 0j
22.81	 0j
22.82	 0j
22.830000000000002	 0j
22.84	 0j
22.85	 0j
22.86	 0j
22.87	 0j
22.88	 0j
22.89	 0j
22.900000000000002	 0j
22.91	 0j
22.92	 0j
22.93	 0j
22.94	 0j
22.95	 0j
22.96	 0j
22.97	 0j
22.98	 0j
22.990000000000002	 0j
23.0	 0j
23.01	 0j
23.02	 0j
23.03	 0j
23.04	 0j
23.05	 0j
23.06	 0j
23.07	 0j
23.080000000000002	 0j
23.09	 0j
23.1	 0j
23.11	 0j
23.12	 0j
23.13	 0j
23.14	 0j
23.150000000000002	 0j
23.16	 0j
23.17	 0j
23.18	 0j
23.19	 0j
23.2	 0j
23.21	 0j
23.22	 0j
23.23	 0j
23.240000000000002	 0j
23.25	 0j
23.26	 0j
23.27	 0j
23.28	 0j
23.29	 0j
23.3	 0j
23.31	 0j
23.32	 0j
23.330000000000002	 0j
23.34	 0j
23.35	 0j
23.36	 0j
23.37	 0j
23.38	 0j
23.39	 0j
23.400000000000002	 0j
23.41	 0j
23.42	 0j
23.43	 0j
23.44	 0j
23.45	 0j
23.46	 0j
23.47	 0j
23.48	 0j
23.490000000000002	 0j
23.5	 0j
23.51	 0j
23.52	 0j
23.53	 0j
23.54	 0j
23.55	 0j
23.56	 0j
23.57	 0j
23.580000000000002	 0j
23.59	 0j
23.6	 0j
23.61	 0j
23.62	 0j
23.63	 0j
23.64	 0j
23.650000000000002	 0j
23.66	 0j
23.67	 0j
23.68	 0j
23.69	 0j
23.7	 0j
23.71	 0j
23.72	 0j
23.73	 0j
23.740000000000002	 0j
23.75	 0j
23.76	 0j
23.77	 0j
23.78	 0j
23.79	 0j
23.8	 0j
23.81	 0j
23.82	 0j
23.830000000000002	 0j
23.84	 0j
23.85	 0j
23.86	 0j
23.87	 0j
23.88	 0j
23.89	 0j
23.900000000000002	 0j
23.91	 0j
23.92	 0j
23.93	 0j
23.94	 0j
23.95	 0j
23.96	 0j
23.97	 0j
23.98	 0j
23.990000000000002	 0j
24.0	 0j
24.01	 0j
24.02	 0j
24.03	 0j
24.04	 0j
24.05	 0j
24.060000000000002	 0j
24.07	 0j
24.080000000000002	 0j
24.09	 0j
24.1	 0j
24.11	 0j
24.12	 0j
24.13	 0j
24.14	 0j
24.150000000000002	 0j
24.16	 0j
24.17	 0j
24.18	 0j
24.19	 0j
24.2	 0j
24.21	 0j
24.22	 0j
24.23	 0j
24.240000000000002	 0j
24.25	 0j
24.26	 0j
24.27	 0j
24.28	 0j
24.29	 0j
24.3	 0j
24.310000000000002	 0j
24.32	 0j
24.330000000000002	 0j
24.34	 0j
24.35	 0j
24.36	 0j
24.37	 0j
24.38	 0j
24.39	 0j
24.400000000000002	 0j
24.41	 0j
24.42	 0j
24.43	 0j
24.44	 0j
24.45	 0j
24.46	 0j
24.47	 0j
24.48	 0j
24.490000000000002	 0j
24.5	 0j
24.51	 0j
24.52	 0j
24.53	 0j
24.54	 0j
24.55	 0j
24.560000000000002	 0j
24.57	 0j
24.580000000000002	 0j
24.59	 0j
24.6	 0j
24.61	 0j
24.62	 0j
24.63	 0j
24.64	 0j
24.650000000000002	 0j
24.66	 0j
24.67	 0j
24.68	 0j
24.69	 0j
24.7	 0j
24.71	 0j
24.72	 0j
24.73	 0j
24.740000000000002	 0j
24.75	 0j
24.76	 0j
24.77	 0j
24.78	 0j
24.79	 0j
24.8	 0j
24.810000000000002	 0j
24.82	 0j
24.830000000000002	 0j
24.84	 0j
24.85	 0j
24.86	 0j
24.87	 0j
24.88	 0j
24.89	 0j
24.900000000000002	 0j
24.91	 0j
24.92	 0j
24.93	 0j
24.94	 0j
24.95	 0j
24.96	 0j
24.97	 0j
24.98	 0j
24.990000000000002	 0j
25.0	 0j
25.01	 0j
25.02	 0j
25.03	 0j
25.04	 0j
25.05	 0j
25.060000000000002	 0j
25.07	 0j
25.080000000000002	 0j
25.09	 0j
25.1	 0j
25.11	 0j
25.12	 0j
25.13	 0j
25.14	 0j
25.150000000000002	 0j
25.16	 0j
25.17	 0j
25.18	 0j
25.19	 0j
25.2	 0j
25.21	 0j
25.22	 0j
25.23	 0j
25.240000000000002	 0j
25.25	 0j
25.26	 0j
25.27	 0j
25.28	 0j
25.29	 0j
25.3	 0j
25.310000000000002	 0j
25.32	 0j
25.330000000000002	 0j
25.34	 0j
25.35	 0j
25.36	 0j
25.37	 0j
25.38	 0j
25.39	 0j
25.400000000000002	 0j
25.41	 0j
25.42	 0j
25.43	 0j
25.44	 0j
25.45	 0j
25.46	 0j
25.47	 0j
25.48	 0j
25.490000000000002	 0j
25.5	 0j
25.51	 0j
25.52	 0j
25.53	 0j
25.54	 0j
25.55	 0j
25.560000000000002	 0j
25.57	 0j
25.580000000000002	 0j
25.59	 0j
25.6	 0j
25.61	 0j
25.62	 0j
25.63	 0j
25.64	 0j
25.650000000000002	 0j
25.66	 0j
25.67	 0j
25.68	 0j
25.69	 0j
25.7	 0j
25.71	 0j
25.72	 0j
25.73	 0j
25.740000000000002	 0j
25.75	 0j
25.76	 0j
25.77	 0j
25.78	 0j
25.79	 0j
25.8	 0j
25.810000000000002	 0j
25.82	 0j
25.830000000000002	 0j
25.84	 0j
25.85	 0j
25.86	 0j
25.87	 0j
25.88	 0j
25.89	 0j
25.900000000000002	 0j
25.91	 0j
25.92	 0j
25.93	 0j
25.94	 0j
25.95	 0j
25.96	 0j
25.97	 0j
25.98	 0j
25.990000000000002	 0j
26.0	 0j
26.01	 0j
26.02	 0j
26.03	 0j
26.04	 0j
26.05	 0j
26.060000000000002	 0j
26.07	 0j
26.080000000000002	 0j
26.09	 0j
26.1	 0j
26.11	 0j
26.12	 0j
26.13	 0j
26.14	 0j
26.150000000000002	 0j
26.16	 0j
26.17	 0j
26.18	 0j
26.19	 0j
26.2	 0j
26.21	 0j
26.22	 0j
26.23	 0j
26.240000000000002	 0j
26.25	 0j
26.26	 0j
26.27	 0j
26.28	 0j
26.29	 0j
26.3	 0j
26.310000000000002	 0j
26.32	 0j
26.330000000000002	 0j
26.34	 0j
26.35	 0j
26.36	 0j
26.37	 0j
26.38	 0j
26.39	 0j
26.400000000000002	 0j
26.41	 0j
26.42	 0j
26.43	 0j
26.44	 0j
26.45	 0j
26.46	 0j
26.47	 0j
26.48	 0j
26.490000000000002	 0j
26.5	 0j
26.51	 0j
26.52	 0j
26.53	 0j
26.54	 0j
26.55	 0j
26.560000000000002	 0j
26.57	 0j
26.580000000000002	 0j
26.59	 0j
26.6	 0j
26.61	 0j
26.62	 0j
26.63	 0j
26.64	 0j
26.650000000000002	 0j
26.66	 0j
26.67	 0j
26.68	 0j
26.69	 0j
26.7	 0j
26.71	 0j
26.72	 0j
26.73	 0j
26.740000000000002	 0j
26.75	 0j
26.76	 0j
26.77	 0j
26.78	 0j
26.79	 0j
26.8	 0j
26.810000000000002	 0j
26.82	 0j
26.830000000000002	 0j
26.84	 0j
26.85	 0j
26.86	 0j
26.87	 0j
26.88	 0j
26.89	 0j
26.900000000000002	 0j
26.91	 0j
26.92	 0j
26.93	 0j
26.94	 0j
26.95	 0j
26.96	 0j
26.97	 0j
26.98	 0j
26.990000000000002	 0j
27.0	 0j
27.01	 0j
27.02	 0j
27.03	 0j
27.04	 0j
27.05	 0j
27.060000000000002	 0j
27.07	 0j
27.080000000000002	 0j
27.09	 0j
27.1	 0j
27.11	 0j
27.12	 0j
27.13	 0j
27.14	 0j
27.150000000000002	 0j
27.16	 0j
27.17	 0j
27.18	 0j
27.19	 0j
27.2	 0j
27.21	 0j
27.22	 0j
27.23	 0j
27.240000000000002	 0j
27.25	 0j
27.26	 0j
27.27	 0j
27.28	 0j
27.29	 0j
27.3	 0j
27.310000000000002	 0j
27.32	 0j
27.330000000000002	 0j
27.34	 0j
27.35	 0j
27.36	 0j
27.37	 0j
27.38	 0j
27.39	 0j
27.400000000000002	 0j
27.41	 0j
27.42	 0j
27.43	 0j
27.44	 0j
27.45	 0j
27.46	 0j
27.47	 0j
27.48	 0j
27.490000000000002	 0j
27.5	 0j
27.51	 0j
27.52	 0j
27.53	 0j
27.54	 0j
27.55	 0j
27.560000000000002	 0j
27.57	 0j
27.580000000000002	 0j
27.59	 0j
27.6	 0j
27.61	 0j
27.62	 0j
27.63	 0j
27.64	 0j
27.650000000000002	 0j
27.66	 0j
27.67	 0j
27.68	 0j
27.69	 0j
27.7	 0j
27.71	 0j
27.72	 0j
27.73	 0j
27.740000000000002	 0j
27.75	 0j
27.76	 0j
27.77	 0j
27.78	 0j
27.79	 0j
27.8	 0j
27.810000000000002	 0j
27.82	 0j
27.830000000000002	 0j
27.84	 0j
27.85	 0j
27.86	 0j
27.87	 0j
27.88	 0j
27.89	 0j
27.900000000000002	 0j
27.91	 0j
27.92	 0j
27.93	 0j
27.94	 0j
27.95	 0j
27.96	 0j
27.97	 0j
27.98	 0j
27.990000000000002	 0j
28.0	 0j
28.01	 0j
28.02	 0j
28.03	 0j
28.04	 0j
28.05	 0j
28.060000000000002	 0j
28.07	 0j
28.080000000000002	 0j
28.09	 0j
28.1	 0j
28.11	 0j
28.12	 0j
28.13	 0j
28.14	 0j
28.150000000000002	 0j
28.16	 0j
28.17	 0j
28.18	 0j
28.19	 0j
28.2	 0j
28.21	 0j
28.22	 0j
28.23	 0j
28.240000000000002	 0j
28.25	 0j
28.26	 0j
28.27	 0j
28.28	 0j
28.29	 0j
28.3	 0j
28.310000000000002	 0j
28.32	 0j
28.330000000000002	 0j
28.34	 0j
28.35	 0j
28.36	 0j
28.37	 0j
28.38	 0j
28.39	 0j
28.400000000000002	 0j
28.41	 0j
28.42	 0j
28.43	 0j
28.44	 0j
28.45	 0j
28.46	 0j
28.47	 0j
28.48	 0j
28.490000000000002	 0j
28.5	 0j
28.51	 0j
28.52	 0j
28.53	 0j
28.54	 0j
28.55	 0j
28.560000000000002	 0j
28.57	 0j
28.580000000000002	 0j
28.59	 0j
28.6	 0j
28.61	 0j
28.62	 0j
28.63	 0j
28.64	 0j
28.650000000000002	 0j
28.66	 0j
28.67	 0j
28.68	 0j
28.69	 0j
28.7	 0j
28.71	 0j
28.72	 0j
28.73	 0j
28.740000000000002	 0j
28.75	 0j
28.76	 0j
28.77	 0j
28.78	 0j
28.79	 0j
28.8	 0j
28.810000000000002	 0j
28.82	 0j
28.830000000000002	 0j
28.84	 0j
28.85	 0j
28.86	 0j
28.87	 0j
28.88	 0j
28.89	 0j
28.900000000000002	 0j
28.91	 0j
28.92	 0j
28.93	 0j
28.94	 0j
28.95	 0j
28.96	 0j
28.97	 0j
28.98	 0j
28.990000000000002	 0j
29.0	 0j
29.01	 0j
29.02	 0j
29.03	 0j
29.04	 0j
29.05	 0j
29.060000000000002	 0j
29.07	 0j
29.080000000000002	 0j
29.09	 0j
29.1	 0j
29.11	 0j
29.12	 0j
29.13	 0j
29.14	 0j
29.150000000000002	 0j
29.16	 0j
29.17	 0j
29.18	 0j
29.19	 0j
29.2	 0j
29.21	 0j
29.22	 0j
29.23	 0j
29.240000000000002	 0j
29.25	 0j
29.26	 0j
29.27	 0j
29.28	 0j
29.29	 0j
29.3	 0j
29.310000000000002	 0j
29.32	 0j
29.330000000000002	 0j
29.34	 0j
29.35	 0j
29.36	 0j
29.37	 0j
29.38	 0j
29.39	 0j
29.400000000000002	 0j
29.41	 0j
29.42	 0j
29.43	 0j
29.44	 0j
29.45	 0j
29.46	 0j
29.47	 0j
29.48	 0j
29.490000000000002	 0j
29.5	 0j
29.51	 0j
29.52	 0j
29.53	 0j
29.54	 0j
29.55	 0j
29.560000000000002	 0j
29.57	 0j
29.580000000000002	 0j
29.59	 0j
29.6	 0j
29.61	 0j
29.62	 0j
29.63	 0j
29.64	 0j
29.650000000000002	 0j
29.66	 0j
29.67	 0j
29.68	 0j
29.69	 0j
29.7	 0j
29.71	 0j
29.72	 0j
29.73	 0j
29.740000000000002	 0j
29.75	 0j
29.76	 0j
29.77	 0j
29.78	 0j
29.79	 0j
29.8	 0j
29.810000000000002	 0j
29.82	 0j
29.830000000000002	 0j
29.84	 0j
29.85	 0j
29.86	 0j
29.87	 0j
29.88	 0j
29.89	 0j
29.900000000000002	 0j
29.91	 0j
29.92	 0j
29.93	 0j
29.94	 0j
29.95	 0j
29.96	 0j
29.97	 0j
29.98	 0j
29.990000000000002	 0j
30.0	 0j
30.01	 0j
30.02	 0j
30.03	 0j
30.04	 0j
30.05	 0j
30.060000000000002	 0j
30.07	 0j
30.080000000000002	 0j
30.09	 0j
30.1	 0j
30.11	 0j
30.12	 0j
30.13	 0j
30.14	 0j
30.150000000000002	 0j
30.16	 0j
30.17	 0j
30.18	 0j
30.19	 0j
30.2	 0j
30.21	 0j
30.22	 0j
30.23	 0j
30.240000000000002	 0j
30.25	 0j
30.26	 0j
30.27	 0j
30.28	 0j
30.29	 0j
30.3	 0j
30.310000000000002	 0j
30.32	 0j
30.330000000000002	 0j
30.34	 0j
30.35	 0j
30.36	 0j
30.37	 0j
30.38	 0j
30.39	 0j
30.400000000000002	 0j
30.41	 0j
30.42	 0j
30.43	 0j
30.44	 0j
30.45	 0j
30.46	 0j
30.47	 0j
30.48	 0j
30.490000000000002	 0j
30.5	 0j
30.51	 0j
30.52	 0j
30.53	 0j
30.54	 0j
30.55	 0j
30.560000000000002	 0j
30.57	 0j
30.580000000000002	 0j
30.59	 0j
30.6	 0j
30.61	 0j
30.62	 0j
30.63	 0j
30.64	 0j
30.650000000000002	 0j
30.66	 0j
30.67	 0j
30.68	 0j
30.69	 0j
30.7	 0j
30.71	 0j
30.72	 0j
30.73	 0j
30.740000000000002	 0j
30.75	 0j
30.76	 0j
30.77	 0j
30.78	 0j
30.79	 0j
30.8	 0j
30.810000000000002	 0j
30.82	 0j
30.830000000000002	 0j
30.84	 0j
30.85	 0j
30.86	 0j
30.87	 0j
30.88	 0j
30.89	 0j
30.900000000000002	 0j
30.91	 0j
30.92	 0j
30.93	 0j
30.94	 0j
30.95	 0j
30.96	 0j
30.970000000000002	 0j
30.98	 0j
30.990000000000002	 0j
31.0	 0j
31.01	 0j
31.02	 0j
31.03	 0j
31.04	 0j
31.05	 0j
31.060000000000002	 0j
31.07	 0j
31.080000000000002	 0j
31.09	 0j
31.1	 0j
31.11	 0j
31.12	 0j
31.13	 0j
31.14	 0j
31.150000000000002	 0j
31.16	 0j
31.17	 0j
31.18	 0j
31.19	 0j
31.2	 0j
31.21	 0j
31.220000000000002	 0j
31.23	 0j
31.240000000000002	 0j
31.25	 0j
31.26	 0j
31.27	 0j
31.28	 0j
31.29	 0j
31.3	 0j
31.310000000000002	 0j
31.32	 0j
31.330000000000002	 0j
31.34	 0j
31.35	 0j
31.36	 0j
31.37	 0j
31.38	 0j
31.39	 0j
31.400000000000002	 0j
31.41	 0j
31.42	 0j
31.43	 0j
31.44	 0j
31.45	 0j
31.46	 0j
31.470000000000002	 0j
31.48	 0j
31.490000000000002	 0j
31.5	 0j
31.51	 0j
31.52	 0j
31.53	 0j
31.54	 0j
31.55	 0j
31.560000000000002	 0j
31.57	 0j
31.580000000000002	 0j
31.59	 0j
31.6	 0j
31.61	 0j
31.62	 0j
31.63	 0j
31.64	 0j
31.650000000000002	 0j
31.66	 0j
31.67	 0j
31.68	 0j
31.69	 0j
31.7	 0j
31.71	 0j
31.720000000000002	 0j
31.73	 0j
31.740000000000002	 0j
31.75	 0j
31.76	 0j
31.77	 0j
31.78	 0j
31.79	 0j
31.8	 0j
31.810000000000002	 0j
31.82	 0j
31.830000000000002	 0j
31.84	 0j
31.85	 0j
31.86	 0j
31.87	 0j
31.88	 0j
31.89	 0j
31.900000000000002	 0j
31.91	 0j
31.92	 0j
31.93	 0j
31.94	 0j
31.95	 0j
31.96	 0j
31.970000000000002	 0j
31.98	 0j
31.990000000000002	 0j
32.0	 0j
32.01	 0j
32.02	 0j
32.03	 0j
32.04	 0j
32.05	 0j
32.06	 0j
32.07	 0j
32.08	 0j
32.09	 0j
32.1	 0j
32.11	 0j
32.12	 0j
32.13	 0j
32.14	 0j
32.15	 0j
32.160000000000004	 0j
32.17	 0j
32.18	 0j
32.19	 0j
32.2	 0j
32.21	 0j
32.22	 0j
32.230000000000004	 0j
32.24	 0j
32.25	 0j
32.26	 0j
32.27	 0j
32.28	 0j
32.29	 0j
32.3	 0j
32.31	 0j
32.32	 0j
32.33	 0j
32.34	 0j
32.35	 0j
32.36	 0j
32.37	 0j
32.38	 0j
32.39	 0j
32.4	 0j
32.410000000000004	 0j
32.42	 0j
32.43	 0j
32.44	 0j
32.45	 0j
32.46	 0j
32.47	 0j
32.480000000000004	 0j
32.49	 0j
32.5	 0j
32.51	 0j
32.52	 0j
32.53	 0j
32.54	 0j
32.55	 0j
32.56	 0j
32.57	 0j
32.58	 0j
32.59	 0j
32.6	 0j
32.61	 0j
32.62	 0j
32.63	 0j
32.64	 0j
32.65	 0j
32.660000000000004	 0j
32.67	 0j
32.68	 0j
32.69	 0j
32.7	 0j
32.71	 0j
32.72	 0j
32.730000000000004	 0j
32.74	 0j
32.75	 0j
32.76	 0j
32.77	 0j
32.78	 0j
32.79	 0j
32.8	 0j
32.81	 0j
32.82	 0j
32.83	 0j
32.84	 0j
32.85	 0j
32.86	 0j
32.87	 0j
32.88	 0j
32.89	 0j
32.9	 0j
32.910000000000004	 0j
32.92	 0j
32.93	 0j
32.94	 0j
32.95	 0j
32.96	 0j
32.97	 0j
32.980000000000004	 0j
32.99	 0j
33.0	 0j
33.01	 0j
33.02	 0j
33.03	 0j
33.04	 0j
33.05	 0j
33.06	 0j
33.07	 0j
33.08	 0j
33.09	 0j
33.1	 0j
33.11	 0j
33.12	 0j
33.13	 0j
33.14	 0j
33.15	 0j
33.160000000000004	 0j
33.17	 0j
33.18	 0j
33.19	 0j
33.2	 0j
33.21	 0j
33.22	 0j
33.230000000000004	 0j
33.24	 0j
33.25	 0j
33.26	 0j
33.27	 0j
33.28	 0j
33.29	 0j
33.3	 0j
33.31	 0j
33.32	 0j
33.33	 0j
33.34	 0j
33.35	 0j
33.36	 0j
33.37	 0j
33.38	 0j
33.39	 0j
33.4	 0j
33.410000000000004	 0j
33.42	 0j
33.43	 0j
33.44	 0j
33.45	 0j
33.46	 0j
33.47	 0j
33.480000000000004	 0j
33.49	 0j
33.5	 0j
33.51	 0j
33.52	 0j
33.53	 0j
33.54	 0j
33.55	 0j
33.56	 0j
33.57	 0j
33.58	 0j
33.59	 0j
33.6	 0j
33.61	 0j
33.62	 0j
33.63	 0j
33.64	 0j
33.65	 0j
33.660000000000004	 0j
33.67	 0j
33.68	 0j
33.69	 0j
33.7	 0j
33.71	 0j
33.72	 0j
33.730000000000004	 0j
33.74	 0j
33.75	 0j
33.76	 0j
33.77	 0j
33.78	 0j
33.79	 0j
33.8	 0j
33.81	 0j
33.82	 0j
33.83	 0j
33.84	 0j
33.85	 0j
33.86	 0j
33.87	 0j
33.88	 0j
33.89	 0j
33.9	 0j
33.910000000000004	 0j
33.92	 0j
33.93	 0j
33.94	 0j
33.95	 0j
33.96	 0j
33.97	 0j
33.980000000000004	 0j
33.99	 0j
34.0	 0j
34.01	 0j
34.02	 0j
34.03	 0j
34.04	 0j
34.05	 0j
34.06	 0j
34.07	 0j
34.08	 0j
34.09	 0j
34.1	 0j
34.11	 0j
34.12	 0j
34.13	 0j
34.14	 0j
34.15	 0j
34.160000000000004	 0j
34.17	 0j
34.18	 0j
34.19	 0j
34.2	 0j
34.21	 0j
34.22	 0j
34.230000000000004	 0j
34.24	 0j
34.25	 0j
34.26	 0j
34.27	 0j
34.28	 0j
34.29	 0j
34.300000000000004	 0j
34.31	 0j
34.32	 0j
34.33	 0j
34.34	 0j
34.35	 0j
34.36	 0j
34.37	 0j
34.38	 0j
34.39	 0j
34.4	 0j
34.410000000000004	 0j
34.42	 0j
34.43	 0j
34.44	 0j
34.45	 0j
34.46	 0j
34.47	 0j
34.480000000000004	 0j
34.49	 0j
34.5	 0j
34.51	 0j
34.52	 0j
34.53	 0j
34.54	 0j
34.550000000000004	 0j
34.56	 0j
34.57	 0j
34.58	 0j
34.59	 0j
34.6	 0j
34.61	 0j
34.62	 0j
34.63	 0j
34.64	 0j
34.65	 0j
34.660000000000004	 0j
34.67	 0j
34.68	 0j
34.69	 0j
34.7	 0j
34.71	 0j
34.72	 0j
34.730000000000004	 0j
34.74	 0j
34.75	 0j
34.76	 0j
34.77	 0j
34.78	 0j
34.79	 0j
34.800000000000004	 0j
34.81	 0j
34.82	 0j
34.83	 0j
34.84	 0j
34.85	 0j
34.86	 0j
34.87	 0j
34.88	 0j
34.89	 0j
34.9	 0j
34.910000000000004	 0j
34.92	 0j
34.93	 0j
34.94	 0j
34.95	 0j
34.96	 0j
34.97	 0j
34.980000000000004	 0j
34.99	 0j
35.0	 0j
35.01	 0j
35.02	 0j
35.03	 0j
35.04	 0j
35.050000000000004	 0j
35.06	 0j
35.07	 0j
35.08	 0j
35.09	 0j
35.1	 0j
35.11	 0j
35.12	 0j
35.13	 0j
35.14	 0j
35.15	 0j
35.160000000000004	 0j
35.17	 0j
35.18	 0j
35.19	 0j
35.2	 0j
35.21	 0j
35.22	 0j
35.230000000000004	 0j
35.24	 0j
35.25	 0j
35.26	 0j
35.27	 0j
35.28	 0j
35.29	 0j
35.300000000000004	 0j
35.31	 0j
35.32	 0j
35.33	 0j
35.34	 0j
35.35	 0j
35.36	 0j
35.37	 0j
35.38	 0j
35.39	 0j
35.4	 0j
35.410000000000004	 0j
35.42	 0j
35.43	 0j
35.44	 0j
35.45	 0j
35.46	 0j
35.47	 0j
35.480000000000004	 0j
35.49	 0j
35.5	 0j
35.51	 0j
35.52	 0j
35.53	 0j
35.54	 0j
35.550000000000004	 0j
35.56	 0j
35.57	 0j
35.58	 0j
35.59	 0j
35.6	 0j
35.61	 0j
35.62	 0j
35.63	 0j
35.64	 0j
35.65	 0j
35.660000000000004	 0j
35.67	 0j
35.68	 0j
35.69	 0j
35.7	 0j
35.71	 0j
35.72	 0j
35.730000000000004	 0j
35.74	 0j
35.75	 0j
35.76	 0j
35.77	 0j
35.78	 0j
35.79	 0j
35.800000000000004	 0j
35.81	 0j
35.82	 0j
35.83	 0j
35.84	 0j
35.85	 0j
35.86	 0j
35.87	 0j
35.88	 0j
35.89	 0j
35.9	 0j
35.910000000000004	 0j
35.92	 0j
35.93	 0j
35.94	 0j
35.95	 0j
35.96	 0j
35.97	 0j
35.980000000000004	 0j
35.99	 0j
36.0	 0j
36.01	 0j
36.02	 0j
36.03	 0j
36.04	 0j
36.050000000000004	 0j
36.06	 0j
36.07	 0j
36.08	 0j
36.09	 0j
36.1	 0j
36.11	 0j
36.12	 0j
36.13	 0j
36.14	 0j
36.15	 0j
36.160000000000004	 0j
36.17	 0j
36.18	 0j
36.19	 0j
36.2	 0j
36.21	 0j
36.22	 0j
36.230000000000004	 0j
36.24	 0j
36.25	 0j
36.26	 0j
36.27	 0j
36.28	 0j
36.29	 0j
36.300000000000004	 0j
36.31	 0j
36.32	 0j
36.33	 0j
36.34	 0j
36.35	 0j
36.36	 0j
36.37	 0j
36.38	 0j
36.39	 0j
36.4	 0j
36.410000000000004	 0j
36.42	 0j
36.43	 0j
36.44	 0j
36.45	 0j
36.46	 0j
36.47	 0j
36.480000000000004	 0j
36.49	 0j
36.5	 0j
36.51	 0j
36.52	 0j
36.53	 0j
36.54	 0j
36.550000000000004	 0j
36.56	 0j
36.57	 0j
36.58	 0j
36.59	 0j
36.6	 0j
36.61	 0j
36.62	 0j
36.63	 0j
36.64	 0j
36.65	 0j
36.660000000000004	 0j
36.67	 0j
36.68	 0j
36.69	 0j
36.7	 0j
36.71	 0j
36.72	 0j
36.730000000000004	 0j
36.74	 0j
36.75	 0j
36.76	 0j
36.77	 0j
36.78	 0j
36.79	 0j
36.800000000000004	 0j
36.81	 0j
36.82	 0j
36.83	 0j
36.84	 0j
36.85	 0j
36.86	 0j
36.87	 0j
36.88	 0j
36.89	 0j
36.9	 0j
36.910000000000004	 0j
36.92	 0j
36.93	 0j
36.94	 0j
36.95	 0j
36.96	 0j
36.97	 0j
36.980000000000004	 0j
36.99	 0j
37.0	 0j
37.01	 0j
37.02	 0j
37.03	 0j
37.04	 0j
37.050000000000004	 0j
37.06	 0j
37.07	 0j
37.08	 0j
37.09	 0j
37.1	 0j
37.11	 0j
37.12	 0j
37.13	 0j
37.14	 0j
37.15	 0j
37.160000000000004	 0j
37.17	 0j
37.18	 0j
37.19	 0j
37.2	 0j
37.21	 0j
37.22	 0j
37.230000000000004	 0j
37.24	 0j
37.25	 0j
37.26	 0j
37.27	 0j
37.28	 0j
37.29	 0j
37.300000000000004	 0j
37.31	 0j
37.32	 0j
37.33	 0j
37.34	 0j
37.35	 0j
37.36	 0j
37.37	 0j
37.38	 0j
37.39	 0j
37.4	 0j
37.410000000000004	 0j
37.42	 0j
37.43	 0j
37.44	 0j
37.45	 0j
37.46	 0j
37.47	 0j
37.480000000000004	 0j
37.49	 0j
37.5	 0j
37.51	 0j
37.52	 0j
37.53	 0j
37.54	 0j
37.550000000000004	 0j
37.56	 0j
37.57	 0j
37.58	 0j
37.59	 0j
37.6	 0j
37.61	 0j
37.62	 0j
37.63	 0j
37.64	 0j
37.65	 0j
37.660000000000004	 0j
37.67	 0j
37.68	 0j
37.69	 0j
37.7	 0j
37.71	 0j
37.72	 0j
37.730000000000004	 0j
37.74	 0j
37.75	 0j
37.76	 0j
37.77	 0j
37.78	 0j
37.79	 0j
37.800000000000004	 0j
37.81	 0j
37.82	 0j
37.83	 0j
37.84	 0j
37.85	 0j
37.86	 0j
37.87	 0j
37.88	 0j
37.89	 0j
37.9	 0j
37.910000000000004	 0j
37.92	 0j
37.93	 0j
37.94	 0j
37.95	 0j
37.96	 0j
37.97	 0j
37.980000000000004	 0j
37.99	 0j
38.0	 0j
38.01	 0j
38.02	 0j
38.03	 0j
38.04	 0j
38.050000000000004	 0j
38.06	 0j
38.07	 0j
38.08	 0j
38.09	 0j
38.1	 0j
38.11	 0j
38.12	 0j
38.13	 0j
38.14	 0j
38.15	 0j
38.160000000000004	 0j
38.17	 0j
38.18	 0j
38.19	 0j
38.2	 0j
38.21	 0j
38.22	 0j
38.230000000000004	 0j
38.24	 0j
38.25	 0j
38.26	 0j
38.27	 0j
38.28	 0j
38.29	 0j
38.300000000000004	 0j
38.31	 0j
38.32	 0j
38.33	 0j
38.34	 0j
38.35	 0j
38.36	 0j
38.37	 0j
38.38	 0j
38.39	 0j
38.4	 0j
38.410000000000004	 0j
38.42	 0j
38.43	 0j
38.44	 0j
38.45	 0j
38.46	 0j
38.47	 0j
38.480000000000004	 0j
38.49	 0j
38.5	 0j
38.51	 0j
38.52	 0j
38.53	 0j
38.54	 0j
38.550000000000004	 0j
38.56	 0j
38.57	 0j
38.58	 0j
38.59	 0j
38.6	 0j
38.61	 0j
38.62	 0j
38.63	 0j
38.64	 0j
38.65	 0j
38.660000000000004	 0j
38.67	 0j
38.68	 0j
38.69	 0j
38.7	 0j
38.71	 0j
38.72	 0j
38.730000000000004	 0j
38.74	 0j
38.75	 0j
38.76	 0j
38.77	 0j
38.78	 0j
38.79	 0j
38.800000000000004	 0j
38.81	 0j
38.82	 0j
38.83	 0j
38.84	 0j
38.85	 0j
38.86	 0j
38.87	 0j
38.88	 0j
38.89	 0j
38.9	 0j
38.910000000000004	 0j
38.92	 0j
38.93	 0j
38.94	 0j
38.95	 0j
38.96	 0j
38.97	 0j
38.980000000000004	 0j
38.99	 0j
39.0	 0j
39.01	 0j
39.02	 0j
39.03	 0j
39.04	 0j
39.050000000000004	 0j
39.06	 0j
39.07	 0j
39.08	 0j
39.09	 0j
39.1	 0j
39.11	 0j
39.12	 0j
39.13	 0j
39.14	 0j
39.15	 0j
39.160000000000004	 0j
39.17	 0j
39.18	 0j
39.19	 0j
39.2	 0j
39.21	 0j
39.22	 0j
39.230000000000004	 0j
39.24	 0j
39.25	 0j
39.26	 0j
39.27	 0j
39.28	 0j
39.29	 0j
39.300000000000004	 0j
39.31	 0j
39.32	 0j
39.33	 0j
39.34	 0j
39.35	 0j
39.36	 0j
39.37	 0j
39.38	 0j
39.39	 0j
39.4	 0j
39.410000000000004	 0j
39.42	 0j
39.43	 0j
39.44	 0j
39.45	 0j
39.46	 0j
39.47	 0j
39.480000000000004	 0j
39.49	 0j
39.5	 0j
39.51	 0j
39.52	 0j
39.53	 0j
39.54	 0j
39.550000000000004	 0j
39.56	 0j
39.57	 0j
39.58	 0j
39.59	 0j
39.6	 0j
39.61	 0j
39.62	 0j
39.63	 0j
39.64	 0j
39.65	 0j
39.660000000000004	 0j
39.67	 0j
39.68	 0j
39.69	 0j
39.7	 0j
39.71	 0j
39.72	 0j
39.730000000000004	 0j
39.74	 0j
39.75	 0j
39.76	 0j
39.77	 0j
39.78	 0j
39.79	 0j
39.800000000000004	 0j
39.81	 0j
39.82	 0j
39.83	 0j
39.84	 0j
39.85	 0j
39.86	 0j
39.87	 0j
39.88	 0j
39.89	 0j
39.9	 0j
39.910000000000004	 0j
39.92	 0j
39.93	 0j
39.94	 0j
39.95	 0j
39.96	 0j
39.97	 0j
39.980000000000004	 0j
39.99	 0j
40.0	 0j
40.01	 0j
40.02	 0j
40.03	 0j
40.04	 0j
40.050000000000004	 0j
40.06	 0j
40.07	 0j
40.08	 0j
40.09	 0j
40.1	 0j
40.11	 0j
40.12	 0j
40.13	 0j
40.14	 0j
40.15	 0j
40.160000000000004	 0j
40.17	 0j
40.18	 0j
40.19	 0j
40.2	 0j
40.21	 0j
40.22	 0j
40.230000000000004	 0j
40.24	 0j
40.25	 0j
40.26	 0j
40.27	 0j
40.28	 0j
40.29	 0j
40.300000000000004	 0j
40.31	 0j
40.32	 0j
40.33	 0j
40.34	 0j
40.35	 0j
40.36	 0j
40.37	 0j
40.38	 0j
40.39	 0j
40.4	 0j
40.410000000000004	 0j
40.42	 0j
40.43	 0j
40.44	 0j
40.45	 0j
40.46	 0j
40.47	 0j
40.480000000000004	 0j
40.49	 0j
40.5	 0j
40.51	 0j
40.52	 0j
40.53	 0j
40.54	 0j
40.550000000000004	 0j
40.56	 0j
40.57	 0j
40.58	 0j
40.59	 0j
40.6	 0j
40.61	 0j
40.62	 0j
40.63	 0j
40.64	 0j
40.65	 0j
40.660000000000004	 0j
40.67	 0j
40.68	 0j
40.69	 0j
40.7	 0j
40.71	 0j
40.72	 0j
40.730000000000004	 0j
40.74	 0j
40.75	 0j
40.76	 0j
40.77	 0j
40.78	 0j
40.79	 0j
40.800000000000004	 0j
40.81	 0j
40.82	 0j
40.83	 0j
40.84	 0j
40.85	 0j
40.86	 0j
40.87	 0j
40.88	 0j
40.89	 0j
40.9	 0j
40.910000000000004	 0j
40.92	 0j
40.93	 0j
40.94	 0j
40.95	 0j
40.96	 0j
40.97	 0j
40.980000000000004	 0j
40.99	 0j
41.0	 0j
41.01	 0j
41.02	 0j
41.03	 0j
41.04	 0j
41.050000000000004	 0j
41.06	 0j
41.07	 0j
41.08	 0j
41.09	 0j
41.1	 0j
41.11	 0j
41.12	 0j
41.13	 0j
41.14	 0j
41.15	 0j
41.160000000000004	 0j
41.17	 0j
41.18	 0j
41.19	 0j
41.2	 0j
41.21	 0j
41.22	 0j
41.230000000000004	 0j
41.24	 0j
41.25	 0j
41.26	 0j
41.27	 0j
41.28	 0j
41.29	 0j
41.300000000000004	 0j
41.31	 0j
41.32	 0j
41.33	 0j
41.34	 0j
41.35	 0j
41.36	 0j
41.37	 0j
41.38	 0j
41.39	 0j
41.4	 0j
41.410000000000004	 0j
41.42	 0j
41.43	 0j
41.44	 0j
41.45	 0j
41.46	 0j
41.47	 0j
41.480000000000004	 0j
41.49	 0j
41.5	 0j
41.51	 0j
41.52	 0j
41.53	 0j
41.54	 0j
41.550000000000004	 0j
41.56	 0j
41.57	 0j
41.58	 0j
41.59	 0j
41.6	 0j
41.61	 0j
41.62	 0j
41.63	 0j
41.64	 0j
41.65	 0j
41.660000000000004	 0j
41.67	 0j
41.68	 0j
41.69	 0j
41.7	 0j
41.71	 0j
41.72	 0j
41.730000000000004	 0j
41.74	 0j
41.75	 0j
41.76	 0j
41.77	 0j
41.78	 0j
41.79	 0j
41.800000000000004	 0j
41.81	 0j
41.82	 0j
41.83	 0j
41.84	 0j
41.85	 0j
41.86	 0j
41.87	 0j
41.88	 0j
41.89	 0j
41.9	 0j
41.910000000000004	 0j
41.92	 0j
41.93	 0j
41.94	 0j
41.95	 0j
41.96	 0j
41.97	 0j
41.980000000000004	 0j
41.99	 0j
42.0	 0j
42.01	 0j
42.02	 0j
42.03	 0j
42.04	 0j
42.050000000000004	 0j
42.06	 0j
42.07	 0j
42.08	 0j
42.09	 0j
42.1	 0j
42.11	 0j
42.12	 0j
42.13	 0j
42.14	 0j
42.15	 0j
42.160000000000004	 0j
42.17	 0j
42.18	 0j
42.19	 0j
42.2	 0j
42.21	 0j
42.22	 0j
42.230000000000004	 0j
42.24	 0j
42.25	 0j
42.26	 0j
42.27	 0j
42.28	 0j
42.29	 0j
42.300000000000004	 0j
42.31	 0j
42.32	 0j
42.33	 0j
42.34	 0j
42.35	 0j
42.36	 0j
42.37	 0j
42.38	 0j
42.39	 0j
42.4	 0j
42.410000000000004	 0j
42.42	 0j
42.43	 0j
42.44	 0j
42.45	 0j
42.46	 0j
42.47	 0j
42.480000000000004	 0j
42.49	 0j
42.5	 0j
42.51	 0j
42.52	 0j
42.53	 0j
42.54	 0j
42.550000000000004	 0j
42.56	 0j
42.57	 0j
42.58	 0j
42.59	 0j
42.6	 0j
42.61	 0j
42.62	 0j
42.63	 0j
42.64	 0j
42.65	 0j
42.660000000000004	 0j
42.67	 0j
42.68	 0j
42.69	 0j
42.7	 0j
42.71	 0j
42.72	 0j
42.730000000000004	 0j
42.74	 0j
42.75	 0j
42.76	 0j
42.77	 0j
42.78	 0j
42.79	 0j
42.800000000000004	 0j
42.81	 0j
42.82	 0j
42.83	 0j
42.84	 0j
42.85	 0j
42.86	 0j
42.87	 0j
42.88	 0j
42.89	 0j
42.9	 0j
42.910000000000004	 0j
42.92	 0j
42.93	 0j
42.94	 0j
42.95	 0j
42.96	 0j
42.97	 0j
42.980000000000004	 0j
42.99	 0j
43.0	 0j
43.01	 0j
43.02	 0j
43.03	 0j
43.04	 0j
43.050000000000004	 0j
43.06	 0j
43.07	 0j
43.08	 0j
43.09	 0j
43.1	 0j
43.11	 0j
43.12	 0j
43.13	 0j
43.14	 0j
43.15	 0j
43.160000000000004	 0j
43.17	 0j
43.18	 0j
43.19	 0j
43.2	 0j
43.21	 0j
43.22	 0j
43.230000000000004	 0j
43.24	 0j
43.25	 0j
43.26	 0j
43.27	 0j
43.28	 0j
43.29	 0j
43.300000000000004	 0j
43.31	 0j
43.32	 0j
43.33	 0j
43.34	 0j
43.35	 0j
43.36	 0j
43.37	 0j
43.38	 0j
43.39	 0j
43.4	 0j
43.410000000000004	 0j
43.42	 0j
43.43	 0j
43.44	 0j
43.45	 0j
43.46	 0j
43.47	 0j
43.480000000000004	 0j
43.49	 0j
43.5	 0j
43.51	 0j
43.52	 0j
43.53	 0j
43.54	 0j
43.550000000000004	 0j
43.56	 0j
43.57	 0j
43.58	 0j
43.59	 0j
43.6	 0j
43.61	 0j
43.62	 0j
43.63	 0j
43.64	 0j
43.65	 0j
43.660000000000004	 0j
43.67	 0j
43.68	 0j
43.69	 0j
43.7	 0j
43.71	 0j
43.72	 0j
43.730000000000004	 0j
43.74	 0j
43.75	 0j
43.76	 0j
43.77	 0j
43.78	 0j
43.79	 0j
43.800000000000004	 0j
43.81	 0j
43.82	 0j
43.83	 0j
43.84	 0j
43.85	 0j
43.86	 0j
43.87	 0j
43.88	 0j
43.89	 0j
43.9	 0j
43.910000000000004	 0j
43.92	 0j
43.93	 0j
43.94	 0j
43.95	 0j
43.96	 0j
43.97	 0j
43.980000000000004	 0j
43.99	 0j
44.0	 0j
44.01	 0j
44.02	 0j
44.03	 0j
44.04	 0j
44.050000000000004	 0j
44.06	 0j
44.07	 0j
44.08	 0j
44.09	 0j
44.1	 0j
44.11	 0j
44.12	 0j
44.13	 0j
44.14	 0j
44.15	 0j
44.160000000000004	 0j
44.17	 0j
44.18	 0j
44.19	 0j
44.2	 0j
44.21	 0j
44.22	 0j
44.230000000000004	 0j
44.24	 0j
44.25	 0j
44.26	 0j
44.27	 0j
44.28	 0j
44.29	 0j
44.300000000000004	 0j
44.31	 0j
44.32	 0j
44.33	 0j
44.34	 0j
44.35	 0j
44.36	 0j
44.37	 0j
44.38	 0j
44.39	 0j
44.4	 0j
44.410000000000004	 0j
44.42	 0j
44.43	 0j
44.44	 0j
44.45	 0j
44.46	 0j
44.47	 0j
44.480000000000004	 0j
44.49	 0j
44.5	 0j
44.51	 0j
44.52	 0j
44.53	 0j
44.54	 0j
44.550000000000004	 0j
44.56	 0j
44.57	 0j
44.58	 0j
44.59	 0j
44.6	 0j
44.61	 0j
44.62	 0j
44.63	 0j
44.64	 0j
44.65	 0j
44.660000000000004	 0j
44.67	 0j
44.68	 0j
44.69	 0j
44.7	 0j
44.71	 0j
44.72	 0j
44.730000000000004	 0j
44.74	 0j
44.75	 0j
44.76	 0j
44.77	 0j
44.78	 0j
44.79	 0j
44.800000000000004	 0j
44.81	 0j
44.82	 0j
44.83	 0j
44.84	 0j
44.85	 0j
44.86	 0j
44.87	 0j
44.88	 0j
44.89	 0j
44.9	 0j
44.910000000000004	 0j
44.92	 0j
44.93	 0j
44.94	 0j
44.95	 0j
44.96	 0j
44.97	 0j
44.980000000000004	 0j
44.99	 0j
45.0	 0j
45.01	 0j
45.02	 0j
45.03	 0j
45.04	 0j
45.050000000000004	 0j
45.06	 0j
45.07	 0j
45.08	 0j
45.09	 0j
45.1	 0j
45.11	 0j
45.12	 0j
45.13	 0j
45.14	 0j
45.15	 0j
45.160000000000004	 0j
45.17	 0j
45.18	 0j
45.19	 0j
45.2	 0j
45.21	 0j
45.22	 0j
45.230000000000004	 0j
45.24	 0j
45.25	 0j
45.26	 0j
45.27	 0j
45.28	 0j
45.29	 0j
45.300000000000004	 0j
45.31	 0j
45.32	 0j
45.33	 0j
45.34	 0j
45.35	 0j
45.36	 0j
45.37	 0j
45.38	 0j
45.39	 0j
45.4	 0j
45.410000000000004	 0j
45.42	 0j
45.43	 0j
45.44	 0j
45.45	 0j
45.46	 0j
45.47	 0j
45.480000000000004	 0j
45.49	 0j
45.5	 0j
45.51	 0j
45.52	 0j
45.53	 0j
45.54	 0j
45.550000000000004	 0j
45.56	 0j
45.57	 0j
45.58	 0j
45.59	 0j
45.6	 0j
45.61	 0j
45.62	 0j
45.63	 0j
45.64	 0j
45.65	 0j
45.660000000000004	 0j
45.67	 0j
45.68	 0j
45.69	 0j
45.7	 0j
45.71	 0j
45.72	 0j
45.730000000000004	 0j
45.74	 0j
45.75	 0j
45.76	 0j
45.77	 0j
45.78	 0j
45.79	 0j
45.800000000000004	 0j
45.81	 0j
45.82	 0j
45.83	 0j
45.84	 0j
45.85	 0j
45.86	 0j
45.87	 0j
45.88	 0j
45.89	 0j
45.9	 0j
45.910000000000004	 0j
45.92	 0j
45.93	 0j
45.94	 0j
45.95	 0j
45.96	 0j
45.97	 0j
45.980000000000004	 0j
45.99	 0j
46.0	 0j
46.01	 0j
46.02	 0j
46.03	 0j
46.04	 0j
46.050000000000004	 0j
46.06	 0j
46.07	 0j
46.08	 0j
46.09	 0j
46.1	 0j
46.11	 0j
46.12	 0j
46.13	 0j
46.14	 0j
46.15	 0j
46.160000000000004	 0j
46.17	 0j
46.18	 0j
46.19	 0j
46.2	 0j
46.21	 0j
46.22	 0j
46.230000000000004	 0j
46.24	 0j
46.25	 0j
46.26	 0j
46.27	 0j
46.28	 0j
46.29	 0j
46.300000000000004	 0j
46.31	 0j
46.32	 0j
46.33	 0j
46.34	 0j
46.35	 0j
46.36	 0j
46.37	 0j
46.38	 0j
46.39	 0j
46.4	 0j
46.410000000000004	 0j
46.42	 0j
46.43	 0j
46.44	 0j
46.45	 0j
46.46	 0j
46.47	 0j
46.480000000000004	 0j
46.49	 0j
46.5	 0j
46.51	 0j
46.52	 0j
46.53	 0j
46.54	 0j
46.550000000000004	 0j
46.56	 0j
46.57	 0j
46.58	 0j
46.59	 0j
46.6	 0j
46.61	 0j
46.62	 0j
46.63	 0j
46.64	 0j
46.65	 0j
46.660000000000004	 0j
46.67	 0j
46.68	 0j
46.69	 0j
46.7	 0j
46.71	 0j
46.72	 0j
46.730000000000004	 0j
46.74	 0j
46.75	 0j
46.76	 0j
46.77	 0j
46.78	 0j
46.79	 0j
46.800000000000004	 0j
46.81	 0j
46.82	 0j
46.83	 0j
46.84	 0j
46.85	 0j
46.86	 0j
46.87	 0j
46.88	 0j
46.89	 0j
46.9	 0j
46.910000000000004	 0j
46.92	 0j
46.93	 0j
46.94	 0j
46.95	 0j
46.96	 0j
46.97	 0j
46.980000000000004	 0j
46.99	 0j
47.0	 0j
47.01	 0j
47.02	 0j
47.03	 0j
47.04	 0j
47.050000000000004	 0j
47.06	 0j
47.07	 0j
47.08	 0j
47.09	 0j
47.1	 0j
47.11	 0j
47.12	 0j
47.13	 0j
47.14	 0j
47.15	 0j
47.160000000000004	 0j
47.17	 0j
47.18	 0j
47.19	 0j
47.2	 0j
47.21	 0j
47.22	 0j
47.230000000000004	 0j
47.24	 0j
47.25	 0j
47.26	 0j
47.27	 0j
47.28	 0j
47.29	 0j
47.300000000000004	 0j
47.31	 0j
47.32	 0j
47.33	 0j
47.34	 0j
47.35	 0j
47.36	 0j
47.37	 0j
47.38	 0j
47.39	 0j
47.4	 0j
47.410000000000004	 0j
47.42	 0j
47.43	 0j
47.44	 0j
47.45	 0j
47.46	 0j
47.47	 0j
47.480000000000004	 0j
47.49	 0j
47.5	 0j
47.51	 0j
47.52	 0j
47.53	 0j
47.54	 0j
47.550000000000004	 0j
47.56	 0j
47.57	 0j
47.58	 0j
47.59	 0j
47.6	 0j
47.61	 0j
47.62	 0j
47.63	 0j
47.64	 0j
47.65	 0j
47.660000000000004	 0j
47.67	 0j
47.68	 0j
47.69	 0j
47.7	 0j
47.71	 0j
47.72	 0j
47.730000000000004	 0j
47.74	 0j
47.75	 0j
47.76	 0j
47.77	 0j
47.78	 0j
47.79	 0j
47.800000000000004	 0j
47.81	 0j
47.82	 0j
47.83	 0j
47.84	 0j
47.85	 0j
47.86	 0j
47.870000000000005	 0j
47.88	 0j
47.89	 0j
47.9	 0j
47.910000000000004	 0j
47.92	 0j
47.93	 0j
47.94	 0j
47.95	 0j
47.96	 0j
47.97	 0j
47.980000000000004	 0j
47.99	 0j
48.0	 0j
48.01	 0j
48.02	 0j
48.03	 0j
48.04	 0j
48.050000000000004	 0j
48.06	 0j
48.07	 0j
48.08	 0j
48.09	 0j
48.1	 0j
48.11	 0j
48.120000000000005	 0j
48.13	 0j
48.14	 0j
48.15	 0j
48.160000000000004	 0j
48.17	 0j
48.18	 0j
48.19	 0j
48.2	 0j
48.21	 0j
48.22	 0j
48.230000000000004	 0j
48.24	 0j
48.25	 0j
48.26	 0j
48.27	 0j
48.28	 0j
48.29	 0j
48.300000000000004	 0j
48.31	 0j
48.32	 0j
48.33	 0j
48.34	 0j
48.35	 0j
48.36	 0j
48.370000000000005	 0j
48.38	 0j
48.39	 0j
48.4	 0j
48.410000000000004	 0j
48.42	 0j
48.43	 0j
48.44	 0j
48.45	 0j
48.46	 0j
48.47	 0j
48.480000000000004	 0j
48.49	 0j
48.5	 0j
48.51	 0j
48.52	 0j
48.53	 0j
48.54	 0j
48.550000000000004	 0j
48.56	 0j
48.57	 0j
48.58	 0j
48.59	 0j
48.6	 0j
48.61	 0j
48.620000000000005	 0j
48.63	 0j
48.64	 0j
48.65	 0j
48.660000000000004	 0j
48.67	 0j
48.68	 0j
48.69	 0j
48.7	 0j
48.71	 0j
48.72	 0j
48.730000000000004	 0j
48.74	 0j
48.75	 0j
48.76	 0j
48.77	 0j
48.78	 0j
48.79	 0j
48.800000000000004	 0j
48.81	 0j
48.82	 0j
48.83	 0j
48.84	 0j
48.85	 0j
48.86	 0j
48.870000000000005	 0j
48.88	 0j
48.89	 0j
48.9	 0j
48.910000000000004	 0j
48.92	 0j
48.93	 0j
48.94	 0j
48.95	 0j
48.96	 0j
48.97	 0j
48.980000000000004	 0j
48.99	 0j
49.0	 0j
49.01	 0j
49.02	 0j
49.03	 0j
49.04	 0j
49.050000000000004	 0j
49.06	 0j
49.07	 0j
49.08	 0j
49.09	 0j
49.1	 0j
49.11	 0j
49.120000000000005	 0j
49.13	 0j
49.14	 0j
49.15	 0j
49.160000000000004	 0j
49.17	 0j
49.18	 0j
49.19	 0j
49.2	 0j
49.21	 0j
49.22	 0j
49.230000000000004	 0j
49.24	 0j
49.25	 0j
49.26	 0j
49.27	 0j
49.28	 0j
49.29	 0j
49.300000000000004	 0j
49.31	 0j
49.32	 0j
49.33	 0j
49.34	 0j
49.35	 0j
49.36	 0j
49.370000000000005	 0j
49.38	 0j
49.39	 0j
49.4	 0j
49.410000000000004	 0j
49.42	 0j
49.43	 0j
49.44	 0j
49.45	 0j
49.46	 0j
49.47	 0j
49.480000000000004	 0j
49.49	 0j
49.5	 0j
49.51	 0j
49.52	 0j
49.53	 0j
49.54	 0j
49.550000000000004	 0j
49.56	 0j
49.57	 0j
49.58	 0j
49.59	 0j
49.6	 0j
49.61	 0j
49.620000000000005	 0j
49.63	 0j
49.64	 0j
49.65	 0j
49.660000000000004	 0j
49.67	 0j
49.68	 0j
49.69	 0j
49.7	 0j
49.71	 0j
49.72	 0j
49.730000000000004	 0j
49.74	 0j
49.75	 0j
49.76	 0j
49.77	 0j
49.78	 0j
49.79	 0j
49.800000000000004	 0j
49.81	 0j
49.82	 0j
49.83	 0j
49.84	 0j
49.85	 0j
49.86	 0j
49.870000000000005	 0j
49.88	 0j
49.89	 0j
49.9	 0j
49.910000000000004	 0j
49.92	 0j
49.93	 0j
49.94	 0j
49.95	 0j
49.96	 0j
49.97	 0j
49.980000000000004	 0j
49.99	 0j
50.0	 0j
50.01	 0j
50.02	 0j
50.03	 0j
50.04	 0j
50.050000000000004	 0j
50.06	 0j
50.07	 0j
50.08	 0j
50.09	 0j
50.1	 0j
50.11	 0j
50.120000000000005	 0j
50.13	 0j
50.14	 0j
50.15	 0j
50.160000000000004	 0j
50.17	 0j
50.18	 0j
50.19	 0j
50.2	 0j
50.21	 0j
50.22	 0j
50.230000000000004	 0j
50.24	 0j
50.25	 0j
50.26	 0j
50.27	 0j
50.28	 0j
50.29	 0j
50.300000000000004	 0j
50.31	 0j
50.32	 0j
50.33	 0j
50.34	 0j
50.35	 0j
50.36	 0j
50.370000000000005	 0j
50.38	 0j
50.39	 0j
50.4	 0j
50.410000000000004	 0j
50.42	 0j
50.43	 0j
50.44	 0j
50.45	 0j
50.46	 0j
50.47	 0j
50.480000000000004	 0j
50.49	 0j
50.5	 0j
50.51	 0j
50.52	 0j
50.53	 0j
50.54	 0j
50.550000000000004	 0j
50.56	 0j
50.57	 0j
50.58	 0j
50.59	 0j
50.6	 0j
50.61	 0j
50.620000000000005	 0j
50.63	 0j
50.64	 0j
50.65	 0j
50.660000000000004	 0j
50.67	 0j
50.68	 0j
50.69	 0j
50.7	 0j
50.71	 0j
50.72	 0j
50.730000000000004	 0j
50.74	 0j
50.75	 0j
50.76	 0j
50.77	 0j
50.78	 0j
50.79	 0j
50.800000000000004	 0j
50.81	 0j
50.82	 0j
50.83	 0j
50.84	 0j
50.85	 0j
50.86	 0j
50.870000000000005	 0j
50.88	 0j
50.89	 0j
50.9	 0j
50.910000000000004	 0j
50.92	 0j
50.93	 0j
50.94	 0j
50.95	 0j
50.96	 0j
50.97	 0j
50.980000000000004	 0j
50.99	 0j
51.0	 0j
51.01	 0j
51.02	 0j
51.03	 0j
51.04	 0j
51.050000000000004	 0j
51.06	 0j
51.07	 0j
51.08	 0j
51.09	 0j
51.1	 0j
51.11	 0j
51.120000000000005	 0j
51.13	 0j
51.14	 0j
51.15	 0j
51.160000000000004	 0j
51.17	 0j
51.18	 0j
51.19	 0j
51.2	 0j
51.21	 0j
51.22	 0j
51.230000000000004	 0j
51.24	 0j
51.25	 0j
51.26	 0j
51.27	 0j
51.28	 0j
51.29	 0j
51.300000000000004	 0j
51.31	 0j
51.32	 0j
51.33	 0j
51.34	 0j
51.35	 0j
51.36	 0j
51.370000000000005	 0j
51.38	 0j
51.39	 0j
51.4	 0j
51.410000000000004	 0j
51.42	 0j
51.43	 0j
51.44	 0j
51.45	 0j
51.46	 0j
51.47	 0j
51.480000000000004	 0j
51.49	 0j
51.5	 0j
51.51	 0j
51.52	 0j
51.53	 0j
51.54	 0j
51.550000000000004	 0j
51.56	 0j
51.57	 0j
51.58	 0j
51.59	 0j
51.6	 0j
51.61	 0j
51.620000000000005	 0j
51.63	 0j
51.64	 0j
51.65	 0j
51.660000000000004	 0j
51.67	 0j
51.68	 0j
51.69	 0j
51.7	 0j
51.71	 0j
51.72	 0j
51.730000000000004	 0j
51.74	 0j
51.75	 0j
51.76	 0j
51.77	 0j
51.78	 0j
51.79	 0j
51.800000000000004	 0j
51.81	 0j
51.82	 0j
51.83	 0j
51.84	 0j
51.85	 0j
51.86	 0j
51.870000000000005	 0j
51.88	 0j
51.89	 0j
51.9	 0j
51.910000000000004	 0j
51.92	 0j
51.93	 0j
51.94	 0j
51.95	 0j
51.96	 0j
51.97	 0j
51.980000000000004	 0j
51.99	 0j
52.0	 0j
52.01	 0j
52.02	 0j
52.03	 0j
52.04	 0j
52.050000000000004	 0j
52.06	 0j
52.07	 0j
52.08	 0j
52.09	 0j
52.1	 0j
52.11	 0j
52.120000000000005	 0j
52.13	 0j
52.14	 0j
52.15	 0j
52.160000000000004	 0j
52.17	 0j
52.18	 0j
52.19	 0j
52.2	 0j
52.21	 0j
52.22	 0j
52.230000000000004	 0j
52.24	 0j
52.25	 0j
52.26	 0j
52.27	 0j
52.28	 0j
52.29	 0j
52.300000000000004	 0j
52.31	 0j
52.32	 0j
52.33	 0j
52.34	 0j
52.35	 0j
52.36	 0j
52.370000000000005	 0j
52.38	 0j
52.39	 0j
52.4	 0j
52.410000000000004	 0j
52.42	 0j
52.43	 0j
52.44	 0j
52.45	 0j
52.46	 0j
52.47	 0j
52.480000000000004	 0j
52.49	 0j
52.5	 0j
52.51	 0j
52.52	 0j
52.53	 0j
52.54	 0j
52.550000000000004	 0j
52.56	 0j
52.57	 0j
52.58	 0j
52.59	 0j
52.6	 0j
52.61	 0j
52.620000000000005	 0j
52.63	 0j
52.64	 0j
52.65	 0j
52.660000000000004	 0j
52.67	 0j
52.68	 0j
52.69	 0j
52.7	 0j
52.71	 0j
52.72	 0j
52.730000000000004	 0j
52.74	 0j
52.75	 0j
52.76	 0j
52.77	 0j
52.78	 0j
52.79	 0j
52.800000000000004	 0j
52.81	 0j
52.82	 0j
52.83	 0j
52.84	 0j
52.85	 0j
52.86	 0j
52.870000000000005	 0j
52.88	 0j
52.89	 0j
52.9	 0j
52.910000000000004	 0j
52.92	 0j
52.93	 0j
52.94	 0j
52.95	 0j
52.96	 0j
52.97	 0j
52.980000000000004	 0j
52.99	 0j
53.0	 0j
53.01	 0j
53.02	 0j
53.03	 0j
53.04	 0j
53.050000000000004	 0j
53.06	 0j
53.07	 0j
53.08	 0j
53.09	 0j
53.1	 0j
53.11	 0j
53.120000000000005	 0j
53.13	 0j
53.14	 0j
53.15	 0j
53.160000000000004	 0j
53.17	 0j
53.18	 0j
53.19	 0j
53.2	 0j
53.21	 0j
53.22	 0j
53.230000000000004	 0j
53.24	 0j
53.25	 0j
53.26	 0j
53.27	 0j
53.28	 0j
53.29	 0j
53.300000000000004	 0j
53.31	 0j
53.32	 0j
53.33	 0j
53.34	 0j
53.35	 0j
53.36	 0j
53.370000000000005	 0j
53.38	 0j
53.39	 0j
53.4	 0j
53.410000000000004	 0j
53.42	 0j
53.43	 0j
53.44	 0j
53.45	 0j
53.46	 0j
53.47	 0j
53.480000000000004	 0j
53.49	 0j
53.5	 0j
53.51	 0j
53.52	 0j
53.53	 0j
53.54	 0j
53.550000000000004	 0j
53.56	 0j
53.57	 0j
53.58	 0j
53.59	 0j
53.6	 0j
53.61	 0j
53.620000000000005	 0j
53.63	 0j
53.64	 0j
53.65	 0j
53.660000000000004	 0j
53.67	 0j
53.68	 0j
53.69	 0j
53.7	 0j
53.71	 0j
53.72	 0j
53.730000000000004	 0j
53.74	 0j
53.75	 0j
53.76	 0j
53.77	 0j
53.78	 0j
53.79	 0j
53.800000000000004	 0j
53.81	 0j
53.82	 0j
53.83	 0j
53.84	 0j
53.85	 0j
53.86	 0j
53.870000000000005	 0j
53.88	 0j
53.89	 0j
53.9	 0j
53.910000000000004	 0j
53.92	 0j
53.93	 0j
53.94	 0j
53.95	 0j
53.96	 0j
53.97	 0j
53.980000000000004	 0j
53.99	 0j
54.0	 0j
54.01	 0j
54.02	 0j
54.03	 0j
54.04	 0j
54.050000000000004	 0j
54.06	 0j
54.07	 0j
54.08	 0j
54.09	 0j
54.1	 0j
54.11	 0j
54.120000000000005	 0j
54.13	 0j
54.14	 0j
54.15	 0j
54.160000000000004	 0j
54.17	 0j
54.18	 0j
54.19	 0j
54.2	 0j
54.21	 0j
54.22	 0j
54.230000000000004	 0j
54.24	 0j
54.25	 0j
54.26	 0j
54.27	 0j
54.28	 0j
54.29	 0j
54.300000000000004	 0j
54.31	 0j
54.32	 0j
54.33	 0j
54.34	 0j
54.35	 0j
54.36	 0j
54.370000000000005	 0j
54.38	 0j
54.39	 0j
54.4	 0j
54.410000000000004	 0j
54.42	 0j
54.43	 0j
54.44	 0j
54.45	 0j
54.46	 0j
54.47	 0j
54.480000000000004	 0j
54.49	 0j
54.5	 0j
54.51	 0j
54.52	 0j
54.53	 0j
54.54	 0j
54.550000000000004	 0j
54.56	 0j
54.57	 0j
54.58	 0j
54.59	 0j
54.6	 0j
54.61	 0j
54.620000000000005	 0j
54.63	 0j
54.64	 0j
54.65	 0j
54.660000000000004	 0j
54.67	 0j
54.68	 0j
54.69	 0j
54.7	 0j
54.71	 0j
54.72	 0j
54.730000000000004	 0j
54.74	 0j
54.75	 0j
54.76	 0j
54.77	 0j
54.78	 0j
54.79	 0j
54.800000000000004	 0j
54.81	 0j
54.82	 0j
54.83	 0j
54.84	 0j
54.85	 0j
54.86	 0j
54.870000000000005	 0j
54.88	 0j
54.89	 0j
54.9	 0j
54.910000000000004	 0j
54.92	 0j
54.93	 0j
54.94	 0j
54.95	 0j
54.96	 0j
54.97	 0j
54.980000000000004	 0j
54.99	 0j
55.0	 0j
55.01	 0j
55.02	 0j
55.03	 0j
55.04	 0j
55.050000000000004	 0j
55.06	 0j
55.07	 0j
55.08	 0j
55.09	 0j
55.1	 0j
55.11	 0j
55.120000000000005	 0j
55.13	 0j
55.14	 0j
55.15	 0j
55.160000000000004	 0j
55.17	 0j
55.18	 0j
55.19	 0j
55.2	 0j
55.21	 0j
55.22	 0j
55.230000000000004	 0j
55.24	 0j
55.25	 0j
55.26	 0j
55.27	 0j
55.28	 0j
55.29	 0j
55.300000000000004	 0j
55.31	 0j
55.32	 0j
55.33	 0j
55.34	 0j
55.35	 0j
55.36	 0j
55.370000000000005	 0j
55.38	 0j
55.39	 0j
55.4	 0j
55.410000000000004	 0j
55.42	 0j
55.43	 0j
55.44	 0j
55.45	 0j
55.46	 0j
55.47	 0j
55.480000000000004	 0j
55.49	 0j
55.5	 0j
55.51	 0j
55.52	 0j
55.53	 0j
55.54	 0j
55.550000000000004	 0j
55.56	 0j
55.57	 0j
55.58	 0j
55.59	 0j
55.6	 0j
55.61	 0j
55.620000000000005	 0j
55.63	 0j
55.64	 0j
55.65	 0j
55.660000000000004	 0j
55.67	 0j
55.68	 0j
55.69	 0j
55.7	 0j
55.71	 0j
55.72	 0j
55.730000000000004	 0j
55.74	 0j
55.75	 0j
55.76	 0j
55.77	 0j
55.78	 0j
55.79	 0j
55.800000000000004	 0j
55.81	 0j
55.82	 0j
55.83	 0j
55.84	 0j
55.85	 0j
55.86	 0j
55.870000000000005	 0j
55.88	 0j
55.89	 0j
55.9	 0j
55.910000000000004	 0j
55.92	 0j
55.93	 0j
55.94	 0j
55.95	 0j
55.96	 0j
55.97	 0j
55.980000000000004	 0j
55.99	 0j
56.0	 0j
56.01	 0j
56.02	 0j
56.03	 0j
56.04	 0j
56.050000000000004	 0j
56.06	 0j
56.07	 0j
56.08	 0j
56.09	 0j
56.1	 0j
56.11	 0j
56.120000000000005	 0j
56.13	 0j
56.14	 0j
56.15	 0j
56.160000000000004	 0j
56.17	 0j
56.18	 0j
56.19	 0j
56.2	 0j
56.21	 0j
56.22	 0j
56.230000000000004	 0j
56.24	 0j
56.25	 0j
56.26	 0j
56.27	 0j
56.28	 0j
56.29	 0j
56.300000000000004	 0j
56.31	 0j
56.32	 0j
56.33	 0j
56.34	 0j
56.35	 0j
56.36	 0j
56.370000000000005	 0j
56.38	 0j
56.39	 0j
56.4	 0j
56.410000000000004	 0j
56.42	 0j
56.43	 0j
56.44	 0j
56.45	 0j
56.46	 0j
56.47	 0j
56.480000000000004	 0j
56.49	 0j
56.5	 0j
56.51	 0j
56.52	 0j
56.53	 0j
56.54	 0j
56.550000000000004	 0j
56.56	 0j
56.57	 0j
56.58	 0j
56.59	 0j
56.6	 0j
56.61	 0j
56.620000000000005	 0j
56.63	 0j
56.64	 0j
56.65	 0j
56.660000000000004	 0j
56.67	 0j
56.68	 0j
56.69	 0j
56.7	 0j
56.71	 0j
56.72	 0j
56.730000000000004	 0j
56.74	 0j
56.75	 0j
56.76	 0j
56.77	 0j
56.78	 0j
56.79	 0j
56.800000000000004	 0j
56.81	 0j
56.82	 0j
56.83	 0j
56.84	 0j
56.85	 0j
56.86	 0j
56.870000000000005	 0j
56.88	 0j
56.89	 0j
56.9	 0j
56.910000000000004	 0j
56.92	 0j
56.93	 0j
56.94	 0j
56.95	 0j
56.96	 0j
56.97	 0j
56.980000000000004	 0j
56.99	 0j
57.0	 0j
57.01	 0j
57.02	 0j
57.03	 0j
57.04	 0j
57.050000000000004	 0j
57.06	 0j
57.07	 0j
57.08	 0j
57.09	 0j
57.1	 0j
57.11	 0j
57.120000000000005	 0j
57.13	 0j
57.14	 0j
57.15	 0j
57.160000000000004	 0j
57.17	 0j
57.18	 0j
57.19	 0j
57.2	 0j
57.21	 0j
57.22	 0j
57.230000000000004	 0j
57.24	 0j
57.25	 0j
57.26	 0j
57.27	 0j
57.28	 0j
57.29	 0j
57.300000000000004	 0j
57.31	 0j
57.32	 0j
57.33	 0j
57.34	 0j
57.35	 0j
57.36	 0j
57.370000000000005	 0j
57.38	 0j
57.39	 0j
57.4	 0j
57.410000000000004	 0j
57.42	 0j
57.43	 0j
57.44	 0j
57.45	 0j
57.46	 0j
57.47	 0j
57.480000000000004	 0j
57.49	 0j
57.5	 0j
57.51	 0j
57.52	 0j
57.53	 0j
57.54	 0j
57.550000000000004	 0j
57.56	 0j
57.57	 0j
57.58	 0j
57.59	 0j
57.6	 0j
57.61	 0j
57.620000000000005	 0j
57.63	 0j
57.64	 0j
57.65	 0j
57.660000000000004	 0j
57.67	 0j
57.68	 0j
57.69	 0j
57.7	 0j
57.71	 0j
57.72	 0j
57.730000000000004	 0j
57.74	 0j
57.75	 0j
57.76	 0j
57.77	 0j
57.78	 0j
57.79	 0j
57.800000000000004	 0j
57.81	 0j
57.82	 0j
57.83	 0j
57.84	 0j
57.85	 0j
57.86	 0j
57.870000000000005	 0j
57.88	 0j
57.89	 0j
57.9	 0j
57.910000000000004	 0j
57.92	 0j
57.93	 0j
57.94	 0j
57.95	 0j
57.96	 0j
57.97	 0j
57.980000000000004	 0j
57.99	 0j
58.0	 0j
58.01	 0j
58.02	 0j
58.03	 0j
58.04	 0j
58.050000000000004	 0j
58.06	 0j
58.07	 0j
58.08	 0j
58.09	 0j
58.1	 0j
58.11	 0j
58.120000000000005	 0j
58.13	 0j
58.14	 0j
58.15	 0j
58.160000000000004	 0j
58.17	 0j
58.18	 0j
58.19	 0j
58.2	 0j
58.21	 0j
58.22	 0j
58.230000000000004	 0j
58.24	 0j
58.25	 0j
58.26	 0j
58.27	 0j
58.28	 0j
58.29	 0j
58.300000000000004	 0j
58.31	 0j
58.32	 0j
58.33	 0j
58.34	 0j
58.35	 0j
58.36	 0j
58.370000000000005	 0j
58.38	 0j
58.39	 0j
58.4	 0j
58.410000000000004	 0j
58.42	 0j
58.43	 0j
58.44	 0j
58.45	 0j
58.46	 0j
58.47	 0j
58.480000000000004	 0j
58.49	 0j
58.5	 0j
58.51	 0j
58.52	 0j
58.53	 0j
58.54	 0j
58.550000000000004	 0j
58.56	 0j
58.57	 0j
58.58	 0j
58.59	 0j
58.6	 0j
58.61	 0j
58.620000000000005	 0j
58.63	 0j
58.64	 0j
58.65	 0j
58.660000000000004	 0j
58.67	 0j
58.68	 0j
58.69	 0j
58.7	 0j
58.71	 0j
58.72	 0j
58.730000000000004	 0j
58.74	 0j
58.75	 0j
58.76	 0j
58.77	 0j
58.78	 0j
58.79	 0j
58.800000000000004	 0j
58.81	 0j
58.82	 0j
58.83	 0j
58.84	 0j
58.85	 0j
58.86	 0j
58.870000000000005	 0j
58.88	 0j
58.89	 0j
58.9	 0j
58.910000000000004	 0j
58.92	 0j
58.93	 0j
58.94	 0j
58.95	 0j
58.96	 0j
58.97	 0j
58.980000000000004	 0j
58.99	 0j
59.0	 0j
59.01	 0j
59.02	 0j
59.03	 0j
59.04	 0j
59.050000000000004	 0j
59.06	 0j
59.07	 0j
59.08	 0j
59.09	 0j
59.1	 0j
59.11	 0j
59.120000000000005	 0j
59.13	 0j
59.14	 0j
59.15	 0j
59.160000000000004	 0j
59.17	 0j
59.18	 0j
59.19	 0j
59.2	 0j
59.21	 0j
59.22	 0j
59.230000000000004	 0j
59.24	 0j
59.25	 0j
59.26	 0j
59.27	 0j
59.28	 0j
59.29	 0j
59.300000000000004	 0j
59.31	 0j
59.32	 0j
59.33	 0j
59.34	 0j
59.35	 0j
59.36	 0j
59.370000000000005	 0j
59.38	 0j
59.39	 0j
59.4	 0j
59.410000000000004	 0j
59.42	 0j
59.43	 0j
59.44	 0j
59.45	 0j
59.46	 0j
59.47	 0j
59.480000000000004	 0j
59.49	 0j
59.5	 0j
59.51	 0j
59.52	 0j
59.53	 0j
59.54	 0j
59.550000000000004	 0j
59.56	 0j
59.57	 0j
59.58	 0j
59.59	 0j
59.6	 0j
59.61	 0j
59.620000000000005	 0j
59.63	 0j
59.64	 0j
59.65	 0j
59.660000000000004	 0j
59.67	 0j
59.68	 0j
59.69	 0j
59.7	 0j
59.71	 0j
59.72	 0j
59.730000000000004	 0j
59.74	 0j
59.75	 0j
59.76	 0j
59.77	 0j
59.78	 0j
59.79	 0j
59.800000000000004	 0j
59.81	 0j
59.82	 0j
59.83	 0j
59.84	 0j
59.85	 0j
59.86	 0j
59.870000000000005	 0j
59.88	 0j
59.89	 0j
59.9	 0j
59.910000000000004	 0j
59.92	 0j
59.93	 0j
59.94	 0j
59.95	 0j
59.96	 0j
59.97	 0j
59.980000000000004	 0j
59.99	 0j
60.0	 0j
60.01	 0j
60.02	 0j
60.03	 0j
60.04	 0j
60.050000000000004	 0j
60.06	 0j
60.07	 0j
60.08	 0j
60.09	 0j
60.1	 0j
60.11	 0j
60.120000000000005	 0j
60.13	 0j
60.14	 0j
60.15	 0j
60.160000000000004	 0j
60.17	 0j
60.18	 0j
60.19	 0j
60.2	 0j
60.21	 0j
60.22	 0j
60.230000000000004	 0j
60.24	 0j
60.25	 0j
60.26	 0j
60.27	 0j
60.28	 0j
60.29	 0j
60.300000000000004	 0j
60.31	 0j
60.32	 0j
60.33	 0j
60.34	 0j
60.35	 0j
60.36	 0j
60.370000000000005	 0j
60.38	 0j
60.39	 0j
60.4	 0j
60.410000000000004	 0j
60.42	 0j
60.43	 0j
60.44	 0j
60.45	 0j
60.46	 0j
60.47	 0j
60.480000000000004	 0j
60.49	 0j
60.5	 0j
60.51	 0j
60.52	 0j
60.53	 0j
60.54	 0j
60.550000000000004	 0j
60.56	 0j
60.57	 0j
60.58	 0j
60.59	 0j
60.6	 0j
60.61	 0j
60.620000000000005	 0j
60.63	 0j
60.64	 0j
60.65	 0j
60.660000000000004	 0j
60.67	 0j
60.68	 0j
60.69	 0j
60.7	 0j
60.71	 0j
60.72	 0j
60.730000000000004	 0j
60.74	 0j
60.75	 0j
60.76	 0j
60.77	 0j
60.78	 0j
60.79	 0j
60.800000000000004	 0j
60.81	 0j
60.82	 0j
60.83	 0j
60.84	 0j
60.85	 0j
60.86	 0j
60.870000000000005	 0j
60.88	 0j
60.89	 0j
60.9	 0j
60.910000000000004	 0j
60.92	 0j
60.93	 0j
60.94	 0j
60.95	 0j
60.96	 0j
60.97	 0j
60.980000000000004	 0j
60.99	 0j
61.0	 0j
61.01	 0j
61.02	 0j
61.03	 0j
61.04	 0j
61.050000000000004	 0j
61.06	 0j
61.07	 0j
61.08	 0j
61.09	 0j
61.1	 0j
61.11	 0j
61.120000000000005	 0j
61.13	 0j
61.14	 0j
61.15	 0j
61.160000000000004	 0j
61.17	 0j
61.18	 0j
61.19	 0j
61.2	 0j
61.21	 0j
61.22	 0j
61.230000000000004	 0j
61.24	 0j
61.25	 0j
61.26	 0j
61.27	 0j
61.28	 0j
61.29	 0j
61.300000000000004	 0j
61.31	 0j
61.32	 0j
61.33	 0j
61.34	 0j
61.35	 0j
61.36	 0j
61.370000000000005	 0j
61.38	 0j
61.39	 0j
61.4	 0j
61.410000000000004	 0j
61.42	 0j
61.43	 0j
61.44	 0j
61.45	 0j
61.46	 0j
61.47	 0j
61.480000000000004	 0j
61.49	 0j
61.5	 0j
61.51	 0j
61.52	 0j
61.53	 0j
61.54	 0j
61.550000000000004	 0j
61.56	 0j
61.57	 0j
61.58	 0j
61.59	 0j
61.6	 0j
61.61	 0j
61.620000000000005	 0j
61.63	 0j
61.64	 0j
61.65	 0j
61.660000000000004	 0j
61.67	 0j
61.68	 0j
61.690000000000005	 0j
61.7	 0j
61.71	 0j
61.72	 0j
61.730000000000004	 0j
61.74	 0j
61.75	 0j
61.76	 0j
61.77	 0j
61.78	 0j
61.79	 0j
61.800000000000004	 0j
61.81	 0j
61.82	 0j
61.83	 0j
61.84	 0j
61.85	 0j
61.86	 0j
61.870000000000005	 0j
61.88	 0j
61.89	 0j
61.9	 0j
61.910000000000004	 0j
61.92	 0j
61.93	 0j
61.940000000000005	 0j
61.95	 0j
61.96	 0j
61.97	 0j
61.980000000000004	 0j
61.99	 0j
62.0	 0j
62.01	 0j
62.02	 0j
62.03	 0j
62.04	 0j
62.050000000000004	 0j
62.06	 0j
62.07	 0j
62.08	 0j
62.09	 0j
62.1	 0j
62.11	 0j
62.120000000000005	 0j
62.13	 0j
62.14	 0j
62.15	 0j
62.160000000000004	 0j
62.17	 0j
62.18	 0j
62.190000000000005	 0j
62.2	 0j
62.21	 0j
62.22	 0j
62.230000000000004	 0j
62.24	 0j
62.25	 0j
62.26	 0j
62.27	 0j
62.28	 0j
62.29	 0j
62.300000000000004	 0j
62.31	 0j
62.32	 0j
62.33	 0j
62.34	 0j
62.35	 0j
62.36	 0j
62.370000000000005	 0j
62.38	 0j
62.39	 0j
62.4	 0j
62.410000000000004	 0j
62.42	 0j
62.43	 0j
62.440000000000005	 0j
62.45	 0j
62.46	 0j
62.47	 0j
62.480000000000004	 0j
62.49	 0j
62.5	 0j
62.51	 0j
62.52	 0j
62.53	 0j
62.54	 0j
62.550000000000004	 0j
62.56	 0j
62.57	 0j
62.58	 0j
62.59	 0j
62.6	 0j
62.61	 0j
62.620000000000005	 0j
62.63	 0j
62.64	 0j
62.65	 0j
62.660000000000004	 0j
62.67	 0j
62.68	 0j
62.690000000000005	 0j
62.7	 0j
62.71	 0j
62.72	 0j
62.730000000000004	 0j
62.74	 0j
62.75	 0j
62.76	 0j
62.77	 0j
62.78	 0j
62.79	 0j
62.800000000000004	 0j
62.81	 0j
62.82	 0j
62.83	 0j
62.84	 0j
62.85	 0j
62.86	 0j
62.870000000000005	 0j
62.88	 0j
62.89	 0j
62.9	 0j
62.910000000000004	 0j
62.92	 0j
62.93	 0j
62.940000000000005	 0j
62.95	 0j
62.96	 0j
62.97	 0j
62.980000000000004	 0j
62.99	 0j
63.0	 0j
63.01	 0j
63.02	 0j
63.03	 0j
63.04	 0j
63.050000000000004	 0j
63.06	 0j
63.07	 0j
63.08	 0j
63.09	 0j
63.1	 0j
63.11	 0j
63.120000000000005	 0j
63.13	 0j
63.14	 0j
63.15	 0j
63.160000000000004	 0j
63.17	 0j
63.18	 0j
63.190000000000005	 0j
63.2	 0j
63.21	 0j
63.22	 0j
63.230000000000004	 0j
63.24	 0j
63.25	 0j
63.26	 0j
63.27	 0j
63.28	 0j
63.29	 0j
63.300000000000004	 0j
63.31	 0j
63.32	 0j
63.33	 0j
63.34	 0j
63.35	 0j
63.36	 0j
63.370000000000005	 0j
63.38	 0j
63.39	 0j
63.4	 0j
63.410000000000004	 0j
63.42	 0j
63.43	 0j
63.440000000000005	 0j
63.45	 0j
63.46	 0j
63.47	 0j
63.480000000000004	 0j
63.49	 0j
63.5	 0j
63.51	 0j
63.52	 0j
63.53	 0j
63.54	 0j
63.550000000000004	 0j
63.56	 0j
63.57	 0j
63.58	 0j
63.59	 0j
63.6	 0j
63.61	 0j
63.620000000000005	 0j
63.63	 0j
63.64	 0j
63.65	 0j
63.660000000000004	 0j
63.67	 0j
63.68	 0j
63.690000000000005	 0j
63.7	 0j
63.71	 0j
63.72	 0j
63.730000000000004	 0j
63.74	 0j
63.75	 0j
63.76	 0j
63.77	 0j
63.78	 0j
63.79	 0j
63.800000000000004	 0j
63.81	 0j
63.82	 0j
63.83	 0j
63.84	 0j
63.85	 0j
63.86	 0j
63.870000000000005	 0j
63.88	 0j
63.89	 0j
63.9	 0j
63.910000000000004	 0j
63.92	 0j
63.93	 0j
63.940000000000005	 0j
63.95	 0j
63.96	 0j
63.97	 0j
63.980000000000004	 0j
63.99	 0j
64.0	 0j
64.01	 0j
64.02	 0j
64.03	 0j
64.04	 0j
64.05	 0j
64.06	 0j
64.07000000000001	 0j
64.08	 0j
64.09	 0j
64.1	 0j
64.11	 0j
64.12	 0j
64.13	 0j
64.14	 0j
64.15	 0j
64.16	 0j
64.17	 0j
64.18	 0j
64.19	 0j
64.2	 0j
64.21000000000001	 0j
64.22	 0j
64.23	 0j
64.24	 0j
64.25	 0j
64.26	 0j
64.27	 0j
64.28	 0j
64.29	 0j
64.3	 0j
64.31	 0j
64.32000000000001	 0j
64.33	 0j
64.34	 0j
64.35	 0j
64.36	 0j
64.37	 0j
64.38	 0j
64.39	 0j
64.4	 0j
64.41	 0j
64.42	 0j
64.43	 0j
64.44	 0j
64.45	 0j
64.46000000000001	 0j
64.47	 0j
64.48	 0j
64.49	 0j
64.5	 0j
64.51	 0j
64.52	 0j
64.53	 0j
64.54	 0j
64.55	 0j
64.56	 0j
64.57000000000001	 0j
64.58	 0j
64.59	 0j
64.6	 0j
64.61	 0j
64.62	 0j
64.63	 0j
64.64	 0j
64.65	 0j
64.66	 0j
64.67	 0j
64.68	 0j
64.69	 0j
64.7	 0j
64.71000000000001	 0j
64.72	 0j
64.73	 0j
64.74	 0j
64.75	 0j
64.76	 0j
64.77	 0j
64.78	 0j
64.79	 0j
64.8	 0j
64.81	 0j
64.82000000000001	 0j
64.83	 0j
64.84	 0j
64.85	 0j
64.86	 0j
64.87	 0j
64.88	 0j
64.89	 0j
64.9	 0j
64.91	 0j
64.92	 0j
64.93	 0j
64.94	 0j
64.95	 0j
64.96000000000001	 0j
64.97	 0j
64.98	 0j
64.99	 0j
65.0	 0j
65.01	 0j
65.02	 0j
65.03	 0j
65.04	 0j
65.05	 0j
65.06	 0j
65.07000000000001	 0j
65.08	 0j
65.09	 0j
65.1	 0j
65.11	 0j
65.12	 0j
65.13	 0j
65.14	 0j
65.15	 0j
65.16	 0j
65.17	 0j
65.18	 0j
65.19	 0j
65.2	 0j
65.21000000000001	 0j
65.22	 0j
65.23	 0j
65.24	 0j
65.25	 0j
65.26	 0j
65.27	 0j
65.28	 0j
65.29	 0j
65.3	 0j
65.31	 0j
65.32000000000001	 0j
65.33	 0j
65.34	 0j
65.35	 0j
65.36	 0j
65.37	 0j
65.38	 0j
65.39	 0j
65.4	 0j
65.41	 0j
65.42	 0j
65.43	 0j
65.44	 0j
65.45	 0j
65.46000000000001	 0j
65.47	 0j
65.48	 0j
65.49	 0j
65.5	 0j
65.51	 0j
65.52	 0j
65.53	 0j
65.54	 0j
65.55	 0j
65.56	 0j
65.57000000000001	 0j
65.58	 0j
65.59	 0j
65.6	 0j
65.61	 0j
65.62	 0j
65.63	 0j
65.64	 0j
65.65	 0j
65.66	 0j
65.67	 0j
65.68	 0j
65.69	 0j
65.7	 0j
65.71000000000001	 0j
65.72	 0j
65.73	 0j
65.74	 0j
65.75	 0j
65.76	 0j
65.77	 0j
65.78	 0j
65.79	 0j
65.8	 0j
65.81	 0j
65.82000000000001	 0j
65.83	 0j
65.84	 0j
65.85	 0j
65.86	 0j
65.87	 0j
65.88	 0j
65.89	 0j
65.9	 0j
65.91	 0j
65.92	 0j
65.93	 0j
65.94	 0j
65.95	 0j
65.96000000000001	 0j
65.97	 0j
65.98	 0j
65.99	 0j
66.0	 0j
66.01	 0j
66.02	 0j
66.03	 0j
66.04	 0j
66.05	 0j
66.06	 0j
66.07000000000001	 0j
66.08	 0j
66.09	 0j
66.1	 0j
66.11	 0j
66.12	 0j
66.13	 0j
66.14	 0j
66.15	 0j
66.16	 0j
66.17	 0j
66.18	 0j
66.19	 0j
66.2	 0j
66.21000000000001	 0j
66.22	 0j
66.23	 0j
66.24	 0j
66.25	 0j
66.26	 0j
66.27	 0j
66.28	 0j
66.29	 0j
66.3	 0j
66.31	 0j
66.32000000000001	 0j
66.33	 0j
66.34	 0j
66.35	 0j
66.36	 0j
66.37	 0j
66.38	 0j
66.39	 0j
66.4	 0j
66.41	 0j
66.42	 0j
66.43	 0j
66.44	 0j
66.45	 0j
66.46000000000001	 0j
66.47	 0j
66.48	 0j
66.49	 0j
66.5	 0j
66.51	 0j
66.52	 0j
66.53	 0j
66.54	 0j
66.55	 0j
66.56	 0j
66.57000000000001	 0j
66.58	 0j
66.59	 0j
66.6	 0j
66.61	 0j
66.62	 0j
66.63	 0j
66.64	 0j
66.65	 0j
66.66	 0j
66.67	 0j
66.68	 0j
66.69	 0j
66.7	 0j
66.71000000000001	 0j
66.72	 0j
66.73	 0j
66.74	 0j
66.75	 0j
66.76	 0j
66.77	 0j
66.78	 0j
66.79	 0j
66.8	 0j
66.81	 0j
66.82000000000001	 0j
66.83	 0j
66.84	 0j
66.85	 0j
66.86	 0j
66.87	 0j
66.88	 0j
66.89	 0j
66.9	 0j
66.91	 0j
66.92	 0j
66.93	 0j
66.94	 0j
66.95	 0j
66.96000000000001	 0j
66.97	 0j
66.98	 0j
66.99	 0j
67.0	 0j
67.01	 0j
67.02	 0j
67.03	 0j
67.04	 0j
67.05	 0j
67.06	 0j
67.07000000000001	 0j
67.08	 0j
67.09	 0j
67.1	 0j
67.11	 0j
67.12	 0j
67.13	 0j
67.14	 0j
67.15	 0j
67.16	 0j
67.17	 0j
67.18	 0j
67.19	 0j
67.2	 0j
67.21000000000001	 0j
67.22	 0j
67.23	 0j
67.24	 0j
67.25	 0j
67.26	 0j
67.27	 0j
67.28	 0j
67.29	 0j
67.3	 0j
67.31	 0j
67.32000000000001	 0j
67.33	 0j
67.34	 0j
67.35	 0j
67.36	 0j
67.37	 0j
67.38	 0j
67.39	 0j
67.4	 0j
67.41	 0j
67.42	 0j
67.43	 0j
67.44	 0j
67.45	 0j
67.46000000000001	 0j
67.47	 0j
67.48	 0j
67.49	 0j
67.5	 0j
67.51	 0j
67.52	 0j
67.53	 0j
67.54	 0j
67.55	 0j
67.56	 0j
67.57000000000001	 0j
67.58	 0j
67.59	 0j
67.6	 0j
67.61	 0j
67.62	 0j
67.63	 0j
67.64	 0j
67.65	 0j
67.66	 0j
67.67	 0j
67.68	 0j
67.69	 0j
67.7	 0j
67.71000000000001	 0j
67.72	 0j
67.73	 0j
67.74	 0j
67.75	 0j
67.76	 0j
67.77	 0j
67.78	 0j
67.79	 0j
67.8	 0j
67.81	 0j
67.82000000000001	 0j
67.83	 0j
67.84	 0j
67.85	 0j
67.86	 0j
67.87	 0j
67.88	 0j
67.89	 0j
67.9	 0j
67.91	 0j
67.92	 0j
67.93	 0j
67.94	 0j
67.95	 0j
67.96000000000001	 0j
67.97	 0j
67.98	 0j
67.99	 0j
68.0	 0j
68.01	 0j
68.02	 0j
68.03	 0j
68.04	 0j
68.05	 0j
68.06	 0j
68.07000000000001	 0j
68.08	 0j
68.09	 0j
68.1	 0j
68.11	 0j
68.12	 0j
68.13	 0j
68.14	 0j
68.15	 0j
68.16	 0j
68.17	 0j
68.18	 0j
68.19	 0j
68.2	 0j
68.21000000000001	 0j
68.22	 0j
68.23	 0j
68.24	 0j
68.25	 0j
68.26	 0j
68.27	 0j
68.28	 0j
68.29	 0j
68.3	 0j
68.31	 0j
68.32000000000001	 0j
68.33	 0j
68.34	 0j
68.35000000000001	 0j
68.36	 0j
68.37	 0j
68.38	 0j
68.39	 0j
68.4	 0j
68.41	 0j
68.42	 0j
68.43	 0j
68.44	 0j
68.45	 0j
68.46000000000001	 0j
68.47	 0j
68.48	 0j
68.49	 0j
68.5	 0j
68.51	 0j
68.52	 0j
68.53	 0j
68.54	 0j
68.55	 0j
68.56	 0j
68.57000000000001	 0j
68.58	 0j
68.59	 0j
68.60000000000001	 0j
68.61	 0j
68.62	 0j
68.63	 0j
68.64	 0j
68.65	 0j
68.66	 0j
68.67	 0j
68.68	 0j
68.69	 0j
68.7	 0j
68.71000000000001	 0j
68.72	 0j
68.73	 0j
68.74	 0j
68.75	 0j
68.76	 0j
68.77	 0j
68.78	 0j
68.79	 0j
68.8	 0j
68.81	 0j
68.82000000000001	 0j
68.83	 0j
68.84	 0j
68.85000000000001	 0j
68.86	 0j
68.87	 0j
68.88	 0j
68.89	 0j
68.9	 0j
68.91	 0j
68.92	 0j
68.93	 0j
68.94	 0j
68.95	 0j
68.96000000000001	 0j
68.97	 0j
68.98	 0j
68.99	 0j
69.0	 0j
69.01	 0j
69.02	 0j
69.03	 0j
69.04	 0j
69.05	 0j
69.06	 0j
69.07000000000001	 0j
69.08	 0j
69.09	 0j
69.10000000000001	 0j
69.11	 0j
69.12	 0j
69.13	 0j
69.14	 0j
69.15	 0j
69.16	 0j
69.17	 0j
69.18	 0j
69.19	 0j
69.2	 0j
69.21000000000001	 0j
69.22	 0j
69.23	 0j
69.24	 0j
69.25	 0j
69.26	 0j
69.27	 0j
69.28	 0j
69.29	 0j
69.3	 0j
69.31	 0j
69.32000000000001	 0j
69.33	 0j
69.34	 0j
69.35000000000001	 0j
69.36	 0j
69.37	 0j
69.38	 0j
69.39	 0j
69.4	 0j
69.41	 0j
69.42	 0j
69.43	 0j
69.44	 0j
69.45	 0j
69.46000000000001	 0j
69.47	 0j
69.48	 0j
69.49	 0j
69.5	 0j
69.51	 0j
69.52	 0j
69.53	 0j
69.54	 0j
69.55	 0j
69.56	 0j
69.57000000000001	 0j
69.58	 0j
69.59	 0j
69.60000000000001	 0j
69.61	 0j
69.62	 0j
69.63	 0j
69.64	 0j
69.65	 0j
69.66	 0j
69.67	 0j
69.68	 0j
69.69	 0j
69.7	 0j
69.71000000000001	 0j
69.72	 0j
69.73	 0j
69.74	 0j
69.75	 0j
69.76	 0j
69.77	 0j
69.78	 0j
69.79	 0j
69.8	 0j
69.81	 0j
69.82000000000001	 0j
69.83	 0j
69.84	 0j
69.85000000000001	 0j
69.86	 0j
69.87	 0j
69.88	 0j
69.89	 0j
69.9	 0j
69.91	 0j
69.92	 0j
69.93	 0j
69.94	 0j
69.95	 0j
69.96000000000001	 0j
69.97	 0j
69.98	 0j
69.99	 0j
70.0	 0j
70.01	 0j
70.02	 0j
70.03	 0j
70.04	 0j
70.05	 0j
70.06	 0j
70.07000000000001	 0j
70.08	 0j
70.09	 0j
70.10000000000001	 0j
70.11	 0j
70.12	 0j
70.13	 0j
70.14	 0j
70.15	 0j
70.16	 0j
70.17	 0j
70.18	 0j
70.19	 0j
70.2	 0j
70.21000000000001	 0j
70.22	 0j
70.23	 0j
70.24	 0j
70.25	 0j
70.26	 0j
70.27	 0j
70.28	 0j
70.29	 0j
70.3	 0j
70.31	 0j
70.32000000000001	 0j
70.33	 0j
70.34	 0j
70.35000000000001	 0j
70.36	 0j
70.37	 0j
70.38	 0j
70.39	 0j
70.4	 0j
70.41	 0j
70.42	 0j
70.43	 0j
70.44	 0j
70.45	 0j
70.46000000000001	 0j
70.47	 0j
70.48	 0j
70.49	 0j
70.5	 0j
70.51	 0j
70.52	 0j
70.53	 0j
70.54	 0j
70.55	 0j
70.56	 0j
70.57000000000001	 0j
70.58	 0j
70.59	 0j
70.60000000000001	 0j
70.61	 0j
70.62	 0j
70.63	 0j
70.64	 0j
70.65	 0j
70.66	 0j
70.67	 0j
70.68	 0j
70.69	 0j
70.7	 0j
70.71000000000001	 0j
70.72	 0j
70.73	 0j
70.74	 0j
70.75	 0j
70.76	 0j
70.77	 0j
70.78	 0j
70.79	 0j
70.8	 0j
70.81	 0j
70.82000000000001	 0j
70.83	 0j
70.84	 0j
70.85000000000001	 0j
70.86	 0j
70.87	 0j
70.88	 0j
70.89	 0j
70.9	 0j
70.91	 0j
70.92	 0j
70.93	 0j
70.94	 0j
70.95	 0j
70.96000000000001	 0j
70.97	 0j
70.98	 0j
70.99	 0j
71.0	 0j
71.01	 0j
71.02	 0j
71.03	 0j
71.04	 0j
71.05	 0j
71.06	 0j
71.07000000000001	 0j
71.08	 0j
71.09	 0j
71.10000000000001	 0j
71.11	 0j
71.12	 0j
71.13	 0j
71.14	 0j
71.15	 0j
71.16	 0j
71.17	 0j
71.18	 0j
71.19	 0j
71.2	 0j
71.21000000000001	 0j
71.22	 0j
71.23	 0j
71.24	 0j
71.25	 0j
71.26	 0j
71.27	 0j
71.28	 0j
71.29	 0j
71.3	 0j
71.31	 0j
71.32000000000001	 0j
71.33	 0j
71.34	 0j
71.35000000000001	 0j
71.36	 0j
71.37	 0j
71.38	 0j
71.39	 0j
71.4	 0j
71.41	 0j
71.42	 0j
71.43	 0j
71.44	 0j
71.45	 0j
71.46000000000001	 0j
71.47	 0j
71.48	 0j
71.49	 0j
71.5	 0j
71.51	 0j
71.52	 0j
71.53	 0j
71.54	 0j
71.55	 0j
71.56	 0j
71.57000000000001	 0j
71.58	 0j
71.59	 0j
71.60000000000001	 0j
71.61	 0j
71.62	 0j
71.63	 0j
71.64	 0j
71.65	 0j
71.66	 0j
71.67	 0j
71.68	 0j
71.69	 0j
71.7	 0j
71.71000000000001	 0j
71.72	 0j
71.73	 0j
71.74	 0j
71.75	 0j
71.76	 0j
71.77	 0j
71.78	 0j
71.79	 0j
71.8	 0j
71.81	 0j
71.82000000000001	 0j
71.83	 0j
71.84	 0j
71.85000000000001	 0j
71.86	 0j
71.87	 0j
71.88	 0j
71.89	 0j
71.9	 0j
71.91	 0j
71.92	 0j
71.93	 0j
71.94	 0j
71.95	 0j
71.96000000000001	 0j
71.97	 0j
71.98	 0j
71.99	 0j
72.0	 0j
72.01	 0j
72.02	 0j
72.03	 0j
72.04	 0j
72.05	 0j
72.06	 0j
72.07000000000001	 0j
72.08	 0j
72.09	 0j
72.10000000000001	 0j
72.11	 0j
72.12	 0j
72.13	 0j
72.14	 0j
72.15	 0j
72.16	 0j
72.17	 0j
72.18	 0j
72.19	 0j
72.2	 0j
72.21000000000001	 0j
72.22	 0j
72.23	 0j
72.24	 0j
72.25	 0j
72.26	 0j
72.27	 0j
72.28	 0j
72.29	 0j
72.3	 0j
72.31	 0j
72.32000000000001	 0j
72.33	 0j
72.34	 0j
72.35000000000001	 0j
72.36	 0j
72.37	 0j
72.38	 0j
72.39	 0j
72.4	 0j
72.41	 0j
72.42	 0j
72.43	 0j
72.44	 0j
72.45	 0j
72.46000000000001	 0j
72.47	 0j
72.48	 0j
72.49	 0j
72.5	 0j
72.51	 0j
72.52	 0j
72.53	 0j
72.54	 0j
72.55	 0j
72.56	 0j
72.57000000000001	 0j
72.58	 0j
72.59	 0j
72.60000000000001	 0j
72.61	 0j
72.62	 0j
72.63	 0j
72.64	 0j
72.65	 0j
72.66	 0j
72.67	 0j
72.68	 0j
72.69	 0j
72.7	 0j
72.71000000000001	 0j
72.72	 0j
72.73	 0j
72.74	 0j
72.75	 0j
72.76	 0j
72.77	 0j
72.78	 0j
72.79	 0j
72.8	 0j
72.81	 0j
72.82000000000001	 0j
72.83	 0j
72.84	 0j
72.85000000000001	 0j
72.86	 0j
72.87	 0j
72.88	 0j
72.89	 0j
72.9	 0j
72.91	 0j
72.92	 0j
72.93	 0j
72.94	 0j
72.95	 0j
72.96000000000001	 0j
72.97	 0j
72.98	 0j
72.99	 0j
73.0	 0j
73.01	 0j
73.02	 0j
73.03	 0j
73.04	 0j
73.05	 0j
73.06	 0j
73.07000000000001	 0j
73.08	 0j
73.09	 0j
73.10000000000001	 0j
73.11	 0j
73.12	 0j
73.13	 0j
73.14	 0j
73.15	 0j
73.16	 0j
73.17	 0j
73.18	 0j
73.19	 0j
73.2	 0j
73.21000000000001	 0j
73.22	 0j
73.23	 0j
73.24	 0j
73.25	 0j
73.26	 0j
73.27	 0j
73.28	 0j
73.29	 0j
73.3	 0j
73.31	 0j
73.32000000000001	 0j
73.33	 0j
73.34	 0j
73.35000000000001	 0j
73.36	 0j
73.37	 0j
73.38	 0j
73.39	 0j
73.4	 0j
73.41	 0j
73.42	 0j
73.43	 0j
73.44	 0j
73.45	 0j
73.46000000000001	 0j
73.47	 0j
73.48	 0j
73.49	 0j
73.5	 0j
73.51	 0j
73.52	 0j
73.53	 0j
73.54	 0j
73.55	 0j
73.56	 0j
73.57000000000001	 0j
73.58	 0j
73.59	 0j
73.60000000000001	 0j
73.61	 0j
73.62	 0j
73.63	 0j
73.64	 0j
73.65	 0j
73.66	 0j
73.67	 0j
73.68	 0j
73.69	 0j
73.7	 0j
73.71000000000001	 0j
73.72	 0j
73.73	 0j
73.74	 0j
73.75	 0j
73.76	 0j
73.77	 0j
73.78	 0j
73.79	 0j
73.8	 0j
73.81	 0j
73.82000000000001	 0j
73.83	 0j
73.84	 0j
73.85000000000001	 0j
73.86	 0j
73.87	 0j
73.88	 0j
73.89	 0j
73.9	 0j
73.91	 0j
73.92	 0j
73.93	 0j
73.94	 0j
73.95	 0j
73.96000000000001	 0j
73.97	 0j
73.98	 0j
73.99	 0j
74.0	 0j
74.01	 0j
74.02	 0j
74.03	 0j
74.04	 0j
74.05	 0j
74.06	 0j
74.07000000000001	 0j
74.08	 0j
74.09	 0j
74.10000000000001	 0j
74.11	 0j
74.12	 0j
74.13	 0j
74.14	 0j
74.15	 0j
74.16	 0j
74.17	 0j
74.18	 0j
74.19	 0j
74.2	 0j
74.21000000000001	 0j
74.22	 0j
74.23	 0j
74.24	 0j
74.25	 0j
74.26	 0j
74.27	 0j
74.28	 0j
74.29	 0j
74.3	 0j
74.31	 0j
74.32000000000001	 0j
74.33	 0j
74.34	 0j
74.35000000000001	 0j
74.36	 0j
74.37	 0j
74.38	 0j
74.39	 0j
74.4	 0j
74.41	 0j
74.42	 0j
74.43	 0j
74.44	 0j
74.45	 0j
74.46000000000001	 0j
74.47	 0j
74.48	 0j
74.49	 0j
74.5	 0j
74.51	 0j
74.52	 0j
74.53	 0j
74.54	 0j
74.55	 0j
74.56	 0j
74.57000000000001	 0j
74.58	 0j
74.59	 0j
74.60000000000001	 0j
74.61	 0j
74.62	 0j
74.63	 0j
74.64	 0j
74.65	 0j
74.66	 0j
74.67	 0j
74.68	 0j
74.69	 0j
74.7	 0j
74.71000000000001	 0j
74.72	 0j
74.73	 0j
74.74	 0j
74.75	 0j
74.76	 0j
74.77	 0j
74.78	 0j
74.79	 0j
74.8	 0j
74.81	 0j
74.82000000000001	 0j
74.83	 0j
74.84	 0j
74.85000000000001	 0j
74.86	 0j
74.87	 0j
74.88	 0j
74.89	 0j
74.9	 0j
74.91	 0j
74.92	 0j
74.93	 0j
74.94	 0j
74.95	 0j
74.96000000000001	 0j
74.97	 0j
74.98	 0j
74.99	 0j
75.0	 0j
75.01	 0j
75.02	 0j
75.03	 0j
75.04	 0j
75.05	 0j
75.06	 0j
75.07000000000001	 0j
75.08	 0j
75.09	 0j
75.10000000000001	 0j
75.11	 0j
75.12	 0j
75.13	 0j
75.14	 0j
75.15	 0j
75.16	 0j
75.17	 0j
75.18	 0j
75.19	 0j
75.2	 0j
75.21000000000001	 0j
75.22	 0j
75.23	 0j
75.24	 0j
75.25	 0j
75.26	 0j
75.27	 0j
75.28	 0j
75.29	 0j
75.3	 0j
75.31	 0j
75.32000000000001	 0j
75.33	 0j
75.34	 0j
75.35000000000001	 0j
75.36	 0j
75.37	 0j
75.38	 0j
75.39	 0j
75.4	 0j
75.41	 0j
75.42	 0j
75.43	 0j
75.44	 0j
75.45	 0j
75.46000000000001	 0j
75.47	 0j
75.48	 0j
75.49	 0j
75.5	 0j
75.51	 0j
75.52	 0j
75.53	 0j
75.54	 0j
75.55	 0j
75.56	 0j
75.57000000000001	 0j
75.58	 0j
75.59	 0j
75.60000000000001	 0j
75.61	 0j
75.62	 0j
75.63	 0j
75.64	 0j
75.65	 0j
75.66	 0j
75.67	 0j
75.68	 0j
75.69	 0j
75.7	 0j
75.71000000000001	 0j
75.72	 0j
75.73	 0j
75.74	 0j
75.75	 0j
75.76	 0j
75.77	 0j
75.78	 0j
75.79	 0j
75.8	 0j
75.81	 0j
75.82000000000001	 0j
75.83	 0j
75.84	 0j
75.85000000000001	 0j
75.86	 0j
75.87	 0j
75.88	 0j
75.89	 0j
75.9	 0j
75.91	 0j
75.92	 0j
75.93	 0j
75.94	 0j
75.95	 0j
75.96000000000001	 0j
75.97	 0j
75.98	 0j
75.99	 0j
76.0	 0j
76.01	 0j
76.02	 0j
76.03	 0j
76.04	 0j
76.05	 0j
76.06	 0j
76.07000000000001	 0j
76.08	 0j
76.09	 0j
76.10000000000001	 0j
76.11	 0j
76.12	 0j
76.13	 0j
76.14	 0j
76.15	 0j
76.16	 0j
76.17	 0j
76.18	 0j
76.19	 0j
76.2	 0j
76.21000000000001	 0j
76.22	 0j
76.23	 0j
76.24	 0j
76.25	 0j
76.26	 0j
76.27	 0j
76.28	 0j
76.29	 0j
76.3	 0j
76.31	 0j
76.32000000000001	 0j
76.33	 0j
76.34	 0j
76.35000000000001	 0j
76.36	 0j
76.37	 0j
76.38	 0j
76.39	 0j
76.4	 0j
76.41	 0j
76.42	 0j
76.43	 0j
76.44	 0j
76.45	 0j
76.46000000000001	 0j
76.47	 0j
76.48	 0j
76.49	 0j
76.5	 0j
76.51	 0j
76.52	 0j
76.53	 0j
76.54	 0j
76.55	 0j
76.56	 0j
76.57000000000001	 0j
76.58	 0j
76.59	 0j
76.60000000000001	 0j
76.61	 0j
76.62	 0j
76.63	 0j
76.64	 0j
76.65	 0j
76.66	 0j
76.67	 0j
76.68	 0j
76.69	 0j
76.7	 0j
76.71000000000001	 0j
76.72	 0j
76.73	 0j
76.74	 0j
76.75	 0j
76.76	 0j
76.77	 0j
76.78	 0j
76.79	 0j
76.8	 0j
76.81	 0j
76.82000000000001	 0j
76.83	 0j
76.84	 0j
76.85000000000001	 0j
76.86	 0j
76.87	 0j
76.88	 0j
76.89	 0j
76.9	 0j
76.91	 0j
76.92	 0j
76.93	 0j
76.94	 0j
76.95	 0j
76.96000000000001	 0j
76.97	 0j
76.98	 0j
76.99	 0j
77.0	 0j
77.01	 0j
77.02	 0j
77.03	 0j
77.04	 0j
77.05	 0j
77.06	 0j
77.07000000000001	 0j
77.08	 0j
77.09	 0j
77.10000000000001	 0j
77.11	 0j
77.12	 0j
77.13	 0j
77.14	 0j
77.15	 0j
77.16	 0j
77.17	 0j
77.18	 0j
77.19	 0j
77.2	 0j
77.21000000000001	 0j
77.22	 0j
77.23	 0j
77.24	 0j
77.25	 0j
77.26	 0j
77.27	 0j
77.28	 0j
77.29	 0j
77.3	 0j
77.31	 0j
77.32000000000001	 0j
77.33	 0j
77.34	 0j
77.35000000000001	 0j
77.36	 0j
77.37	 0j
77.38	 0j
77.39	 0j
77.4	 0j
77.41	 0j
77.42	 0j
77.43	 0j
77.44	 0j
77.45	 0j
77.46000000000001	 0j
77.47	 0j
77.48	 0j
77.49	 0j
77.5	 0j
77.51	 0j
77.52	 0j
77.53	 0j
77.54	 0j
77.55	 0j
77.56	 0j
77.57000000000001	 0j
77.58	 0j
77.59	 0j
77.60000000000001	 0j
77.61	 0j
77.62	 0j
77.63	 0j
77.64	 0j
77.65	 0j
77.66	 0j
77.67	 0j
77.68	 0j
77.69	 0j
77.7	 0j
77.71000000000001	 0j
77.72	 0j
77.73	 0j
77.74	 0j
77.75	 0j
77.76	 0j
77.77	 0j
77.78	 0j
77.79	 0j
77.8	 0j
77.81	 0j
77.82000000000001	 0j
77.83	 0j
77.84	 0j
77.85000000000001	 0j
77.86	 0j
77.87	 0j
77.88	 0j
77.89	 0j
77.9	 0j
77.91	 0j
77.92	 0j
77.93	 0j
77.94	 0j
77.95	 0j
77.96000000000001	 0j
77.97	 0j
77.98	 0j
77.99	 0j
78.0	 0j
78.01	 0j
78.02	 0j
78.03	 0j
78.04	 0j
78.05	 0j
78.06	 0j
78.07000000000001	 0j
78.08	 0j
78.09	 0j
78.10000000000001	 0j
78.11	 0j
78.12	 0j
78.13	 0j
78.14	 0j
78.15	 0j
78.16	 0j
78.17	 0j
78.18	 0j
78.19	 0j
78.2	 0j
78.21000000000001	 0j
78.22	 0j
78.23	 0j
78.24	 0j
78.25	 0j
78.26	 0j
78.27	 0j
78.28	 0j
78.29	 0j
78.3	 0j
78.31	 0j
78.32000000000001	 0j
78.33	 0j
78.34	 0j
78.35000000000001	 0j
78.36	 0j
78.37	 0j
78.38	 0j
78.39	 0j
78.4	 0j
78.41	 0j
78.42	 0j
78.43	 0j
78.44	 0j
78.45	 0j
78.46000000000001	 0j
78.47	 0j
78.48	 0j
78.49	 0j
78.5	 0j
78.51	 0j
78.52	 0j
78.53	 0j
78.54	 0j
78.55	 0j
78.56	 0j
78.57000000000001	 0j
78.58	 0j
78.59	 0j
78.60000000000001	 0j
78.61	 0j
78.62	 0j
78.63	 0j
78.64	 0j
78.65	 0j
78.66	 0j
78.67	 0j
78.68	 0j
78.69	 0j
78.7	 0j
78.71000000000001	 0j
78.72	 0j
78.73	 0j
78.74	 0j
78.75	 0j
78.76	 0j
78.77	 0j
78.78	 0j
78.79	 0j
78.8	 0j
78.81	 0j
78.82000000000001	 0j
78.83	 0j
78.84	 0j
78.85000000000001	 0j
78.86	 0j
78.87	 0j
78.88	 0j
78.89	 0j
78.9	 0j
78.91	 0j
78.92	 0j
78.93	 0j
78.94	 0j
78.95	 0j
78.96000000000001	 0j
78.97	 0j
78.98	 0j
78.99	 0j
79.0	 0j
79.01	 0j
79.02	 0j
79.03	 0j
79.04	 0j
79.05	 0j
79.06	 0j
79.07000000000001	 0j
79.08	 0j
79.09	 0j
79.10000000000001	 0j
79.11	 0j
79.12	 0j
79.13	 0j
79.14	 0j
79.15	 0j
79.16	 0j
79.17	 0j
79.18	 0j
79.19	 0j
79.2	 0j
79.21000000000001	 0j
79.22	 0j
79.23	 0j
79.24	 0j
79.25	 0j
79.26	 0j
79.27	 0j
79.28	 0j
79.29	 0j
79.3	 0j
79.31	 0j
79.32000000000001	 0j
79.33	 0j
79.34	 0j
79.35000000000001	 0j
79.36	 0j
79.37	 0j
79.38	 0j
79.39	 0j
79.4	 0j
79.41	 0j
79.42	 0j
79.43	 0j
79.44	 0j
79.45	 0j
79.46000000000001	 0j
79.47	 0j
79.48	 0j
79.49	 0j
79.5	 0j
79.51	 0j
79.52	 0j
79.53	 0j
79.54	 0j
79.55	 0j
79.56	 0j
79.57000000000001	 0j
79.58	 0j
79.59	 0j
79.60000000000001	 0j
79.61	 0j
79.62	 0j
79.63	 0j
79.64	 0j
79.65	 0j
79.66	 0j
79.67	 0j
79.68	 0j
79.69	 0j
79.7	 0j
79.71000000000001	 0j
79.72	 0j
79.73	 0j
79.74	 0j
79.75	 0j
79.76	 0j
79.77	 0j
79.78	 0j
79.79	 0j
79.8	 0j
79.81	 0j
79.82000000000001	 0j
79.83	 0j
79.84	 0j
79.85000000000001	 0j
79.86	 0j
79.87	 0j
79.88	 0j
79.89	 0j
79.9	 0j
79.91	 0j
79.92	 0j
79.93	 0j
79.94	 0j
79.95	 0j
79.96000000000001	 0j
79.97	 0j
79.98	 0j
79.99	 0j
