-0.1	 (1.1224335669343993e-11+0j)
-0.099	 (6.657918761836322e-12+0j)
-0.098	 (-1.2000721817135321e-12+0j)
-0.097	 (-1.1945894807140968e-12+0j)
-0.096	 (-4.074928215859298e-12+0j)
-0.095	 (-9.286377187932151e-12+0j)
-0.094	 (-1.2888555137434603e-11+0j)
-0.093	 (-1.7553349462266565e-11+0j)
-0.092	 (-2.212640477823502e-11+0j)
-0.091	 (-2.6428536655400933e-11+0j)
-0.09	 (-3.042884298942213e-11+0j)
-0.089	 (-3.420781960041635e-11+0j)
-0.088	 (-3.787811259094421e-11+0j)
-0.087	 (-4.151693745817277e-11+0j)
-0.086	 (-4.5146547437239217e-11+0j)
-0.08499999999999999	 (-4.87559659969752e-11+0j)
-0.08399999999999999	 (-5.236687854047217e-11+0j)
-0.08299999999999999	 (-5.574787735380754e-11+0j)
-0.08199999999999999	 (-6.022913726884447e-11+0j)
-0.08099999999999999	 (-6.490759195075452e-11+0j)
-0.07999999999999999	 (-6.983228176040905e-11+0j)
-0.07899999999999999	 (-7.278591295907278e-11+0j)
-0.07799999999999999	 (-5.0797853751406826e-11+0j)
-0.07699999999999999	 (-5.539915246415878e-11+0j)
-0.07599999999999998	 (-3.659670359647637e-11+0j)
-0.07499999999999998	 (1.2276946125909827e-11+0j)
-0.07399999999999998	 (5.370056531274341e-11+0j)
-0.07299999999999998	 (7.667941032550925e-11+0j)
-0.07199999999999998	 (8.68501335387745e-11+0j)
-0.07099999999999998	 (9.03475855030854e-11+0j)
-0.06999999999999998	 (8.997628386451767e-11+0j)
-0.06899999999999998	 (8.621368124698587e-11+0j)
-0.06799999999999998	 (7.811247814593728e-11+0j)
-0.06699999999999998	 (6.193181147950977e-11+0j)
-0.06599999999999998	 (-4.853515060814012e-11+0j)
-0.06499999999999997	 (5.733226849314529e-11+0j)
-0.06399999999999997	 (2.6068497238317845e-11+0j)
-0.06299999999999997	 (-2.9687325445602736e-12+0j)
-0.06199999999999997	 (-3.122763731051218e-11+0j)
-0.06099999999999997	 (-5.790472895286027e-11+0j)
-0.05999999999999997	 (-8.349574262257799e-11+0j)
-0.05899999999999997	 (-1.0665314977610056e-10+0j)
-0.05799999999999997	 (-1.2258603777692308e-10+0j)
-0.05699999999999997	 (-1.2561696982262823e-10+0j)
-0.055999999999999966	 (-1.1003720607537959e-10+0j)
-0.054999999999999966	 (-7.011320347015582e-11+0j)
-0.053999999999999965	 (-4.082890620909367e-12+0j)
-0.052999999999999964	 (6.918737656503643e-11+0j)
-0.05199999999999996	 (9.140610565789206e-11+0j)
-0.05099999999999996	 (3.923310703033197e-11+0j)
-0.04999999999999996	 (-2.936853473152507e-11+0j)
-0.04899999999999996	 (-1.50716197444413e-10+0j)
-0.04799999999999996	 (-2.6663045597717244e-10+0j)
-0.04699999999999996	 (-2.0256285555666714e-10+0j)
-0.04599999999999996	 (-2.5454429876394296e-11+0j)
-0.04499999999999996	 (2.0378432501713846e-10+0j)
-0.043999999999999956	 (4.0804592320742356e-10+0j)
-0.042999999999999955	 (5.211686500150745e-10+0j)
-0.041999999999999954	 (5.086112921796885e-10+0j)
-0.04099999999999995	 (3.381385462815096e-10+0j)
-0.03999999999999995	 (7.058414662121155e-11+0j)
-0.03899999999999995	 (6.432852505727236e-11+0j)
-0.03799999999999995	 (-7.110118706260274e-10+0j)
-0.03699999999999995	 (-2.2878587638292505e-09+0j)
-0.03599999999999995	 (-4.265777095321712e-09+0j)
-0.03499999999999995	 (-6.290009829558895e-09+0j)
-0.03399999999999995	 (-8.017704853380512e-09+0j)
-0.032999999999999946	 (-8.945154609385378e-09+0j)
-0.031999999999999945	 (-8.394490754130517e-09+0j)
-0.030999999999999944	 (-5.928473972527704e-09+0j)
-0.029999999999999943	 (-1.7880006468787709e-09+0j)
-0.028999999999999942	 (3.5275083165584645e-09+0j)
-0.02799999999999994	 (1.0236466164678759e-08+0j)
-0.02699999999999994	 (1.8880799662189246e-08+0j)
-0.02599999999999994	 (2.716144127711913e-08+0j)
-0.02499999999999994	 (3.082820448458982e-08+0j)
-0.023999999999999938	 (3.898313849857856e-08+0j)
-0.022999999999999937	 (5.7300522366612335e-08+0j)
-0.021999999999999936	 (7.575263637185009e-08+0j)
-0.020999999999999935	 (5.780181017757983e-08+0j)
-0.019999999999999934	 (-9.643117020567752e-09+0j)
-0.018999999999999934	 (-9.008646282861333e-08+0j)
-0.017999999999999933	 (-1.3360742387739112e-07+0j)
-0.016999999999999932	 (-3.360418960545963e-07+0j)
-0.01599999999999993	 (-5.21016733266694e-07+0j)
-0.01499999999999993	 (-1.2300008481243734e-06+0j)
-0.01399999999999993	 (-1.2781677347331834e-06+0j)
-0.012999999999999928	 (-1.8346591223317813e-06+0j)
-0.011999999999999927	 (-7.083334056355552e-07+0j)
-0.010999999999999927	 (-3.5544401422116603e-07+0j)
-0.009999999999999926	 (-6.848790277813588e-08+0j)
-0.008999999999999925	 (5.406592314904406e-07+0j)
-0.007999999999999924	 (5.949530569211298e-07+0j)
-0.006999999999999923	 (4.1985624751651105e-07+0j)
-0.005999999999999922	 (2.750641485157286e-07+0j)
-0.004999999999999921	 (1.2862884448566132e-07+0j)
-0.00399999999999992	 (3.3783362823362666e-08+0j)
-0.0029999999999999194	 (-1.5593454534282964e-08+0j)
-0.0019999999999999185	 (-1.8170210748538888e-09+0j)
-0.0009999999999999176	 (9.463149179806583e-08+0j)
