0.1	 (-8.012750378221802e-17+0j)
0.2	 (-3.6571971823861694e-15+0j)
0.30000000000000004	 (-2.0696094886349715e-15+0j)
0.4	 (-1.3119158168901421e-16+0j)
0.5	 (-5.504323382236597e-17+0j)
0.6	 (1.140862079682858e-15+0j)
0.7000000000000001	 (3.9811829360749597e-13+0j)
0.8	 (1.1897324081837189e-12+0j)
0.9	 (-4.842683444174701e-10+0j)
1.0	 (-2.5407477259331165e-11+0j)
1.1	 (-3.747337449030106e-13+0j)
1.2000000000000002	 (1.1179785587718824e-13+0j)
1.3000000000000003	 (5.798232933613616e-13+0j)
1.4000000000000001	 (1.8885198684952012e-13+0j)
1.5000000000000002	 (-3.1582061859559815e-15+0j)
1.6	 (1.7308977538484196e-13+0j)
1.7000000000000002	 (-4.237445043550118e-13+0j)
1.8000000000000003	 (-8.315216158917499e-14+0j)
1.9000000000000001	 (-1.9952782185064215e-15+0j)
2.0	 (6.207053958729643e-16+0j)
2.1	 (7.818299798729057e-14+0j)
2.2	 (-2.34649740618787e-14+0j)
2.3000000000000003	 (-1.819137399784662e-14+0j)
2.4000000000000004	 (-3.2901794351664595e-14+0j)
2.5000000000000004	 (-6.981072747114865e-16+0j)
2.6	 (2.0379605752017247e-14+0j)
2.7	 (1.4886663089174752e-13+0j)
2.8000000000000003	 (7.550046780047518e-14+0j)
2.9000000000000004	 (-7.032346769341887e-15+0j)
3.0000000000000004	 (-7.765690323399584e-13+0j)
3.1	 (-3.0235843130309146e-12+0j)
3.2	 (1.79990239685904e-13+0j)
3.3000000000000003	 (8.323323520054808e-14+0j)
3.4000000000000004	 (2.3193297160602847e-14+0j)
3.5000000000000004	 (1.2055554211008305e-13+0j)
3.6	 (5.609814984729647e-14+0j)
3.7	 (2.399476774625124e-13+0j)
3.8000000000000003	 (8.607897297060618e-14+0j)
3.9000000000000004	 (4.013101196455496e-13+0j)
4.0	 (4.29596689063709e-14+0j)
4.1	 (2.107814386237692e-13+0j)
4.2	 (2.3079431717588145e-14+0j)
4.3	 (6.417279982633189e-13+0j)
4.3999999999999995	 (5.99126793359178e-14+0j)
4.5	 (1.5617137160593124e-14+0j)
