-0.1	 (-0.42198736413767324+0j)
-0.099	 (-0.42110314762886963+0j)
-0.098	 (-0.42021219178908+0j)
-0.097	 (-0.41931432636132016+0j)
-0.096	 (-0.41840936907750126+0j)
-0.095	 (-0.4174971246526338+0j)
-0.094	 (-0.41657738390772936+0j)
-0.093	 (-0.4156499228041824+0j)
-0.092	 (-0.41471450143125843+0j)
-0.091	 (-0.4137708629445913+0j)
-0.09	 (-0.41281873245345374+0j)
-0.089	 (-0.4118578158545059+0j)
-0.088	 (-0.41088779861405655+0j)
-0.087	 (-0.40990834449649644+0j)
-0.086	 (-0.4089190942381122+0j)
-0.08499999999999999	 (-0.4079196641675599+0j)
-0.08399999999999999	 (-0.4069096447752036+0j)
-0.08299999999999999	 (-0.40588859922840376+0j)
-0.08199999999999999	 (-0.40485606184050515+0j)
-0.08099999999999999	 (-0.403811536494813+0j)
-0.07999999999999999	 (-0.4027544950265612+0j)
-0.07899999999999999	 (-0.4016843755744827+0j)
-0.07799999999999999	 (-0.4006005809097371+0j)
-0.07699999999999999	 (-0.39950247653382903+0j)
-0.07599999999999998	 (-0.398389389700472+0j)
-0.07499999999999998	 (-0.3972606066417886+0j)
-0.07399999999999998	 (-0.3961153717249818+0j)
-0.07299999999999998	 (-0.3949528855596841+0j)
-0.07199999999999998	 (-0.3937723034674018+0j)
-0.07099999999999998	 (-0.39257273404497073+0j)
-0.06999999999999998	 (-0.39135323785672915+0j)
-0.06899999999999998	 (-0.39011282629336647+0j)
-0.06799999999999998	 (-0.3888504606400437+0j)
-0.06699999999999998	 (-0.38756505139710407+0j)
-0.06599999999999998	 (-0.3862554578325055+0j)
-0.06499999999999997	 (-0.3849204884682541+0j)
-0.06399999999999997	 (-0.38355890035411616+0j)
-0.06299999999999997	 (-0.38216940120555964+0j)
-0.06199999999999997	 (-0.3807506501157588+0j)
-0.06099999999999997	 (-0.37930125972505235+0j)
-0.05999999999999997	 (-0.3778197988682353+0j)
-0.05899999999999997	 (-0.37630479591242766+0j)
-0.05799999999999997	 (-0.3747547428087307+0j)
-0.05699999999999997	 (-0.373168099877938+0j)
-0.055999999999999966	 (-0.3715433013041469+0j)
-0.054999999999999966	 (-0.36987876129374736+0j)
-0.053999999999999965	 (-0.36817288080209+0j)
-0.052999999999999964	 (-0.36642405469173595+0j)
-0.05199999999999996	 (-0.3646306790934202+0j)
-0.05099999999999996	 (-0.36279115860293215+0j)
-0.04999999999999996	 (-0.3609039130656074+0j)
-0.04899999999999996	 (-0.35896738357278873+0j)
-0.04799999999999996	 (-0.35698003689155783+0j)
-0.04699999999999996	 (-0.3549403676227429+0j)
-0.04599999999999996	 (-0.35284689725837715+0j)
-0.04499999999999996	 (-0.35069816951502714+0j)
-0.043999999999999956	 (-0.3484927405841728+0j)
-0.042999999999999955	 (-0.346229163150823+0j)
-0.041999999999999954	 (-0.3439059628762562+0j)
-0.04099999999999995	 (-0.3415216058614005+0j)
-0.03999999999999995	 (-0.33907445508363493+0j)
-0.03899999999999995	 (-0.3365627134364805+0j)
-0.03799999999999995	 (-0.333984357460364+0j)
-0.03699999999999995	 (-0.3313370440073282+0j)
-0.03599999999999995	 (-0.32861800037399813+0j)
-0.03499999999999995	 (-0.32582388944963014+0j)
-0.03399999999999995	 (-0.3229506401280788+0j)
-0.032999999999999946	 (-0.31999323503335386+0j)
-0.031999999999999945	 (-0.3169454403606817+0j)
-0.030999999999999944	 (-0.3137994554873355+0j)
-0.029999999999999943	 (-0.3105454477917494+0j)
-0.028999999999999942	 (-0.30717091634224064+0j)
-0.02799999999999994	 (-0.30365979167077306+0j)
-0.02699999999999994	 (-0.29999111772049397+0j)
-0.02599999999999994	 (-0.2961370515159941+0j)
-0.02499999999999994	 (-0.2920597081687231+0j)
-0.023999999999999938	 (-0.2877060099396846+0j)
-0.022999999999999937	 (-0.28299846903745446+0j)
-0.021999999999999936	 (-0.27782167639786154+0j)
-0.020999999999999935	 (-0.2719897477254435+0j)
-0.019999999999999934	 (-0.26519565655044136+0j)
-0.018999999999999934	 (-0.25690607953206157+0j)
-0.017999999999999933	 (-0.24617536509783342+0j)
-0.016999999999999932	 (-0.23140766898142123+0j)
-0.01599999999999993	 (-0.21055385810044308+0j)
-0.01499999999999993	 (-0.18307355931700936+0j)
-0.01399999999999993	 (-0.15370620272804336+0j)
-0.012999999999999928	 (-0.12915762611523024+0j)
-0.011999999999999927	 (-0.1112625604767742+0j)
-0.010999999999999927	 (-0.09821316180930294+0j)
-0.009999999999999926	 (-0.08796466039554518+0j)
-0.008999999999999925	 (-0.07913765907738048+0j)
-0.007999999999999924	 (-0.07096064968705935+0j)
-0.006999999999999923	 (-0.06299667057170788+0j)
-0.005999999999999922	 (-0.05496263438558295+0j)
-0.004999999999999921	 (-0.04667793545233219+0j)
-0.00399999999999992	 (-0.038041626700473626+0j)
-0.0029999999999999194	 (-0.028981177369162513+0j)
-0.0019999999999999185	 (-0.01957148062325079+0j)
-0.0009999999999999176	 (-0.009866050079392133+0j)
