0.1	 (0.326235391667514+0j)
0.2	 (0.3871384866246436+0j)
0.30000000000000004	 (0.5125509002054878+0j)
0.4	 (0.6891117019843499+0j)
0.5	 (0.7483696959425129+0j)
0.6	 (0.7806757986558589+0j)
0.7000000000000001	 (0.8107419849607453+0j)
0.8	 (0.8471728360581038+0j)
0.9	 (0.8937169313119914+0j)
1.0	 (0.9329567860344887+0j)
1.1	 (0.9554733831828509+0j)
1.2000000000000002	 (0.9682264588633407+0j)
1.3000000000000003	 (0.9764802081613713+0j)
1.4000000000000001	 (0.9825272662459645+0j)
1.5000000000000002	 (0.9873689383494213+0j)
1.6	 (0.991488743831131+0j)
1.7000000000000002	 (0.9951453573361884+0j)
1.8000000000000003	 (0.9984889521977471+0j)
1.9000000000000001	 (1.0016115515201005+0j)
2.0	 (1.0045707981498284+0j)
2.1	 (1.0074021867505347+0j)
2.2	 (1.010125992661477+0j)
2.3000000000000003	 (1.0127516785283734+0j)
2.4000000000000004	 (1.0152810764291058+0j)
2.5000000000000004	 (1.0177109418283405+0j)
2.6	 (1.020035116904832+0j)
2.7	 (1.0222463563834119+0j)
2.8000000000000003	 (1.0243377896275625+0j)
2.9000000000000004	 (1.0263039814850072+0j)
3.0000000000000004	 (1.028141582543225+0j)
3.1	 (1.0298496016131502+0j)
3.2	 (1.0314293697842682+0j)
3.3000000000000003	 (1.0328842854917113+0j)
3.4000000000000004	 (1.03421943155172+0j)
3.5000000000000004	 (1.0354411429054842+0j)
3.6	 (1.036556583234506+0j)
3.7	 (1.0375733689111255+0j)
3.8000000000000003	 (1.0384992530749326+0j)
3.9000000000000004	 (1.0393418850415266+0j)
4.0	 (1.0401086672960638+0j)
4.1	 (1.040806539351069+0j)
4.2	 (1.0414420754401281+0j)
4.3	 (1.042021242094124+0j)
4.3999999999999995	 (1.0425495378730394+0j)
4.5	 (1.0430320260388326+0j)
