-0.1	 (-0.471634345564161+0j)
-0.099	 (-0.47039085051691176+0j)
-0.098	 (-0.4691361195847192+0j)
-0.097	 (-0.46786983186551406+0j)
-0.096	 (-0.466591648433084+0j)
-0.095	 (-0.46530121110171846+0j)
-0.094	 (-0.4639981410894131+0j)
-0.093	 (-0.46268203757015613+0j)
-0.092	 (-0.4613524761014825+0j)
-0.091	 (-0.46000900690412017+0j)
-0.09	 (-0.4586511529550525+0j)
-0.089	 (-0.4572784078597238+0j)
-0.088	 (-0.45589023356293784+0j)
-0.087	 (-0.45448605814394355+0j)
-0.086	 (-0.4530652738843136+0j)
-0.08499999999999999	 (-0.4516272352673497+0j)
-0.08399999999999999	 (-0.45017125633190924+0j)
-0.08299999999999999	 (-0.44869660711606263+0j)
-0.08199999999999999	 (-0.4472025081513005+0j)
-0.08099999999999999	 (-0.4456881186782645+0j)
-0.07999999999999999	 (-0.4441525119441194+0j)
-0.07899999999999999	 (-0.44259466051016155+0j)
-0.07799999999999999	 (-0.44101351796472577+0j)
-0.07699999999999999	 (-0.43940809509250184+0j)
-0.07599999999999998	 (-0.4377773264295195+0j)
-0.07499999999999998	 (-0.4361199920423074+0j)
-0.07399999999999998	 (-0.4344347607183449+0j)
-0.07299999999999998	 (-0.4327202163373115+0j)
-0.07199999999999998	 (-0.4309748575658265+0j)
-0.07099999999999998	 (-0.4291970911125355+0j)
-0.06999999999999998	 (-0.4273852251031948+0j)
-0.06899999999999998	 (-0.4255374633210839+0j)
-0.06799999999999998	 (-0.423651899981049+0j)
-0.06699999999999998	 (-0.4217265146447897+0j)
-0.06599999999999998	 (-0.41975916706832506+0j)
-0.06499999999999997	 (-0.41774759234304776+0j)
-0.06399999999999997	 (-0.4156893976744804+0j)
-0.06299999999999997	 (-0.41358206268647163+0j)
-0.06199999999999997	 (-0.4114229437114125+0j)
-0.06099999999999997	 (-0.4092092788692317+0j)
-0.05999999999999997	 (-0.4069381852788554+0j)
-0.05899999999999997	 (-0.40460661935783804+0j)
-0.05799999999999997	 (-0.4022110850427698+0j)
-0.05699999999999997	 (-0.3997492837936617+0j)
-0.055999999999999966	 (-0.397224970194222+0j)
-0.054999999999999966	 (-0.3946206094785148+0j)
-0.053999999999999965	 (-0.3919414805520445+0j)
-0.052999999999999964	 (-0.38918377315981767+0j)
-0.05199999999999996	 (-0.3863443263517877+0j)
-0.05099999999999996	 (-0.3834201419447814+0j)
-0.04999999999999996	 (-0.38040831292867133+0j)
-0.04899999999999996	 (-0.3773060475518862+0j)
-0.04799999999999996	 (-0.37411083435952275+0j)
-0.04699999999999996	 (-0.370820694880811+0j)
-0.04599999999999996	 (-0.3674342767567269+0j)
-0.04499999999999996	 (-0.3639507105189163+0j)
-0.043999999999999956	 (-0.3603694567814729+0j)
-0.042999999999999955	 (-0.356690276566341+0j)
-0.041999999999999954	 (-0.352913260850602+0j)
-0.04099999999999995	 (-0.34903885507376153+0j)
-0.03999999999999995	 (-0.3450679189415932+0j)
-0.03899999999999995	 (-0.34100210229428246+0j)
-0.03799999999999995	 (-0.33684590298132816+0j)
-0.03699999999999995	 (-0.3326127732129871+0j)
-0.03599999999999995	 (-0.3282006617892895+0j)
-0.03499999999999995	 (-0.32370753894108056+0j)
-0.03399999999999995	 (-0.31913665105161576+0j)
-0.032999999999999946	 (-0.31445787400274183+0j)
-0.031999999999999945	 (-0.30966245858077135+0j)
-0.030999999999999944	 (-0.30474050712433415+0j)
-0.029999999999999943	 (-0.2996786268243427+0j)
-0.028999999999999942	 (-0.29445890847522865+0j)
-0.02799999999999994	 (-0.2890582708809086+0j)
-0.02699999999999994	 (-0.2834486123057588+0j)
-0.02599999999999994	 (-0.2775980935915397+0j)
-0.02499999999999994	 (-0.2714729752725945+0j)
-0.023999999999999938	 (-0.26503914223564035+0j)
-0.022999999999999937	 (-0.2582638856544924+0j)
-0.021999999999999936	 (-0.25111963154869854+0j)
-0.020999999999999935	 (-0.24359036630170902+0j)
-0.019999999999999934	 (-0.23567981490667406+0j)
-0.018999999999999934	 (-0.22741895792253722+0j)
-0.017999999999999933	 (-0.2188686342187987+0j)
-0.016999999999999932	 (-0.2101095548115332+0j)
-0.01599999999999993	 (-0.201202160813488+0j)
-0.01499999999999993	 (-0.192047936479062+0j)
-0.01399999999999993	 (-0.18159497529074645+0j)
-0.012999999999999928	 (-0.1459098853427922+0j)
-0.011999999999999927	 (-0.17137148051979545+0j)
-0.010999999999999927	 (-0.16257817556434342+0j)
-0.009999999999999926	 (-0.15260220904738978+0j)
-0.008999999999999925	 (-0.14361959647859332+0j)
-0.007999999999999924	 (-0.1361627658961893+0j)
-0.006999999999999923	 (-0.12917520548147904+0j)
-0.005999999999999922	 (-0.12169322125566177+0j)
-0.004999999999999921	 (-0.11295445622752422+0j)
-0.00399999999999992	 (-0.10195050168324273+0j)
-0.0029999999999999194	 (-0.08716698854152602+0j)
-0.0019999999999999185	 (-0.06673408310794254+0j)
-0.0009999999999999176	 (-0.03866586768367111+0j)
