0.001	 (-0.2660125577779724+0j)
0.002	 (-0.2658892212574587+0j)
0.003	 (-0.26570811861277616+0j)
0.004	 (-0.26534744662508636+0j)
0.005	 (-0.2647679059216734+0j)
0.006	 (-0.26398133980892224+0j)
0.007	 (-0.2629755126978931+0j)
0.008	 (-0.2617177965758367+0j)
0.009000000000000001	 (-0.26033583743916283+0j)
0.010000000000000002	 (-0.25934220048441603+0j)
0.011	 (-0.25910986801184244+0j)
0.012	 (-0.25936473090435974+0j)
0.013000000000000001	 (-0.2599097333902807+0j)
0.014000000000000002	 (-0.2606713850283572+0j)
0.015	 (-0.26142768832533386+0j)
0.016	 (-0.26199700281928057+0j)
0.017	 (-0.2623544212235943+0j)
0.018000000000000002	 (-0.2625488600437778+0j)
0.019000000000000003	 (-0.2626330295741211+0j)
0.02	 (-0.26264436112340006+0j)
0.021	 (-0.26260644540514566+0j)
0.022000000000000002	 (-0.2625338643664965+0j)
0.023	 (-0.26243589690240293+0j)
0.024	 (-0.2623186999128592+0j)
0.025	 (-0.2621862399702345+0j)
0.026000000000000002	 (-0.2620401781169987+0j)
0.027000000000000003	 (-0.2618792260285257+0j)
0.028	 (-0.2616995764515587+0j)
0.029	 (-0.2614982849708678+0j)
0.030000000000000002	 (-0.26127785001085857+0j)
0.031	 (-0.26104631192488875+0j)
0.032	 (-0.2608122127890653+0j)
0.033	 (-0.2605805691692249+0j)
0.034	 (-0.2603527801160151+0j)
0.035	 (-0.2601282864137382+0j)
0.036000000000000004	 (-0.2599059019840112+0j)
0.037000000000000005	 (-0.2596844501829837+0j)
0.038	 (-0.25946300912257225+0j)
0.039	 (-0.2592410025463989+0j)
0.04	 (-0.25901819619937994+0j)
0.041	 (-0.2587946147656205+0j)
0.042	 (-0.2585704300144914+0j)
0.043000000000000003	 (-0.2583458730682119+0j)
0.044000000000000004	 (-0.25812118746093415+0j)
0.045	 (-0.2578966122570143+0j)
0.046	 (-0.2576723792473964+0j)
0.047	 (-0.25744871312784445+0j)
0.048	 (-0.25722582926637844+0j)
0.049	 (-0.2570039278906693+0j)
0.05	 (-0.2567831862119962+0j)
0.051000000000000004	 (-0.2565637510272908+0j)
0.052000000000000005	 (-0.2563457338884316+0j)
0.053000000000000005	 (-0.25612920971045916+0j)
0.054	 (-0.2559142185278578+0j)
0.055	 (-0.2557007694793336+0j)
0.056	 (-0.2554888461423993+0j)
0.057	 (-0.25527841305214094+0j)
0.058	 (-0.25506942428374024+0j)
0.059000000000000004	 (-0.25486183516654176+0j)
0.060000000000000005	 (-0.25465561564209915+0j)
0.061	 (-0.25445075901237+0j)
0.062	 (-0.25424727913435874+0j)
0.063	 (-0.2540451973652441+0j)
0.064	 (-0.2538445293327138+0j)
0.065	 (-0.25364527955375343+0j)
0.066	 (-0.25344744338212877+0j)
0.067	 (-0.25325101150282603+0j)
0.068	 (-0.2530559735478459+0j)
0.069	 (-0.2528623199509673+0j)
0.07	 (-0.25267004246453656+0j)
0.07100000000000001	 (-0.2524791339844921+0j)
0.07200000000000001	 (-0.2522895881548861+0j)
0.07300000000000001	 (-0.2521013990172596+0j)
0.074	 (-0.25191456082039376+0j)
0.075	 (-0.2517290680053993+0j)
0.076	 (-0.25154491527050615+0j)
0.077	 (-0.25136209739499016+0j)
0.078	 (-0.25118060804582615+0j)
0.079	 (-0.2510004369458556+0j)
0.08	 (-0.2508215681839123+0j)
0.081	 (-0.2506439851989479+0j)
0.082	 (-0.25046767733777064+0j)
0.083	 (-0.2502926380614298+0j)
0.084	 (-0.2501188598853543+0j)
0.085	 (-0.2499463326405802+0j)
0.08600000000000001	 (-0.24977504397038378+0j)
0.08700000000000001	 (-0.24960498006631018+0j)
0.08800000000000001	 (-0.24943612612541116+0j)
0.089	 (-0.24926846659436866+0j)
0.09	 (-0.24910198531110483+0j)
0.091	 (-0.24893666560201144+0j)
0.092	 (-0.2487724903582281+0j)
0.093	 (-0.24860944209591215+0j)
0.094	 (-0.248447502995375+0j)
0.095	 (-0.24828665491083005+0j)
0.096	 (-0.2481268793431453+0j)
0.097	 (-0.24796815737445435+0j)
0.098	 (-0.2478104695575299+0j)
0.099	 (-0.24765379567365994+0j)
0.1	 (-0.24749811385112297+0j)
