0.0	 (0.876228233061723+0j)
0.05	 (0.8722895179581153+0j)
0.1	 (0.8682227223479186+0j)
0.15000000000000002	 (0.864026163744733+0j)
0.2	 (0.8596984509623087+0j)
0.25	 (0.8552385142405986+0j)
0.30000000000000004	 (0.8506456349024991+0j)
0.35000000000000003	 (0.845919474081534+0j)
0.4	 (0.8410601000303812+0j)
0.45	 (0.8360680135525306+0j)
0.5	 (0.8309441710340792+0j)
0.55	 (0.8256900045983476+0j)
0.6000000000000001	 (0.8203074388584963+0j)
0.65	 (0.8147989036626643+0j)
0.7000000000000001	 (0.809167341888056+0j)
0.75	 (0.8034162083191916+0j)
0.8	 (0.797549440722729+0j)
0.8500000000000001	 (0.7915719649286963+0j)
0.9	 (0.7854879011939384+0j)
0.9500000000000001	 (0.7793032883723292+0j)
1.0	 (0.7730280452827683+0j)
1.05	 (0.7666573882442778+0j)
1.1	 (0.7602085920700297+0j)
1.1500000000000001	 (0.7536857969744786+0j)
1.2000000000000002	 (0.7470963835229605+0j)
1.25	 (0.7404483221957958+0j)
1.3	 (0.73374980587834+0j)
1.35	 (0.7270084207989033+0j)
1.4000000000000001	 (0.7202344066042065+0j)
1.4500000000000002	 (0.713436430874285+0j)
1.5	 (0.7066222475491013+0j)
1.55	 (0.699801875354639+0j)
1.6	 (0.6929853833102331+0j)
1.6500000000000001	 (0.6861811715127379+0j)
1.7000000000000002	 (0.679155774682565+0j)
1.75	 (0.6726194034329211+0j)
1.8	 (0.6658965862926706+0j)
1.85	 (0.6592183259591946+0j)
1.9000000000000001	 (0.6525943711267294+0j)
1.9500000000000002	 (0.6460316736188685+0j)
2.0	 (0.639536944202403+0j)
2.0500000000000003	 (0.63312645297111+0j)
2.1	 (0.6267446557730174+0j)
2.15	 (0.6205158470136406+0j)
2.2	 (0.614366434710102+0j)
2.25	 (0.6082999331923161+0j)
2.3000000000000003	 (0.6023135228654312+0j)
2.35	 (0.596466378170691+0j)
2.4000000000000004	 (0.5895695276248425+0j)
2.45	 (0.5851812736442568+0j)
