-4.5	 (-0.8625331998175206+0j)
-4.4	 (-0.8462567405747066+0j)
-4.300000000000001	 (-0.8403231636025802+0j)
-4.200000000000001	 (-0.8400671683375118+0j)
-4.100000000000001	 (-0.8411431042086203+0j)
-4.000000000000002	 (-0.8396102359292986+0j)
-3.900000000000002	 (-0.8394001721064391+0j)
-3.8000000000000025	 (-0.8396688008994082+0j)
-3.700000000000003	 (-0.8388774419767678+0j)
-3.600000000000003	 (-0.8386286480082218+0j)
-3.5000000000000036	 (-0.8378771885087474+0j)
-3.400000000000004	 (-0.8379552328531307+0j)
-3.3000000000000043	 (-0.8376387826987481+0j)
-3.2000000000000046	 (-0.8369956244245473+0j)
-3.100000000000005	 (-0.8364711240321457+0j)
-3.0000000000000053	 (-0.8358355471081075+0j)
-2.9000000000000057	 (-0.8352068352236407+0j)
-2.800000000000006	 (-0.8344279745695959+0j)
-2.7000000000000064	 (-0.8335234318297243+0j)
-2.6000000000000068	 (-0.8324530145916759+0j)
-2.500000000000007	 (-0.8311804128594302+0j)
-2.4000000000000075	 (-0.8296339770481924+0j)
-2.300000000000008	 (-0.8277287834335214+0j)
-2.200000000000008	 (-0.8253329144623128+0j)
-2.1000000000000085	 (-0.8222570947605239+0j)
-2.000000000000009	 (-0.818221871349973+0j)
-1.9000000000000092	 (-0.812824711845222+0j)
-1.8000000000000096	 (-0.8055214489914655+0j)
-1.70000000000001	 (-0.7956934557550844+0j)
-1.6000000000000103	 (-0.7829320783386704+0j)
-1.5000000000000107	 (-0.767575204385815+0j)
-1.400000000000011	 (-0.7510184335694725+0j)
-1.3000000000000114	 (-0.7350757388064332+0j)
-1.2000000000000117	 (-0.720849393317186+0j)
-1.100000000000012	 (-0.7083963508557254+0j)
-1.0000000000000124	 (-0.6971097939712457+0j)
-0.9000000000000128	 (-0.6862046387224668+0j)
-0.8000000000000131	 (-0.6745315863923029+0j)
-0.7000000000000135	 (-0.6601369585928799+0j)
-0.6000000000000139	 (-0.6367772919131195+0j)
-0.5000000000000142	 (-0.5722064377811515+0j)
-0.40000000000001457	 (-0.38896927028136774+0j)
-0.3000000000000149	 (-0.35471519200862556+0j)
-0.20000000000001528	 (-0.32152068785887555+0j)
-0.10000000000001563	 (-0.2707982760388013+0j)
