1	 50.0
2	 29.559693491089448
3	 13.462328208866813
4	 7.003180696837744
5	 -8.84968015121285
6	 -13.324335167332215
7	 -22.8810993737631
8	 -31.110507117250126
9	 -33.75162391934785
10	 -42.014367924449004
11	 -48.94595663206178
12	 -50.09577788586554
13	 -50.41781589391932
14	 -50.445557932614335
15	 -50.45014669155861
16	 -50.45077239160223
17	 -50.45087213584621
18	 -50.450879755035345
19	 -50.45088103897375
20	 -50.45088127336104
21	 -50.45088130605266
22	 -50.450881308520124
23	 -50.4508813089007
24	 -50.45088130896029
25	 -50.45088130896656
26	 -50.450881308967105
27	 -50.450881308967254
28	 -50.450881308967254
29	 -50.450881308967354
30	 -50.450881308967276
31	 -50.450881308967254
32	 -50.45088130896734
33	 -50.450881308967304
34	 -50.45088130896735
35	 -50.45088130896725
36	 -50.45088130896728
37	 -50.45088130896726
38	 -50.45088130896721
39	 -50.45088130896718
40	 -50.45088130896734
41	 -50.45088130896737
42	 -50.45088130896731
43	 -50.45088130896732
44	 -50.45088130896714
45	 -50.45088130896722
46	 -50.450881308967205
47	 -50.45088130896726
48	 -50.450881308967226
49	 -50.45088130896734
50	 -50.4508813089673
51	 -50.45088130896732
52	 -50.450881308967325
53	 -50.450881308967254
54	 -50.45088130896718
55	 -50.45088130896718
56	 -50.45088130896732
57	 -50.45088130896734
58	 -50.45088130896721
59	 -50.45088130896738
60	 -50.45088130896727
