0.0	 0j
0.01	 0j
0.02	 0j
0.03	 0j
0.04	 0j
0.05	 0j
0.06	 0j
0.07	 0j
0.08	 0j
0.09	 0j
0.1	 0j
0.11	 0j
0.12	 0j
0.13	 0j
0.14	 0j
0.15	 0j
0.16	 0j
0.17	 0j
0.18	 0j
0.19	 0j
0.2	 0j
0.21	 0j
0.22	 0j
0.23	 0j
0.24	 0j
0.25	 0j
0.26	 0j
0.27	 0j
0.28	 0j
0.29	 0j
0.3	 0j
0.31	 0j
0.32	 0j
0.33	 0j
0.34	 0j
0.35000000000000003	 0j
0.36	 0j
0.37	 0j
0.38	 0j
0.39	 0j
0.4	 0j
0.41000000000000003	 0j
0.42	 0j
0.43	 0j
0.44	 0j
0.45	 0j
0.46	 0j
0.47000000000000003	 0j
0.48	 0j
0.49	 0j
0.5	 0j
0.51	 0j
0.52	 0j
0.53	 0j
0.54	 0j
0.55	 0j
0.56	 0j
0.5700000000000001	 0j
0.58	 0j
0.59	 0j
0.6	 0j
0.61	 0j
0.62	 0j
0.63	 0j
0.64	 0j
0.65	 0j
0.66	 0j
0.67	 0j
0.68	 0j
0.6900000000000001	 0j
0.7000000000000001	 0j
0.71	 0j
0.72	 0j
0.73	 0j
0.74	 0j
0.75	 0j
0.76	 0j
0.77	 0j
0.78	 0j
0.79	 0j
0.8	 0j
0.81	 0j
0.8200000000000001	 0j
0.8300000000000001	 0j
0.84	 0j
0.85	 0j
0.86	 0j
0.87	 0j
0.88	 0j
0.89	 0j
0.9	 0j
0.91	 0j
0.92	 0j
0.93	 0j
0.9400000000000001	 0j
0.9500000000000001	 0j
0.96	 0j
0.97	 0j
0.98	 0j
0.99	 0j
1.0	 0j
1.01	 0j
1.02	 0j
1.03	 0j
1.04	 0j
1.05	 0j
1.06	 0j
1.07	 0j
1.08	 0j
1.09	 0j
1.1	 0j
1.11	 0j
1.12	 0j
1.1300000000000001	 0j
1.1400000000000001	 0j
1.1500000000000001	 0j
1.16	 0j
1.17	 0j
1.18	 0j
1.19	 0j
1.2	 0j
1.21	 0j
1.22	 0j
1.23	 0j
1.24	 0j
1.25	 0j
1.26	 0j
1.27	 0j
1.28	 0j
1.29	 0j
1.3	 0j
1.31	 0j
1.32	 0j
1.33	 0j
1.34	 0j
1.35	 0j
1.36	 0j
1.37	 0j
1.3800000000000001	 0j
1.3900000000000001	 0j
1.4000000000000001	 0j
1.41	 0j
1.42	 0j
1.43	 0j
1.44	 0j
1.45	 0j
1.46	 0j
1.47	 0j
1.48	 0j
1.49	 0j
1.5	 0j
1.51	 0j
1.52	 0j
1.53	 0j
1.54	 0j
1.55	 0j
1.56	 0j
1.57	 0j
1.58	 0j
1.59	 0j
1.6	 0j
1.61	 0j
1.62	 0j
1.6300000000000001	 0j
1.6400000000000001	 0j
1.6500000000000001	 0j
1.6600000000000001	 0j
1.67	 0j
1.68	 0j
1.69	 0j
1.7	 0j
1.71	 0j
1.72	 0j
1.73	 0j
1.74	 0j
1.75	 0j
1.76	 0j
1.77	 0j
1.78	 0j
1.79	 0j
1.8	 0j
1.81	 0j
1.82	 0j
1.83	 0j
1.84	 0j
1.85	 0j
1.86	 0j
1.87	 0j
1.8800000000000001	 0j
1.8900000000000001	 0j
1.9000000000000001	 0j
1.9100000000000001	 0j
1.92	 0j
1.93	 0j
1.94	 0j
1.95	 0j
1.96	 0j
1.97	 0j
1.98	 0j
1.99	 0j
2.0	 0j
2.0100000000000002	 0j
2.02	 0j
2.0300000000000002	 0j
2.04	 0j
2.05	 0j
2.06	 0j
2.07	 0j
2.08	 0j
2.09	 0j
2.1	 0j
2.11	 0j
2.12	 0j
2.13	 0j
2.14	 0j
2.15	 0j
2.16	 0j
2.17	 0j
2.18	 0j
2.19	 0j
2.2	 0j
2.21	 0j
2.22	 0j
2.23	 0j
2.24	 0j
2.25	 0j
2.2600000000000002	 0j
2.27	 0j
2.2800000000000002	 0j
2.29	 0j
2.3000000000000003	 0j
2.31	 0j
2.32	 0j
2.33	 0j
2.34	 0j
2.35	 0j
2.36	 0j
2.37	 0j
2.38	 0j
2.39	 0j
2.4	 0j
2.41	 0j
2.42	 0j
2.43	 0j
2.44	 0j
2.45	 0j
2.46	 0j
2.47	 0j
2.48	 0j
2.49	 0j
2.5	 0j
2.5100000000000002	 0j
2.52	 0j
2.5300000000000002	 0j
2.54	 0j
2.5500000000000003	 0j
2.56	 0j
2.57	 0j
2.58	 0j
2.59	 0j
2.6	 0j
2.61	 0j
2.62	 0j
2.63	 0j
2.64	 0j
2.65	 0j
2.66	 0j
2.67	 0j
2.68	 0j
2.69	 0j
2.7	 0j
2.71	 0j
2.72	 0j
2.73	 0j
2.74	 0j
2.75	 0j
2.7600000000000002	 0j
2.77	 0j
2.7800000000000002	 0j
2.79	 0j
2.8000000000000003	 0j
2.81	 0j
2.82	 0j
2.83	 0j
2.84	 0j
2.85	 0j
2.86	 0j
2.87	 0j
2.88	 0j
2.89	 0j
2.9	 0j
2.91	 0j
2.92	 0j
2.93	 0j
2.94	 0j
2.95	 0j
2.96	 0j
2.97	 0j
2.98	 0j
2.99	 0j
3.0	 0j
3.0100000000000002	 0j
3.02	 0j
3.0300000000000002	 0j
3.04	 0j
3.0500000000000003	 0j
3.06	 0j
3.0700000000000003	 0j
3.08	 0j
3.09	 0j
3.1	 0j
3.11	 0j
3.12	 0j
3.13	 0j
3.14	 0j
3.15	 0j
3.16	 0j
3.17	 0j
3.18	 0j
3.19	 0j
3.2	 0j
3.21	 0j
3.22	 0j
3.23	 0j
3.24	 0j
3.25	 0j
3.2600000000000002	 0j
3.27	 0j
3.2800000000000002	 0j
3.29	 0j
3.3000000000000003	 0j
3.31	 0j
3.3200000000000003	 0j
3.33	 0j
3.34	 0j
3.35	 0j
3.36	 0j
3.37	 0j
3.38	 0j
3.39	 0j
3.4	 0j
3.41	 0j
3.42	 0j
3.43	 0j
3.44	 0j
3.45	 0j
3.46	 0j
3.47	 0j
3.48	 0j
3.49	 0j
3.5	 0j
3.5100000000000002	 0j
3.52	 0j
3.5300000000000002	 0j
3.54	 0j
3.5500000000000003	 0j
3.56	 0j
3.5700000000000003	 0j
3.58	 0j
3.59	 0j
3.6	 0j
3.61	 0j
3.62	 0j
3.63	 0j
3.64	 0j
3.65	 0j
3.66	 0j
3.67	 0j
3.68	 0j
3.69	 0j
3.7	 0j
3.71	 0j
3.72	 0j
3.73	 0j
3.74	 0j
3.75	 0j
3.7600000000000002	 0j
3.77	 0j
3.7800000000000002	 0j
3.79	 0j
3.8000000000000003	 0j
3.81	 0j
3.8200000000000003	 0j
3.83	 0j
3.84	 0j
3.85	 0j
3.86	 0j
3.87	 0j
3.88	 0j
3.89	 0j
3.9	 0j
3.91	 0j
3.92	 0j
3.93	 0j
3.94	 0j
3.95	 0j
3.96	 0j
3.97	 0j
3.98	 0j
3.99	 0j
4.0	 0j
4.01	 0j
4.0200000000000005	 0j
4.03	 0j
4.04	 0j
4.05	 0j
4.0600000000000005	 0j
4.07	 0j
4.08	 0j
4.09	 0j
4.1	 0j
4.11	 0j
4.12	 0j
4.13	 0j
4.14	 0j
4.15	 0j
4.16	 0j
4.17	 0j
4.18	 0j
4.19	 0j
4.2	 0j
4.21	 0j
4.22	 0j
4.23	 0j
4.24	 0j
4.25	 0j
4.26	 0j
4.2700000000000005	 0j
4.28	 0j
4.29	 0j
4.3	 0j
4.3100000000000005	 0j
4.32	 0j
4.33	 0j
4.34	 0j
4.3500000000000005	 0j
4.36	 0j
4.37	 0j
4.38	 0j
4.39	 0j
4.4	 0j
4.41	 0j
4.42	 0j
4.43	 0j
4.44	 0j
4.45	 0j
4.46	 0j
4.47	 0j
4.48	 0j
4.49	 0j
4.5	 0j
4.51	 0j
4.5200000000000005	 0j
4.53	 0j
4.54	 0j
4.55	 0j
4.5600000000000005	 0j
4.57	 0j
4.58	 0j
4.59	 0j
4.6000000000000005	 0j
4.61	 0j
4.62	 0j
4.63	 0j
4.64	 0j
4.65	 0j
4.66	 0j
4.67	 0j
4.68	 0j
4.69	 0j
4.7	 0j
4.71	 0j
4.72	 0j
4.73	 0j
4.74	 0j
4.75	 0j
4.76	 0j
4.7700000000000005	 0j
4.78	 0j
4.79	 0j
4.8	 0j
4.8100000000000005	 0j
4.82	 0j
4.83	 0j
4.84	 0j
4.8500000000000005	 0j
4.86	 0j
4.87	 0j
4.88	 0j
4.89	 0j
4.9	 0j
4.91	 0j
4.92	 0j
4.93	 0j
4.94	 0j
4.95	 0j
4.96	 0j
4.97	 0j
4.98	 0j
4.99	 0j
5.0	 0j
5.01	 0j
5.0200000000000005	 0j
5.03	 0j
5.04	 0j
5.05	 0j
5.0600000000000005	 0j
5.07	 0j
5.08	 0j
5.09	 0j
5.1000000000000005	 0j
5.11	 0j
5.12	 0j
5.13	 0j
5.14	 0j
5.15	 0j
5.16	 0j
5.17	 0j
5.18	 0j
5.19	 0j
5.2	 0j
5.21	 0j
5.22	 0j
5.23	 0j
5.24	 0j
5.25	 0j
5.26	 0j
5.2700000000000005	 0j
5.28	 0j
5.29	 0j
5.3	 0j
5.3100000000000005	 0j
5.32	 0j
5.33	 0j
5.34	 0j
5.3500000000000005	 0j
5.36	 0j
5.37	 0j
5.38	 0j
5.39	 0j
5.4	 0j
5.41	 0j
5.42	 0j
5.43	 0j
5.44	 0j
5.45	 0j
5.46	 0j
5.47	 0j
5.48	 0j
5.49	 0j
5.5	 0j
5.51	 0j
5.5200000000000005	 0j
5.53	 0j
5.54	 0j
5.55	 0j
5.5600000000000005	 0j
5.57	 0j
5.58	 0j
5.59	 0j
5.6000000000000005	 0j
5.61	 0j
5.62	 0j
5.63	 0j
5.64	 0j
5.65	 0j
5.66	 0j
5.67	 0j
5.68	 0j
5.69	 0j
5.7	 0j
5.71	 0j
5.72	 0j
5.73	 0j
5.74	 0j
5.75	 0j
5.76	 0j
5.7700000000000005	 0j
5.78	 0j
5.79	 0j
5.8	 0j
5.8100000000000005	 0j
5.82	 0j
5.83	 0j
5.84	 0j
5.8500000000000005	 0j
5.86	 0j
5.87	 0j
5.88	 0j
5.89	 0j
5.9	 0j
5.91	 0j
5.92	 0j
5.93	 0j
5.94	 0j
5.95	 0j
5.96	 0j
5.97	 0j
5.98	 0j
5.99	 0j
6.0	 0j
6.01	 0j
6.0200000000000005	 0j
6.03	 0j
6.04	 0j
6.05	 0j
6.0600000000000005	 0j
6.07	 0j
6.08	 0j
6.09	 0j
6.1000000000000005	 0j
6.11	 0j
6.12	 0j
6.13	 0j
6.140000000000001	 0j
6.15	 0j
6.16	 0j
6.17	 0j
6.18	 0j
6.19	 0j
6.2	 0j
6.21	 0j
6.22	 0j
6.23	 0j
6.24	 0j
6.25	 0j
6.26	 0j
6.2700000000000005	 0j
6.28	 0j
6.29	 0j
6.3	 0j
6.3100000000000005	 0j
6.32	 0j
6.33	 0j
6.34	 0j
6.3500000000000005	 0j
6.36	 0j
6.37	 0j
6.38	 0j
6.390000000000001	 0j
6.4	 0j
6.41	 0j
6.42	 0j
6.43	 0j
6.44	 0j
6.45	 0j
6.46	 0j
6.47	 0j
6.48	 0j
6.49	 0j
6.5	 0j
6.51	 0j
6.5200000000000005	 0j
6.53	 0j
6.54	 0j
6.55	 0j
6.5600000000000005	 0j
6.57	 0j
6.58	 0j
6.59	 0j
6.6000000000000005	 0j
6.61	 0j
6.62	 0j
6.63	 0j
6.640000000000001	 0j
6.65	 0j
6.66	 0j
6.67	 0j
6.68	 0j
6.69	 0j
6.7	 0j
6.71	 0j
6.72	 0j
6.73	 0j
6.74	 0j
6.75	 0j
6.76	 0j
6.7700000000000005	 0j
6.78	 0j
6.79	 0j
6.8	 0j
6.8100000000000005	 0j
6.82	 0j
6.83	 0j
6.84	 0j
6.8500000000000005	 0j
6.86	 0j
6.87	 0j
6.88	 0j
6.890000000000001	 0j
6.9	 0j
6.91	 0j
6.92	 0j
6.93	 0j
6.94	 0j
6.95	 0j
6.96	 0j
6.97	 0j
6.98	 0j
6.99	 0j
7.0	 0j
7.01	 0j
7.0200000000000005	 0j
7.03	 0j
7.04	 0j
7.05	 0j
7.0600000000000005	 0j
7.07	 0j
7.08	 0j
7.09	 0j
7.1000000000000005	 0j
7.11	 0j
7.12	 0j
7.13	 0j
7.140000000000001	 0j
7.15	 0j
7.16	 0j
7.17	 0j
7.18	 0j
7.19	 0j
7.2	 0j
7.21	 0j
7.22	 0j
7.23	 0j
7.24	 0j
7.25	 0j
7.26	 0j
7.2700000000000005	 0j
7.28	 0j
7.29	 0j
7.3	 0j
7.3100000000000005	 0j
7.32	 0j
7.33	 0j
7.34	 0j
7.3500000000000005	 0j
7.36	 0j
7.37	 0j
7.38	 0j
7.390000000000001	 0j
7.4	 0j
7.41	 0j
7.42	 0j
7.43	 0j
7.44	 0j
7.45	 0j
7.46	 0j
7.47	 0j
7.48	 0j
7.49	 0j
7.5	 0j
7.51	 0j
7.5200000000000005	 0j
7.53	 0j
7.54	 0j
7.55	 0j
7.5600000000000005	 0j
7.57	 0j
7.58	 0j
7.59	 0j
7.6000000000000005	 0j
7.61	 0j
7.62	 0j
7.63	 0j
7.640000000000001	 0j
7.65	 0j
7.66	 0j
7.67	 0j
7.68	 0j
7.69	 0j
7.7	 0j
7.71	 0j
7.72	 0j
7.73	 0j
7.74	 0j
7.75	 0j
7.76	 0j
7.7700000000000005	 0j
7.78	 0j
7.79	 0j
7.8	 0j
7.8100000000000005	 0j
7.82	 0j
7.83	 0j
7.84	 0j
7.8500000000000005	 0j
7.86	 0j
7.87	 0j
7.88	 0j
7.890000000000001	 0j
7.9	 0j
7.91	 0j
7.92	 0j
7.930000000000001	 0j
7.94	 0j
7.95	 0j
7.96	 0j
7.97	 0j
7.98	 0j
7.99	 0j
8.0	 0j
8.01	 0j
8.02	 0j
8.03	 0j
8.040000000000001	 0j
8.05	 0j
8.06	 0j
8.07	 0j
8.08	 0j
8.09	 0j
8.1	 0j
8.11	 0j
8.120000000000001	 0j
8.13	 0j
8.14	 0j
8.15	 0j
8.16	 0j
8.17	 0j
8.18	 0j
8.19	 0j
8.2	 0j
8.21	 0j
8.22	 0j
8.23	 0j
8.24	 0j
8.25	 0j
8.26	 0j
8.27	 0j
8.28	 0j
8.290000000000001	 0j
8.3	 0j
8.31	 0j
8.32	 0j
8.33	 0j
8.34	 0j
8.35	 0j
8.36	 0j
8.370000000000001	 0j
8.38	 0j
8.39	 0j
8.4	 0j
8.41	 0j
8.42	 0j
8.43	 0j
8.44	 0j
8.45	 0j
8.46	 0j
8.47	 0j
8.48	 0j
8.49	 0j
8.5	 0j
8.51	 0j
8.52	 0j
8.53	 0j
8.540000000000001	 0j
8.55	 0j
8.56	 0j
8.57	 0j
8.58	 0j
8.59	 0j
8.6	 0j
8.61	 0j
8.620000000000001	 0j
8.63	 0j
8.64	 0j
8.65	 0j
8.66	 0j
8.67	 0j
8.68	 0j
8.69	 0j
8.700000000000001	 0j
8.71	 0j
8.72	 0j
8.73	 0j
8.74	 0j
8.75	 0j
8.76	 0j
8.77	 0j
8.78	 0j
8.790000000000001	 0j
8.8	 0j
8.81	 0j
8.82	 0j
8.83	 0j
8.84	 0j
8.85	 0j
8.86	 0j
8.870000000000001	 0j
8.88	 0j
8.89	 0j
8.9	 0j
8.91	 0j
8.92	 0j
8.93	 0j
8.94	 0j
8.950000000000001	 0j
8.96	 0j
8.97	 0j
8.98	 0j
8.99	 0j
9.0	 0j
9.01	 0j
9.02	 0j
9.03	 0j
9.040000000000001	 0j
9.05	 0j
9.06	 0j
9.07	 0j
9.08	 0j
9.09	 0j
9.1	 0j
9.11	 0j
9.120000000000001	 0j
9.13	 0j
9.14	 0j
9.15	 0j
9.16	 0j
9.17	 0j
9.18	 0j
9.19	 0j
9.200000000000001	 0j
9.21	 0j
9.22	 0j
9.23	 0j
9.24	 0j
9.25	 0j
9.26	 0j
9.27	 0j
9.28	 0j
9.290000000000001	 0j
9.3	 0j
9.31	 0j
9.32	 0j
9.33	 0j
9.34	 0j
9.35	 0j
9.36	 0j
9.370000000000001	 0j
9.38	 0j
9.39	 0j
9.4	 0j
9.41	 0j
9.42	 0j
9.43	 0j
9.44	 0j
9.450000000000001	 0j
9.46	 0j
9.47	 0j
9.48	 0j
9.49	 0j
9.5	 0j
9.51	 0j
9.52	 0j
9.53	 0j
9.540000000000001	 0j
9.55	 0j
9.56	 0j
9.57	 0j
9.58	 0j
9.59	 0j
9.6	 0j
9.61	 0j
9.620000000000001	 0j
9.63	 0j
9.64	 0j
9.65	 0j
9.66	 0j
9.67	 0j
9.68	 0j
9.69	 0j
9.700000000000001	 0j
9.71	 0j
9.72	 0j
9.73	 0j
9.74	 0j
9.75	 0j
9.76	 0j
9.77	 0j
9.78	 0j
9.790000000000001	 0j
9.8	 0j
9.81	 0j
9.82	 0j
9.83	 0j
9.84	 0j
9.85	 0j
9.86	 0j
9.870000000000001	 0j
9.88	 0j
9.89	 0j
9.9	 0j
9.91	 0j
9.92	 0j
9.93	 0j
9.94	 0j
9.950000000000001	 0j
9.96	 0j
9.97	 0j
9.98	 0j
9.99	 0j
10.0	 0j
10.01	 0j
10.02	 0j
10.03	 0j
10.040000000000001	 0j
10.05	 0j
10.06	 0j
10.07	 0j
10.08	 0j
10.09	 0j
10.1	 0j
10.11	 0j
10.120000000000001	 0j
10.13	 0j
10.14	 0j
10.15	 0j
10.16	 0j
10.17	 0j
10.18	 0j
10.19	 0j
10.200000000000001	 0j
10.21	 0j
10.22	 0j
10.23	 0j
10.24	 0j
10.25	 0j
10.26	 0j
10.27	 0j
10.28	 0j
10.290000000000001	 0j
10.3	 0j
10.31	 0j
10.32	 0j
10.33	 0j
10.34	 0j
10.35	 0j
10.36	 0j
10.370000000000001	 0j
10.38	 0j
10.39	 0j
10.4	 0j
10.41	 0j
10.42	 0j
10.43	 0j
10.44	 0j
10.450000000000001	 0j
10.46	 0j
10.47	 0j
10.48	 0j
10.49	 0j
10.5	 0j
10.51	 0j
10.52	 0j
10.53	 0j
10.540000000000001	 0j
10.55	 0j
10.56	 0j
10.57	 0j
10.58	 0j
10.59	 0j
10.6	 0j
10.61	 0j
10.620000000000001	 0j
10.63	 0j
10.64	 0j
10.65	 0j
10.66	 0j
10.67	 0j
10.68	 0j
10.69	 0j
10.700000000000001	 0j
10.71	 0j
10.72	 0j
10.73	 0j
10.74	 0j
10.75	 0j
10.76	 0j
10.77	 0j
10.78	 0j
10.790000000000001	 0j
10.8	 0j
10.81	 0j
10.82	 0j
10.83	 0j
10.84	 0j
10.85	 0j
10.86	 0j
10.870000000000001	 0j
10.88	 0j
10.89	 0j
10.9	 0j
10.91	 0j
10.92	 0j
10.93	 0j
10.94	 0j
10.950000000000001	 0j
10.96	 0j
10.97	 0j
10.98	 0j
10.99	 0j
11.0	 0j
11.01	 0j
11.02	 0j
11.03	 0j
11.040000000000001	 0j
11.05	 0j
11.06	 0j
11.07	 0j
11.08	 0j
11.09	 0j
11.1	 0j
11.11	 0j
11.120000000000001	 0j
11.13	 0j
11.14	 0j
11.15	 0j
11.16	 0j
11.17	 0j
11.18	 0j
11.19	 0j
11.200000000000001	 0j
11.21	 0j
11.22	 0j
11.23	 0j
11.24	 0j
11.25	 0j
11.26	 0j
11.27	 0j
11.28	 0j
11.290000000000001	 0j
11.3	 0j
11.31	 0j
11.32	 0j
11.33	 0j
11.34	 0j
11.35	 0j
11.36	 0j
11.370000000000001	 0j
11.38	 0j
11.39	 0j
11.4	 0j
11.41	 0j
11.42	 0j
11.43	 0j
11.44	 0j
11.450000000000001	 0j
11.46	 0j
11.47	 0j
11.48	 0j
11.49	 0j
11.5	 0j
11.51	 0j
11.52	 0j
11.53	 0j
11.540000000000001	 0j
11.55	 0j
11.56	 0j
11.57	 0j
11.58	 0j
11.59	 0j
11.6	 0j
11.61	 0j
11.620000000000001	 0j
11.63	 0j
11.64	 0j
11.65	 0j
11.66	 0j
11.67	 0j
11.68	 0j
11.69	 0j
11.700000000000001	 0j
11.71	 0j
11.72	 0j
11.73	 0j
11.74	 0j
11.75	 0j
11.76	 0j
11.77	 0j
11.78	 0j
11.790000000000001	 0j
11.8	 0j
11.81	 0j
11.82	 0j
11.83	 0j
11.84	 0j
11.85	 0j
11.86	 0j
11.870000000000001	 0j
11.88	 0j
11.89	 0j
11.9	 0j
11.91	 0j
11.92	 0j
11.93	 0j
11.94	 0j
11.950000000000001	 0j
11.96	 0j
11.97	 0j
11.98	 0j
11.99	 0j
12.0	 0j
12.01	 0j
12.02	 0j
12.030000000000001	 0j
12.040000000000001	 0j
12.05	 0j
12.06	 0j
12.07	 0j
12.08	 0j
12.09	 0j
12.1	 0j
12.11	 0j
12.120000000000001	 0j
12.13	 0j
12.14	 0j
12.15	 0j
12.16	 0j
12.17	 0j
12.18	 0j
12.19	 0j
12.200000000000001	 0j
12.21	 0j
12.22	 0j
12.23	 0j
12.24	 0j
12.25	 0j
12.26	 0j
12.27	 0j
12.280000000000001	 0j
12.290000000000001	 0j
12.3	 0j
12.31	 0j
12.32	 0j
12.33	 0j
12.34	 0j
12.35	 0j
12.36	 0j
12.370000000000001	 0j
12.38	 0j
12.39	 0j
12.4	 0j
12.41	 0j
12.42	 0j
12.43	 0j
12.44	 0j
12.450000000000001	 0j
12.46	 0j
12.47	 0j
12.48	 0j
12.49	 0j
12.5	 0j
12.51	 0j
12.52	 0j
12.530000000000001	 0j
12.540000000000001	 0j
12.55	 0j
12.56	 0j
12.57	 0j
12.58	 0j
12.59	 0j
12.6	 0j
12.61	 0j
12.620000000000001	 0j
12.63	 0j
12.64	 0j
12.65	 0j
12.66	 0j
12.67	 0j
12.68	 0j
12.69	 0j
12.700000000000001	 0j
12.71	 0j
12.72	 0j
12.73	 0j
12.74	 0j
12.75	 0j
12.76	 0j
12.77	 0j
12.780000000000001	 0j
12.790000000000001	 0j
12.8	 0j
12.81	 0j
12.82	 0j
12.83	 0j
12.84	 0j
12.85	 0j
12.86	 0j
12.870000000000001	 0j
12.88	 0j
12.89	 0j
12.9	 0j
12.91	 0j
12.92	 0j
12.93	 0j
12.94	 0j
12.950000000000001	 0j
12.96	 0j
12.97	 0j
12.98	 0j
12.99	 0j
13.0	 0j
13.01	 0j
13.02	 0j
13.030000000000001	 0j
13.040000000000001	 0j
13.05	 0j
13.06	 0j
13.07	 0j
13.08	 0j
13.09	 0j
13.1	 0j
13.11	 0j
13.120000000000001	 0j
13.13	 0j
13.14	 0j
13.15	 0j
13.16	 0j
13.17	 0j
13.18	 0j
13.19	 0j
13.200000000000001	 0j
13.21	 0j
13.22	 0j
13.23	 0j
13.24	 0j
13.25	 0j
13.26	 0j
13.27	 0j
13.280000000000001	 0j
13.290000000000001	 0j
13.3	 0j
13.31	 0j
13.32	 0j
13.33	 0j
13.34	 0j
13.35	 0j
13.36	 0j
13.370000000000001	 0j
13.38	 0j
13.39	 0j
13.4	 0j
13.41	 0j
13.42	 0j
13.43	 0j
13.44	 0j
13.450000000000001	 0j
13.46	 0j
13.47	 0j
13.48	 0j
13.49	 0j
13.5	 0j
13.51	 0j
13.52	 0j
13.530000000000001	 0j
13.540000000000001	 0j
13.55	 0j
13.56	 0j
13.57	 0j
13.58	 0j
13.59	 0j
13.6	 0j
13.61	 0j
13.620000000000001	 0j
13.63	 0j
13.64	 0j
13.65	 0j
13.66	 0j
13.67	 0j
13.68	 0j
13.69	 0j
13.700000000000001	 0j
13.71	 0j
13.72	 0j
13.73	 0j
13.74	 0j
13.75	 0j
13.76	 0j
13.77	 0j
13.780000000000001	 0j
13.790000000000001	 0j
13.8	 0j
13.81	 0j
13.82	 0j
13.83	 0j
13.84	 0j
13.85	 0j
13.86	 0j
13.870000000000001	 0j
13.88	 0j
13.89	 0j
13.9	 0j
13.91	 0j
13.92	 0j
13.93	 0j
13.94	 0j
13.950000000000001	 0j
13.96	 0j
13.97	 0j
13.98	 0j
13.99	 0j
14.0	 0j
14.01	 0j
14.02	 0j
14.030000000000001	 0j
14.040000000000001	 0j
14.05	 0j
14.06	 0j
14.07	 0j
14.08	 0j
14.09	 0j
14.1	 0j
14.11	 0j
14.120000000000001	 0j
14.13	 0j
14.14	 0j
14.15	 0j
14.16	 0j
14.17	 0j
14.18	 0j
14.19	 0j
14.200000000000001	 0j
14.21	 0j
14.22	 0j
14.23	 0j
14.24	 0j
14.25	 0j
14.26	 0j
14.27	 0j
14.280000000000001	 0j
14.290000000000001	 0j
14.3	 0j
14.31	 0j
14.32	 0j
14.33	 0j
14.34	 0j
14.35	 0j
14.36	 0j
14.370000000000001	 0j
14.38	 0j
14.39	 0j
14.4	 0j
14.41	 0j
14.42	 0j
14.43	 0j
14.44	 0j
14.450000000000001	 0j
14.46	 0j
14.47	 0j
14.48	 0j
14.49	 0j
14.5	 0j
14.51	 0j
14.52	 0j
14.530000000000001	 0j
14.540000000000001	 0j
14.55	 0j
14.56	 0j
14.57	 0j
14.58	 0j
14.59	 0j
14.6	 0j
14.61	 0j
14.620000000000001	 0j
14.63	 0j
14.64	 0j
14.65	 0j
14.66	 0j
14.67	 0j
14.68	 0j
14.69	 0j
14.700000000000001	 0j
14.71	 0j
14.72	 0j
14.73	 0j
14.74	 0j
14.75	 0j
14.76	 0j
14.77	 0j
14.780000000000001	 0j
14.790000000000001	 0j
14.8	 0j
14.81	 0j
14.82	 0j
14.83	 0j
14.84	 0j
14.85	 0j
14.86	 0j
14.870000000000001	 0j
14.88	 0j
14.89	 0j
14.9	 0j
14.91	 0j
14.92	 0j
14.93	 0j
14.94	 0j
14.950000000000001	 0j
14.96	 0j
14.97	 0j
14.98	 0j
14.99	 0j
15.0	 0j
15.01	 0j
15.02	 0j
15.030000000000001	 0j
15.040000000000001	 0j
15.05	 0j
15.06	 0j
15.07	 0j
15.08	 0j
15.09	 0j
15.1	 0j
15.11	 0j
15.120000000000001	 0j
15.13	 0j
15.14	 0j
15.15	 0j
15.16	 0j
15.17	 0j
15.18	 0j
15.19	 0j
15.200000000000001	 0j
15.21	 0j
15.22	 0j
15.23	 0j
15.24	 0j
15.25	 0j
15.26	 0j
15.27	 0j
15.280000000000001	 0j
15.290000000000001	 0j
15.3	 0j
15.31	 0j
15.32	 0j
15.33	 0j
15.34	 0j
15.35	 0j
15.36	 0j
15.370000000000001	 0j
15.38	 0j
15.39	 0j
15.4	 0j
15.41	 0j
15.42	 0j
15.43	 0j
15.44	 0j
15.450000000000001	 0j
15.46	 0j
15.47	 0j
15.48	 0j
15.49	 0j
15.5	 0j
15.51	 0j
15.52	 0j
15.530000000000001	 0j
15.540000000000001	 0j
15.55	 0j
15.56	 0j
15.57	 0j
15.58	 0j
15.59	 0j
15.6	 0j
15.610000000000001	 0j
15.620000000000001	 0j
15.63	 0j
15.64	 0j
15.65	 0j
15.66	 0j
15.67	 0j
15.68	 0j
15.69	 0j
15.700000000000001	 0j
15.71	 0j
15.72	 0j
15.73	 0j
15.74	 0j
15.75	 0j
15.76	 0j
15.77	 0j
15.780000000000001	 0j
15.790000000000001	 0j
15.8	 0j
15.81	 0j
15.82	 0j
15.83	 0j
15.84	 0j
15.85	 0j
15.860000000000001	 0j
15.870000000000001	 0j
15.88	 0j
15.89	 0j
15.9	 0j
15.91	 0j
15.92	 0j
15.93	 0j
15.94	 0j
15.950000000000001	 0j
15.96	 0j
15.97	 0j
15.98	 0j
15.99	 0j
16.0	 0j
16.01	 0j
16.02	 0j
16.03	 0j
16.04	 0j
16.05	 0j
16.06	 0j
16.07	 0j
16.080000000000002	 0j
16.09	 0j
16.1	 0j
16.11	 0j
16.12	 0j
16.13	 0j
16.14	 0j
16.15	 0j
16.16	 0j
16.17	 0j
16.18	 0j
16.19	 0j
16.2	 0j
16.21	 0j
16.22	 0j
16.23	 0j
16.240000000000002	 0j
16.25	 0j
16.26	 0j
16.27	 0j
16.28	 0j
16.29	 0j
16.3	 0j
16.31	 0j
16.32	 0j
16.330000000000002	 0j
16.34	 0j
16.35	 0j
16.36	 0j
16.37	 0j
16.38	 0j
16.39	 0j
16.4	 0j
16.41	 0j
16.42	 0j
16.43	 0j
16.44	 0j
16.45	 0j
16.46	 0j
16.47	 0j
16.48	 0j
16.490000000000002	 0j
16.5	 0j
16.51	 0j
16.52	 0j
16.53	 0j
16.54	 0j
16.55	 0j
16.56	 0j
16.57	 0j
16.580000000000002	 0j
16.59	 0j
16.6	 0j
16.61	 0j
16.62	 0j
16.63	 0j
16.64	 0j
16.65	 0j
16.66	 0j
16.67	 0j
16.68	 0j
16.69	 0j
16.7	 0j
16.71	 0j
16.72	 0j
16.73	 0j
16.740000000000002	 0j
16.75	 0j
16.76	 0j
16.77	 0j
16.78	 0j
16.79	 0j
16.8	 0j
16.81	 0j
16.82	 0j
16.830000000000002	 0j
16.84	 0j
16.85	 0j
16.86	 0j
16.87	 0j
16.88	 0j
16.89	 0j
16.9	 0j
16.91	 0j
16.92	 0j
16.93	 0j
16.94	 0j
16.95	 0j
16.96	 0j
16.97	 0j
16.98	 0j
16.990000000000002	 0j
17.0	 0j
17.01	 0j
17.02	 0j
17.03	 0j
17.04	 0j
17.05	 0j
17.06	 0j
17.07	 0j
17.080000000000002	 0j
17.09	 0j
17.1	 0j
17.11	 0j
17.12	 0j
17.13	 0j
17.14	 0j
17.150000000000002	 0j
17.16	 0j
17.17	 0j
17.18	 0j
17.19	 0j
17.2	 0j
17.21	 0j
17.22	 0j
17.23	 0j
17.240000000000002	 0j
17.25	 0j
17.26	 0j
17.27	 0j
17.28	 0j
17.29	 0j
17.3	 0j
17.31	 0j
17.32	 0j
17.330000000000002	 0j
17.34	 0j
17.35	 0j
17.36	 0j
17.37	 0j
17.38	 0j
17.39	 0j
17.400000000000002	 0j
17.41	 0j
17.42	 0j
17.43	 0j
17.44	 0j
17.45	 0j
17.46	 0j
17.47	 0j
17.48	 0j
17.490000000000002	 0j
17.5	 0j
17.51	 0j
17.52	 0j
17.53	 0j
17.54	 0j
17.55	 0j
17.56	 0j
17.57	 0j
17.580000000000002	 0j
17.59	 0j
17.6	 0j
17.61	 0j
17.62	 0j
17.63	 0j
17.64	 0j
17.650000000000002	 0j
17.66	 0j
17.67	 0j
17.68	 0j
17.69	 0j
17.7	 0j
17.71	 0j
17.72	 0j
17.73	 0j
17.740000000000002	 0j
17.75	 0j
17.76	 0j
17.77	 0j
17.78	 0j
17.79	 0j
17.8	 0j
17.81	 0j
17.82	 0j
17.830000000000002	 0j
17.84	 0j
17.85	 0j
17.86	 0j
17.87	 0j
17.88	 0j
17.89	 0j
17.900000000000002	 0j
17.91	 0j
17.92	 0j
17.93	 0j
17.94	 0j
17.95	 0j
17.96	 0j
17.97	 0j
17.98	 0j
17.990000000000002	 0j
18.0	 0j
18.01	 0j
18.02	 0j
18.03	 0j
18.04	 0j
18.05	 0j
18.06	 0j
18.07	 0j
18.080000000000002	 0j
18.09	 0j
18.1	 0j
18.11	 0j
18.12	 0j
18.13	 0j
18.14	 0j
18.150000000000002	 0j
18.16	 0j
18.17	 0j
18.18	 0j
18.19	 0j
18.2	 0j
18.21	 0j
18.22	 0j
18.23	 0j
18.240000000000002	 0j
18.25	 0j
18.26	 0j
18.27	 0j
18.28	 0j
18.29	 0j
18.3	 0j
18.31	 0j
18.32	 0j
18.330000000000002	 0j
18.34	 0j
18.35	 0j
18.36	 0j
18.37	 0j
18.38	 0j
18.39	 0j
18.400000000000002	 0j
18.41	 0j
18.42	 0j
18.43	 0j
18.44	 0j
18.45	 0j
18.46	 0j
18.47	 0j
18.48	 0j
18.490000000000002	 0j
18.5	 0j
18.51	 0j
18.52	 0j
18.53	 0j
18.54	 0j
18.55	 0j
18.56	 0j
18.57	 0j
18.580000000000002	 0j
18.59	 0j
18.6	 0j
18.61	 0j
18.62	 0j
18.63	 0j
18.64	 0j
18.650000000000002	 0j
18.66	 0j
18.67	 0j
18.68	 0j
18.69	 0j
18.7	 0j
18.71	 0j
18.72	 0j
18.73	 0j
18.740000000000002	 0j
18.75	 0j
18.76	 0j
18.77	 0j
18.78	 0j
18.79	 0j
18.8	 0j
18.81	 0j
18.82	 0j
18.830000000000002	 0j
18.84	 0j
18.85	 0j
18.86	 0j
18.87	 0j
18.88	 0j
18.89	 0j
18.900000000000002	 0j
18.91	 0j
18.92	 0j
18.93	 0j
18.94	 0j
18.95	 0j
18.96	 0j
18.97	 0j
18.98	 0j
18.990000000000002	 0j
19.0	 0j
19.01	 0j
19.02	 0j
19.03	 0j
19.04	 0j
19.05	 0j
19.06	 0j
19.07	 0j
19.080000000000002	 0j
19.09	 0j
19.1	 0j
19.11	 0j
19.12	 0j
19.13	 0j
19.14	 0j
19.150000000000002	 0j
19.16	 0j
19.17	 0j
19.18	 0j
19.19	 0j
19.2	 0j
19.21	 0j
19.22	 0j
19.23	 0j
19.240000000000002	 0j
19.25	 0j
19.26	 0j
19.27	 0j
19.28	 0j
19.29	 0j
19.3	 0j
19.31	 0j
19.32	 0j
19.330000000000002	 0j
19.34	 0j
19.35	 0j
19.36	 0j
19.37	 0j
19.38	 0j
19.39	 0j
19.400000000000002	 0j
19.41	 0j
19.42	 0j
19.43	 0j
19.44	 0j
19.45	 0j
19.46	 0j
19.47	 0j
19.48	 0j
19.490000000000002	 0j
19.5	 0j
19.51	 0j
19.52	 0j
19.53	 0j
19.54	 0j
19.55	 0j
19.56	 0j
19.57	 0j
19.580000000000002	 0j
19.59	 0j
19.6	 0j
19.61	 0j
19.62	 0j
19.63	 0j
19.64	 0j
19.650000000000002	 0j
19.66	 0j
19.67	 0j
19.68	 0j
19.69	 0j
19.7	 0j
19.71	 0j
19.72	 0j
19.73	 0j
19.740000000000002	 0j
19.75	 0j
19.76	 0j
19.77	 0j
19.78	 0j
19.79	 0j
19.8	 0j
19.81	 0j
19.82	 0j
19.830000000000002	 0j
19.84	 0j
19.85	 0j
19.86	 0j
19.87	 0j
19.88	 0j
19.89	 0j
19.900000000000002	 0j
19.91	 0j
19.92	 0j
19.93	 0j
19.94	 0j
19.95	 0j
19.96	 0j
19.97	 0j
19.98	 0j
19.990000000000002	 0j
20.0	 0j
20.01	 0j
20.02	 0j
20.03	 0j
20.04	 0j
20.05	 0j
20.06	 0j
20.07	 0j
20.080000000000002	 0j
20.09	 0j
20.1	 0j
20.11	 0j
20.12	 0j
20.13	 0j
20.14	 0j
20.150000000000002	 0j
20.16	 0j
20.17	 0j
20.18	 0j
20.19	 0j
20.2	 0j
20.21	 0j
20.22	 0j
20.23	 0j
20.240000000000002	 0j
20.25	 0j
20.26	 0j
20.27	 0j
20.28	 0j
20.29	 0j
20.3	 0j
20.31	 0j
20.32	 0j
20.330000000000002	 0j
20.34	 0j
20.35	 0j
20.36	 0j
20.37	 0j
20.38	 0j
20.39	 0j
20.400000000000002	 0j
20.41	 0j
20.42	 0j
20.43	 0j
20.44	 0j
20.45	 0j
20.46	 0j
20.47	 0j
20.48	 0j
20.490000000000002	 0j
20.5	 0j
20.51	 0j
20.52	 0j
20.53	 0j
20.54	 0j
20.55	 0j
20.56	 0j
20.57	 0j
20.580000000000002	 0j
20.59	 0j
20.6	 0j
20.61	 0j
20.62	 0j
20.63	 0j
20.64	 0j
20.650000000000002	 0j
20.66	 0j
20.67	 0j
20.68	 0j
20.69	 0j
20.7	 0j
20.71	 0j
20.72	 0j
20.73	 0j
20.740000000000002	 0j
20.75	 0j
20.76	 0j
20.77	 0j
20.78	 0j
20.79	 0j
20.8	 0j
20.81	 0j
20.82	 0j
20.830000000000002	 0j
20.84	 0j
20.85	 0j
20.86	 0j
20.87	 0j
20.88	 0j
20.89	 0j
20.900000000000002	 0j
20.91	 0j
20.92	 0j
20.93	 0j
20.94	 0j
20.95	 0j
20.96	 0j
20.97	 0j
20.98	 0j
20.990000000000002	 0j
21.0	 0j
21.01	 0j
21.02	 0j
21.03	 0j
21.04	 0j
21.05	 0j
21.06	 0j
21.07	 0j
21.080000000000002	 0j
21.09	 0j
21.1	 0j
21.11	 0j
21.12	 0j
21.13	 0j
21.14	 0j
21.150000000000002	 0j
21.16	 0j
21.17	 0j
21.18	 0j
21.19	 0j
21.2	 0j
21.21	 0j
21.22	 0j
21.23	 0j
21.240000000000002	 0j
21.25	 0j
21.26	 0j
21.27	 0j
21.28	 0j
21.29	 0j
21.3	 0j
21.31	 0j
21.32	 0j
21.330000000000002	 0j
21.34	 0j
21.35	 0j
21.36	 0j
21.37	 0j
21.38	 0j
21.39	 0j
21.400000000000002	 0j
21.41	 0j
21.42	 0j
21.43	 0j
21.44	 0j
21.45	 0j
21.46	 0j
21.47	 0j
21.48	 0j
21.490000000000002	 0j
21.5	 0j
21.51	 0j
21.52	 0j
21.53	 0j
21.54	 0j
21.55	 0j
21.56	 0j
21.57	 0j
21.580000000000002	 0j
21.59	 0j
21.6	 0j
21.61	 0j
21.62	 0j
21.63	 0j
21.64	 0j
21.650000000000002	 0j
21.66	 0j
21.67	 0j
21.68	 0j
21.69	 0j
21.7	 0j
21.71	 0j
21.72	 0j
21.73	 0j
21.740000000000002	 0j
21.75	 0j
21.76	 0j
21.77	 0j
21.78	 0j
21.79	 0j
21.8	 0j
21.81	 0j
21.82	 0j
21.830000000000002	 0j
21.84	 0j
21.85	 0j
21.86	 0j
21.87	 0j
21.88	 0j
21.89	 0j
21.900000000000002	 0j
21.91	 0j
21.92	 0j
21.93	 0j
21.94	 0j
21.95	 0j
21.96	 0j
21.97	 0j
21.98	 0j
21.990000000000002	 0j
22.0	 0j
22.01	 0j
22.02	 0j
22.03	 0j
22.04	 0j
22.05	 0j
22.06	 0j
22.07	 0j
22.080000000000002	 0j
22.09	 0j
22.1	 0j
22.11	 0j
22.12	 0j
22.13	 0j
22.14	 0j
22.150000000000002	 0j
22.16	 0j
22.17	 0j
22.18	 0j
22.19	 0j
22.2	 0j
22.21	 0j
22.22	 0j
22.23	 0j
22.240000000000002	 0j
22.25	 0j
22.26	 0j
22.27	 0j
22.28	 0j
22.29	 0j
22.3	 0j
22.31	 0j
22.32	 0j
22.330000000000002	 0j
22.34	 0j
22.35	 0j
22.36	 0j
22.37	 0j
22.38	 0j
22.39	 0j
22.400000000000002	 0j
22.41	 0j
22.42	 0j
22.43	 0j
22.44	 0j
22.45	 0j
22.46	 0j
22.47	 0j
22.48	 0j
22.490000000000002	 0j
22.5	 0j
22.51	 0j
22.52	 0j
22.53	 0j
22.54	 0j
22.55	 0j
22.56	 0j
22.57	 0j
22.580000000000002	 0j
22.59	 0j
22.6	 0j
22.61	 0j
22.62	 0j
22.63	 0j
22.64	 0j
22.650000000000002	 0j
22.66	 0j
22.67	 0j
22.68	 0j
22.69	 0j
22.7	 0j
22.71	 0j
22.72	 0j
22.73	 0j
22.740000000000002	 0j
22.75	 0j
22.76	 0j
22.77	 0j
22.78	 0j
22.79	 0j
22.8	 0j
22.81	 0j
22.82	 0j
22.830000000000002	 0j
22.84	 0j
22.85	 0j
22.86	 0j
22.87	 0j
22.88	 0j
22.89	 0j
22.900000000000002	 0j
22.91	 0j
22.92	 0j
22.93	 0j
22.94	 0j
22.95	 0j
22.96	 0j
22.97	 0j
22.98	 0j
22.990000000000002	 0j
23.0	 0j
23.01	 0j
23.02	 0j
23.03	 0j
23.04	 0j
23.05	 0j
23.06	 0j
23.07	 0j
23.080000000000002	 0j
23.09	 0j
23.1	 0j
23.11	 0j
23.12	 0j
23.13	 0j
23.14	 0j
23.150000000000002	 0j
23.16	 0j
23.17	 0j
23.18	 0j
23.19	 0j
23.2	 0j
23.21	 0j
23.22	 0j
23.23	 0j
23.240000000000002	 0j
23.25	 0j
23.26	 0j
23.27	 0j
23.28	 0j
23.29	 0j
23.3	 0j
23.31	 0j
23.32	 0j
23.330000000000002	 0j
23.34	 0j
23.35	 0j
23.36	 0j
23.37	 0j
23.38	 0j
23.39	 0j
23.400000000000002	 0j
23.41	 0j
23.42	 0j
23.43	 0j
23.44	 0j
23.45	 0j
23.46	 0j
23.47	 0j
23.48	 0j
23.490000000000002	 0j
23.5	 0j
23.51	 0j
23.52	 0j
23.53	 0j
23.54	 0j
23.55	 0j
23.56	 0j
23.57	 0j
23.580000000000002	 0j
23.59	 0j
23.6	 0j
23.61	 0j
23.62	 0j
23.63	 0j
23.64	 0j
23.650000000000002	 0j
23.66	 0j
23.67	 0j
23.68	 0j
23.69	 0j
23.7	 0j
23.71	 0j
23.72	 0j
23.73	 0j
23.740000000000002	 0j
23.75	 0j
23.76	 0j
23.77	 0j
23.78	 0j
23.79	 0j
23.8	 0j
23.81	 0j
23.82	 0j
23.830000000000002	 0j
23.84	 0j
23.85	 0j
23.86	 0j
23.87	 0j
23.88	 0j
23.89	 0j
23.900000000000002	 0j
23.91	 0j
23.92	 0j
23.93	 0j
23.94	 0j
23.95	 0j
23.96	 0j
23.97	 0j
23.98	 0j
23.990000000000002	 0j
24.0	 0j
24.01	 0j
24.02	 0j
24.03	 0j
24.04	 0j
24.05	 0j
24.060000000000002	 0j
24.07	 0j
24.080000000000002	 0j
24.09	 0j
24.1	 0j
24.11	 0j
24.12	 0j
24.13	 0j
24.14	 0j
24.150000000000002	 0j
24.16	 0j
24.17	 0j
24.18	 0j
24.19	 0j
24.2	 0j
24.21	 0j
24.22	 0j
24.23	 0j
24.240000000000002	 0j
24.25	 0j
24.26	 0j
24.27	 0j
24.28	 0j
24.29	 0j
24.3	 0j
24.310000000000002	 0j
24.32	 0j
24.330000000000002	 0j
24.34	 0j
24.35	 0j
24.36	 0j
24.37	 0j
24.38	 0j
24.39	 0j
24.400000000000002	 0j
24.41	 0j
24.42	 0j
24.43	 0j
24.44	 0j
24.45	 0j
24.46	 0j
24.47	 0j
24.48	 0j
24.490000000000002	 0j
24.5	 0j
24.51	 0j
24.52	 0j
24.53	 0j
24.54	 0j
24.55	 0j
24.560000000000002	 0j
24.57	 0j
24.580000000000002	 0j
24.59	 0j
24.6	 0j
24.61	 0j
24.62	 0j
24.63	 0j
24.64	 0j
24.650000000000002	 0j
24.66	 0j
24.67	 0j
24.68	 0j
24.69	 0j
24.7	 0j
24.71	 0j
24.72	 0j
24.73	 0j
24.740000000000002	 0j
24.75	 0j
24.76	 0j
24.77	 0j
24.78	 0j
24.79	 0j
24.8	 0j
24.810000000000002	 0j
24.82	 0j
24.830000000000002	 0j
24.84	 0j
24.85	 0j
24.86	 0j
24.87	 0j
24.88	 0j
24.89	 0j
24.900000000000002	 0j
24.91	 0j
24.92	 0j
24.93	 0j
24.94	 0j
24.95	 0j
24.96	 0j
24.97	 0j
24.98	 0j
24.990000000000002	 0j
25.0	 0j
25.01	 0j
25.02	 0j
25.03	 0j
25.04	 0j
25.05	 0j
25.060000000000002	 0j
25.07	 0j
25.080000000000002	 0j
25.09	 0j
25.1	 0j
25.11	 0j
25.12	 0j
25.13	 0j
25.14	 0j
25.150000000000002	 0j
25.16	 0j
25.17	 0j
25.18	 0j
25.19	 0j
25.2	 0j
25.21	 0j
25.22	 0j
25.23	 0j
25.240000000000002	 0j
25.25	 0j
25.26	 0j
25.27	 0j
25.28	 0j
25.29	 0j
25.3	 0j
25.310000000000002	 0j
25.32	 0j
25.330000000000002	 0j
25.34	 0j
25.35	 0j
25.36	 0j
25.37	 0j
25.38	 0j
25.39	 0j
25.400000000000002	 0j
25.41	 0j
25.42	 0j
25.43	 0j
25.44	 0j
25.45	 0j
25.46	 0j
25.47	 0j
25.48	 0j
25.490000000000002	 0j
25.5	 0j
25.51	 0j
25.52	 0j
25.53	 0j
25.54	 0j
25.55	 0j
25.560000000000002	 0j
25.57	 0j
25.580000000000002	 0j
25.59	 0j
25.6	 0j
25.61	 0j
25.62	 0j
25.63	 0j
25.64	 0j
25.650000000000002	 0j
25.66	 0j
25.67	 0j
25.68	 0j
25.69	 0j
25.7	 0j
25.71	 0j
25.72	 0j
25.73	 0j
25.740000000000002	 0j
25.75	 0j
25.76	 0j
25.77	 0j
25.78	 0j
25.79	 0j
25.8	 0j
25.810000000000002	 0j
25.82	 0j
25.830000000000002	 0j
25.84	 0j
25.85	 0j
25.86	 0j
25.87	 0j
25.88	 0j
25.89	 0j
25.900000000000002	 0j
25.91	 0j
25.92	 0j
25.93	 0j
25.94	 0j
25.95	 0j
25.96	 0j
25.97	 0j
25.98	 0j
25.990000000000002	 0j
26.0	 0j
26.01	 0j
26.02	 0j
26.03	 0j
26.04	 0j
26.05	 0j
26.060000000000002	 0j
26.07	 0j
26.080000000000002	 0j
26.09	 0j
26.1	 0j
26.11	 0j
26.12	 0j
26.13	 0j
26.14	 0j
26.150000000000002	 0j
26.16	 0j
26.17	 0j
26.18	 0j
26.19	 0j
26.2	 0j
26.21	 0j
26.22	 0j
26.23	 0j
26.240000000000002	 0j
26.25	 0j
26.26	 0j
26.27	 0j
26.28	 0j
26.29	 0j
26.3	 0j
26.310000000000002	 0j
26.32	 0j
26.330000000000002	 0j
26.34	 0j
26.35	 0j
26.36	 0j
26.37	 0j
26.38	 0j
26.39	 0j
26.400000000000002	 0j
26.41	 0j
26.42	 0j
26.43	 0j
26.44	 0j
26.45	 0j
26.46	 0j
26.47	 0j
26.48	 0j
26.490000000000002	 0j
26.5	 0j
26.51	 0j
26.52	 0j
26.53	 0j
26.54	 0j
26.55	 0j
26.560000000000002	 0j
26.57	 0j
26.580000000000002	 0j
26.59	 0j
26.6	 0j
26.61	 0j
26.62	 0j
26.63	 0j
26.64	 0j
26.650000000000002	 0j
26.66	 0j
26.67	 0j
26.68	 0j
26.69	 0j
26.7	 0j
26.71	 0j
26.72	 0j
26.73	 0j
26.740000000000002	 0j
26.75	 0j
26.76	 0j
26.77	 0j
26.78	 0j
26.79	 0j
26.8	 0j
26.810000000000002	 0j
26.82	 0j
26.830000000000002	 0j
26.84	 0j
26.85	 0j
26.86	 0j
26.87	 0j
26.88	 0j
26.89	 0j
26.900000000000002	 0j
26.91	 0j
26.92	 0j
26.93	 0j
26.94	 0j
26.95	 0j
26.96	 0j
26.97	 0j
26.98	 0j
26.990000000000002	 0j
27.0	 0j
27.01	 0j
27.02	 0j
27.03	 0j
27.04	 0j
27.05	 0j
27.060000000000002	 0j
27.07	 0j
27.080000000000002	 0j
27.09	 0j
27.1	 0j
27.11	 0j
27.12	 0j
27.13	 0j
27.14	 0j
27.150000000000002	 0j
27.16	 0j
27.17	 0j
27.18	 0j
27.19	 0j
27.2	 0j
27.21	 0j
27.22	 0j
27.23	 0j
27.240000000000002	 0j
27.25	 0j
27.26	 0j
27.27	 0j
27.28	 0j
27.29	 0j
27.3	 0j
27.310000000000002	 0j
27.32	 0j
27.330000000000002	 0j
27.34	 0j
27.35	 0j
27.36	 0j
27.37	 0j
27.38	 0j
27.39	 0j
27.400000000000002	 0j
27.41	 0j
27.42	 0j
27.43	 0j
27.44	 0j
27.45	 0j
27.46	 0j
27.47	 0j
27.48	 0j
27.490000000000002	 0j
27.5	 0j
27.51	 0j
27.52	 0j
27.53	 0j
27.54	 0j
27.55	 0j
27.560000000000002	 0j
27.57	 0j
27.580000000000002	 0j
27.59	 0j
27.6	 0j
27.61	 0j
27.62	 0j
27.63	 0j
27.64	 0j
27.650000000000002	 0j
27.66	 0j
27.67	 0j
27.68	 0j
27.69	 0j
27.7	 0j
27.71	 0j
27.72	 0j
27.73	 0j
27.740000000000002	 0j
27.75	 0j
27.76	 0j
27.77	 0j
27.78	 0j
27.79	 0j
27.8	 0j
27.810000000000002	 0j
27.82	 0j
27.830000000000002	 0j
27.84	 0j
27.85	 0j
27.86	 0j
27.87	 0j
27.88	 0j
27.89	 0j
27.900000000000002	 0j
27.91	 0j
27.92	 0j
27.93	 0j
27.94	 0j
27.95	 0j
27.96	 0j
27.97	 0j
27.98	 0j
27.990000000000002	 0j
28.0	 0j
28.01	 0j
28.02	 0j
28.03	 0j
28.04	 0j
28.05	 0j
28.060000000000002	 0j
28.07	 0j
28.080000000000002	 0j
28.09	 0j
28.1	 0j
28.11	 0j
28.12	 0j
28.13	 0j
28.14	 0j
28.150000000000002	 0j
28.16	 0j
28.17	 0j
28.18	 0j
28.19	 0j
28.2	 0j
28.21	 0j
28.22	 0j
28.23	 0j
28.240000000000002	 0j
28.25	 0j
28.26	 0j
28.27	 0j
28.28	 0j
28.29	 0j
28.3	 0j
28.310000000000002	 0j
28.32	 0j
28.330000000000002	 0j
28.34	 0j
28.35	 0j
28.36	 0j
28.37	 0j
28.38	 0j
28.39	 0j
28.400000000000002	 0j
28.41	 0j
28.42	 0j
28.43	 0j
28.44	 0j
28.45	 0j
28.46	 0j
28.47	 0j
28.48	 0j
28.490000000000002	 0j
28.5	 0j
28.51	 0j
28.52	 0j
28.53	 0j
28.54	 0j
28.55	 0j
28.560000000000002	 0j
28.57	 0j
28.580000000000002	 0j
28.59	 0j
28.6	 0j
28.61	 0j
28.62	 0j
28.63	 0j
28.64	 0j
28.650000000000002	 0j
28.66	 0j
28.67	 0j
28.68	 0j
28.69	 0j
28.7	 0j
28.71	 0j
28.72	 0j
28.73	 0j
28.740000000000002	 0j
28.75	 0j
28.76	 0j
28.77	 0j
28.78	 0j
28.79	 0j
28.8	 0j
28.810000000000002	 0j
28.82	 0j
28.830000000000002	 0j
28.84	 0j
28.85	 0j
28.86	 0j
28.87	 0j
28.88	 0j
28.89	 0j
28.900000000000002	 0j
28.91	 0j
28.92	 0j
28.93	 0j
28.94	 0j
28.95	 0j
28.96	 0j
28.97	 0j
28.98	 0j
28.990000000000002	 0j
29.0	 0j
29.01	 0j
29.02	 0j
29.03	 0j
29.04	 0j
29.05	 0j
29.060000000000002	 0j
29.07	 0j
29.080000000000002	 0j
29.09	 0j
29.1	 0j
29.11	 0j
29.12	 0j
29.13	 0j
29.14	 0j
29.150000000000002	 0j
29.16	 0j
29.17	 0j
29.18	 0j
29.19	 0j
29.2	 0j
29.21	 0j
29.22	 0j
29.23	 0j
29.240000000000002	 0j
29.25	 0j
29.26	 0j
29.27	 0j
29.28	 0j
29.29	 0j
29.3	 0j
29.310000000000002	 0j
29.32	 0j
29.330000000000002	 0j
29.34	 0j
29.35	 0j
29.36	 0j
29.37	 0j
29.38	 0j
29.39	 0j
29.400000000000002	 0j
29.41	 0j
29.42	 0j
29.43	 0j
29.44	 0j
29.45	 0j
29.46	 0j
29.47	 0j
29.48	 0j
29.490000000000002	 0j
29.5	 0j
29.51	 0j
29.52	 0j
29.53	 0j
29.54	 0j
29.55	 0j
29.560000000000002	 0j
29.57	 0j
29.580000000000002	 0j
29.59	 0j
29.6	 0j
29.61	 0j
29.62	 0j
29.63	 0j
29.64	 0j
29.650000000000002	 0j
29.66	 0j
29.67	 0j
29.68	 0j
29.69	 0j
29.7	 0j
29.71	 0j
29.72	 0j
29.73	 0j
29.740000000000002	 0j
29.75	 0j
29.76	 0j
29.77	 0j
29.78	 0j
29.79	 0j
29.8	 0j
29.810000000000002	 0j
29.82	 0j
29.830000000000002	 0j
29.84	 0j
29.85	 0j
29.86	 0j
29.87	 0j
29.88	 0j
29.89	 0j
29.900000000000002	 0j
29.91	 0j
29.92	 0j
29.93	 0j
29.94	 0j
29.95	 0j
29.96	 0j
29.97	 0j
29.98	 0j
29.990000000000002	 0j
