-10.0	 -4.0	 0.00014224493097271876
-10.0	 -3.75	 7.421398346559027e-05
-10.0	 -3.5	 0.00013344819716752665
-10.0	 -3.25	 0.00018681607767142248
-10.0	 -3.0	 0.00016653076636675632
-10.0	 -2.75	 0.00014980111305601656
-10.0	 -2.5	 0.000276579377725311
-10.0	 -2.25	 0.00019005033360088887
-10.0	 -2.0	 8.296873916933348e-05
-10.0	 -1.75	 0.00012164407896923975
-10.0	 -1.5	 9.537221328453655e-05
-10.0	 -1.25	 6.618258023696495e-05
-10.0	 -1.0	 7.686695921693123e-05
-10.0	 -0.75	 5.42702654521038e-05
-10.0	 -0.5	 1.340637671683794e-05
-10.0	 -0.25	 1.649001817358945e-05
-10.0	 0.0	 1.6403724183752365e-05
-10.0	 0.25	 1.737628890716549e-05
-10.0	 0.5	 1.5089027511802546e-05
-10.0	 0.75	 6.653684597257136e-05
-10.0	 1.0	 0.00010227594003174231
-10.0	 1.25	 8.827997465816941e-05
-10.0	 1.5	 0.00014256327952325877
-10.0	 1.75	 0.00017518833420638452
-10.0	 2.0	 0.00010437058572072312
-10.0	 2.25	 0.0004185674406107171
-10.0	 2.5	 0.0002860378508626844
-10.0	 2.75	 0.00022474323019422947
-10.0	 3.0	 0.0003271772880677048
-10.0	 3.25	 0.00021588991999652897
-10.0	 3.5	 0.00019281332015011476
-10.0	 3.75	 6.406664978103951e-05
-10.0	 4.0	 2.1730431591052146e-05
-9.75	 -4.0	 0.001732672820629345
-9.75	 -3.75	 6.828601603824265e-05
-9.75	 -3.5	 8.063111178464172e-05
-9.75	 -3.25	 0.0001037294597028976
-9.75	 -3.0	 9.958328953869888e-05
-9.75	 -2.75	 0.00013002659542025747
-9.75	 -2.5	 0.00018707109618504043
-9.75	 -2.25	 0.00011393242377831514
-9.75	 -2.0	 7.15654379273888e-05
-9.75	 -1.75	 9.160374197007305e-05
-9.75	 -1.5	 7.16048543153618e-05
-9.75	 -1.25	 5.283910865376811e-05
-9.75	 -1.0	 6.297357751994205e-05
-9.75	 -0.75	 4.450714662595405e-05
-9.75	 -0.5	 1.125718502816963e-05
-9.75	 -0.25	 1.4922067589465387e-05
-9.75	 0.0	 1.3781054647909498e-05
-9.75	 0.25	 1.567297652595081e-05
-9.75	 0.5	 1.2564992799629898e-05
-9.75	 0.75	 5.454136024970156e-05
-9.75	 1.0	 8.04477803397134e-05
-9.75	 1.25	 6.948883456349506e-05
-9.75	 1.5	 0.00010795491892467545
-9.75	 1.75	 0.00013612225970435158
-9.75	 2.0	 7.395122210650078e-05
-9.75	 2.25	 0.0002592600898413495
-9.75	 2.5	 0.00022253771552056042
-9.75	 2.75	 0.00013466477946224697
-9.75	 3.0	 0.00021756878673716978
-9.75	 3.25	 0.00012045729050707069
-9.75	 3.5	 8.979932861704135e-05
-9.75	 3.75	 2.8102295451162135e-05
-9.75	 4.0	 1.3455108997200912e-05
-9.5	 -4.0	 -6.538678601104506e-05
-9.5	 -3.75	 0.00012132311330290135
-9.5	 -3.5	 5.300901530920846e-05
-9.5	 -3.25	 6.115614981982813e-05
-9.5	 -3.0	 6.902101607546285e-05
-9.5	 -2.75	 0.00010148717634111178
-9.5	 -2.5	 0.00011494879691019855
-9.5	 -2.25	 6.584516117314962e-05
-9.5	 -2.0	 6.370339833165414e-05
-9.5	 -1.75	 6.555205030353561e-05
-9.5	 -1.5	 5.178479903357805e-05
-9.5	 -1.25	 4.175500872331643e-05
-9.5	 -1.0	 5.1044947356948187e-05
-9.5	 -0.75	 3.589796126574887e-05
-9.5	 -0.5	 9.620519167541104e-06
-9.5	 -0.25	 1.3352109122215065e-05
-9.5	 0.0	 1.1013716492315386e-05
-9.5	 0.25	 1.3925678978393176e-05
-9.5	 0.5	 1.0756472544719287e-05
-9.5	 0.75	 4.403155353845112e-05
-9.5	 1.0	 6.691325132862375e-05
-9.5	 1.25	 5.518848254101351e-05
-9.5	 1.5	 7.845614048731988e-05
-9.5	 1.75	 0.0001003672714879663
-9.5	 2.0	 5.383254956478102e-05
-9.5	 2.25	 0.00014664942486028194
-9.5	 2.5	 0.00016169554971278907
-9.5	 2.75	 7.997844524343378e-05
-9.5	 3.0	 0.00012543777685962258
-9.5	 3.25	 6.927949256852264e-05
-9.5	 3.5	 3.8556832446622405e-05
-9.5	 3.75	 1.581786719161496e-05
-9.5	 4.0	 7.598113704061077e-06
-9.25	 -4.0	 -2.7103374055165858e-05
-9.25	 -3.75	 -0.0008819359229063455
-9.25	 -3.5	 5.5866424558096914e-05
-9.25	 -3.25	 4.239004665957703e-05
-9.25	 -3.0	 5.400375036974242e-05
-9.25	 -2.75	 6.64098308771257e-05
-9.25	 -2.5	 6.64037097876987e-05
-9.25	 -2.25	 4.524494468301048e-05
-9.25	 -2.0	 5.4717722333458806e-05
-9.25	 -1.75	 4.4314329005481004e-05
-9.25	 -1.5	 3.5971498315372566e-05
-9.25	 -1.25	 3.3000520897517004e-05
-9.25	 -1.0	 4.3117191658711106e-05
-9.25	 -0.75	 2.8742606776331874e-05
-9.25	 -0.5	 8.456528483785381e-06
-9.25	 -0.25	 1.1792624147200122e-05
-9.25	 0.0	 8.367155652523866e-06
-9.25	 0.25	 1.2122088797903753e-05
-9.25	 0.5	 9.319666748546385e-06
-9.25	 0.75	 3.5069868695310116e-05
-9.25	 1.0	 5.330610213699974e-05
-9.25	 1.25	 4.2583223888224483e-05
-9.25	 1.5	 5.43637506558994e-05
-9.25	 1.75	 7.000950598122935e-05
-9.25	 2.0	 4.1264875758034725e-05
-9.25	 2.25	 7.568460806933915e-05
-9.25	 2.5	 0.00010559747757514504
-9.25	 2.75	 4.8942291433255736e-05
-9.25	 3.0	 6.133484502770202e-05
-9.25	 3.25	 3.832155426403833e-05
-9.25	 3.5	 1.853465714005305e-05
-9.25	 3.75	 9.74562212904817e-06
-9.25	 4.0	 4.685345950347294e-06
-9.0	 -4.0	 -2.9068516069319372e-05
-9.0	 -3.75	 -2.5881237987803243e-05
-9.0	 -3.5	 9.857432009651064e-05
-9.0	 -3.25	 3.696639003267742e-05
-9.0	 -3.0	 4.0164798908899624e-05
-9.0	 -2.75	 3.792679889032084e-05
-9.0	 -2.5	 3.736415233093846e-05
-9.0	 -2.25	 3.468766446866438e-05
-9.0	 -2.0	 4.1545266760568966e-05
-9.0	 -1.75	 2.7645475407372076e-05
-9.0	 -1.5	 2.4198556413388035e-05
-9.0	 -1.25	 2.612619326329644e-05
-9.0	 -1.0	 3.505720737091277e-05
-9.0	 -0.75	 2.2805889408713653e-05
-9.0	 -0.5	 7.417689651966625e-06
-9.0	 -0.25	 1.0173473428444924e-05
-9.0	 0.0	 6.280495061608028e-06
-9.0	 0.25	 1.0323963730812617e-05
-9.0	 0.5	 8.14607575666624e-06
-9.0	 0.75	 2.7686366093084523e-05
-9.0	 1.0	 4.182297163058367e-05
-9.0	 1.25	 3.286846889345111e-05
-9.0	 1.5	 3.592537273258353e-05
-9.0	 1.75	 4.5114386206650606e-05
-9.0	 2.0	 3.257263106014492e-05
-9.0	 2.25	 3.7242271293155306e-05
-9.0	 2.5	 6.143080575248157e-05
-9.0	 2.75	 3.298140123997491e-05
-9.0	 3.0	 2.9582142979323045e-05
-9.0	 3.25	 2.0486051829870372e-05
-9.0	 3.5	 1.1652234614419055e-05
-9.0	 3.75	 5.85905494351717e-06
-9.0	 4.0	 1.9784782650331817e-06
-8.75	 -4.0	 -0.00022511174337071053
-8.75	 -3.75	 -1.2182411871626553e-05
-8.75	 -3.5	 -0.00014522661173753566
-8.75	 -3.25	 4.375793430437362e-05
-8.75	 -3.0	 2.955404929793834e-05
-8.75	 -2.75	 2.307362902105245e-05
-8.75	 -2.5	 2.2955005362030115e-05
-8.75	 -2.25	 3.121583602192293e-05
-8.75	 -2.0	 2.5878568820677204e-05
-8.75	 -1.75	 1.575081548101532e-05
-8.75	 -1.5	 1.6130079641701704e-05
-8.75	 -1.25	 2.110314065114586e-05
-8.75	 -1.0	 2.8921303485968455e-05
-8.75	 -0.75	 1.8131066168820646e-05
-8.75	 -0.5	 6.619226107733474e-06
-8.75	 -0.25	 8.54545591992507e-06
-8.75	 0.0	 4.859168775774459e-06
-8.75	 0.25	 8.58325084298131e-06
-8.75	 0.5	 7.19148937305741e-06
-8.75	 0.75	 2.1770719298965825e-05
-8.75	 1.0	 3.3289072976322616e-05
-8.75	 1.25	 2.5208003294069532e-05
-8.75	 1.5	 2.2864889545510213e-05
-8.75	 1.75	 2.602776351276915e-05
-8.75	 2.0	 2.522404744323501e-05
-8.75	 2.25	 1.9980920076338206e-05
-8.75	 2.5	 3.170153385206702e-05
-8.75	 2.75	 2.3085206578305623e-05
-8.75	 3.0	 1.7274114571485394e-05
-8.75	 3.25	 1.2385677946570584e-05
-8.75	 3.5	 7.099880430790767e-06
-8.75	 3.75	 3.2575085803839693e-06
-8.75	 4.0	 2.4697598092999345e-05
-8.5	 -4.0	 -0.0003326962497976621
-8.5	 -3.75	 -1.456482881011939e-05
-8.5	 -3.5	 -8.404949109986834e-06
-8.5	 -3.25	 8.688747259830501e-05
-8.5	 -3.0	 2.696449724381468e-05
-8.5	 -2.75	 1.865198845329291e-05
-8.5	 -2.5	 1.7672356359589234e-05
-8.5	 -2.25	 2.4665123548701755e-05
-8.5	 -2.0	 1.4356686893384277e-05
-8.5	 -1.75	 8.369869459532407e-06
-8.5	 -1.5	 1.1239817847561069e-05
-8.5	 -1.25	 1.7154949688932657e-05
-8.5	 -1.0	 2.3624276469182484e-05
-8.5	 -0.75	 1.4551489242126646e-05
-8.5	 -0.5	 5.955288460975788e-06
-8.5	 -0.25	 7.0595999341594405e-06
-8.5	 0.0	 3.9568565705517394e-06
-8.5	 0.25	 6.848245325700129e-06
-8.5	 0.5	 6.4105881335480355e-06
-8.5	 0.75	 1.7170810974394355e-05
-8.5	 1.0	 2.6494328038264257e-05
-8.5	 1.25	 1.960228228525384e-05
-8.5	 1.5	 1.4277244887913806e-05
-8.5	 1.75	 1.3085715469583238e-05
-8.5	 2.0	 1.7703548525762128e-05
-8.5	 2.25	 1.3652050358285532e-05
-8.5	 2.5	 1.6297669380943222e-05
-8.5	 2.75	 1.5907034167412723e-05
-8.5	 3.0	 1.2536519803178423e-05
-8.5	 3.25	 8.657398184822376e-06
-8.5	 3.5	 4.110225534568329e-06
-8.5	 3.75	 1.171779598557049e-06
-8.5	 4.0	 0.0009786823259306555
-8.25	 -4.0	 -5.579991936742815e-05
-8.25	 -3.75	 -0.00014153090757711324
-8.25	 -3.5	 -5.321324988087628e-06
-8.25	 -3.25	 -3.606241751472408e-05
-8.25	 -3.0	 3.657716211054492e-05
-8.25	 -2.75	 1.8936443527319685e-05
-8.25	 -2.5	 1.5436205281360235e-05
-8.25	 -2.25	 1.7360899942896364e-05
-8.25	 -2.0	 8.552221870388593e-06
-8.25	 -1.75	 4.851637045102594e-06
-8.25	 -1.5	 8.719600756415015e-06
-8.25	 -1.25	 1.4725627946035602e-05
-8.25	 -1.0	 1.932881074299085e-05
-8.25	 -0.75	 1.2007689614690516e-05
-8.25	 -0.5	 5.417556421917404e-06
-8.25	 -0.25	 5.634418211642421e-06
-8.25	 0.0	 3.4359299484823524e-06
-8.25	 0.25	 5.4474828710131436e-06
-8.25	 0.5	 5.7686403913221815e-06
-8.25	 0.75	 1.3753984541657431e-05
-8.25	 1.0	 2.1246514590083157e-05
-8.25	 1.25	 1.6009189024776722e-05
-8.25	 1.5	 9.445139008744906e-06
-8.25	 1.75	 5.805323966602896e-06
-8.25	 2.0	 1.1110100709296744e-05
-8.25	 2.25	 1.1387151367041153e-05
-8.25	 2.5	 1.0617391504329915e-05
-8.25	 2.75	 1.1960190571924656e-05
-8.25	 3.0	 9.711542323671135e-06
-8.25	 3.25	 5.103645420475103e-06
-8.25	 3.5	 1.7313824385318394e-06
-8.25	 3.75	 1.5191192617506483e-05
-8.25	 4.0	 -0.0007872450967601127
-8.0	 -4.0	 -0.00029681333025488067
-8.0	 -3.75	 -0.00032382635300245294
-8.0	 -3.5	 -6.134148215314675e-06
-8.0	 -3.25	 -1.8339987961791399e-06
-8.0	 -3.0	 8.531704548338064e-05
-8.0	 -2.75	 2.256653319726229e-05
-8.0	 -2.5	 1.4485959111769017e-05
-8.0	 -2.25	 1.2640060280917804e-05
-8.0	 -2.0	 7.580973704931007e-06
-8.0	 -1.75	 4.183889372781635e-06
-8.0	 -1.5	 7.575159284658496e-06
-8.0	 -1.25	 1.2422046244255601e-05
-8.0	 -1.0	 1.5851472488333934e-05
-8.0	 -0.75	 1.0108360862906389e-05
-8.0	 -0.5	 5.008426643708132e-06
-8.0	 -0.25	 4.6237463591863e-06
-8.0	 0.0	 3.0637636074738912e-06
-8.0	 0.25	 4.40183825926475e-06
-8.0	 0.5	 5.242326244767233e-06
-8.0	 0.75	 1.1324400046473435e-05
-8.0	 1.0	 1.7393995188854164e-05
-8.0	 1.25	 1.293912243167071e-05
-8.0	 1.5	 7.237970396982603e-06
-8.0	 1.75	 3.059557708148461e-06
-8.0	 2.0	 7.613720708683769e-06
-8.0	 2.25	 1.0027674636337372e-05
-8.0	 2.5	 9.42833876078214e-06
-8.0	 2.75	 9.922469027963052e-06
-8.0	 3.0	 6.447794849741284e-06
-8.0	 3.25	 2.281397330107862e-06
-8.0	 3.5	 5.848292622349233e-07
-8.0	 3.75	 0.0008673149482168012
-8.0	 4.0	 -0.00016441661979334915
-7.75	 -4.0	 0.001014154313895876
-7.75	 -3.75	 -4.75802817331665e-05
-7.75	 -3.5	 -8.645228266740933e-05
-7.75	 -3.25	 -2.206327436218153e-06
-7.75	 -3.0	 -8.58160686538316e-06
-7.75	 -2.75	 3.1562661279203874e-05
-7.75	 -2.5	 1.6107590960792034e-05
-7.75	 -2.25	 1.178964591604624e-05
-7.75	 -2.0	 8.591546841417268e-06
-7.75	 -1.75	 5.118188754548586e-06
-7.75	 -1.5	 7.1499460834794845e-06
-7.75	 -1.25	 1.101245485195159e-05
-7.75	 -1.0	 1.4138726708364836e-05
-7.75	 -0.75	 9.051196698606559e-06
-7.75	 -0.5	 4.6948628734458375e-06
-7.75	 -0.25	 3.827829828083936e-06
-7.75	 0.0	 2.794059743680896e-06
-7.75	 0.25	 3.6151553660492344e-06
-7.75	 0.5	 4.815507580698854e-06
-7.75	 0.75	 9.648727853920486e-06
-7.75	 1.0	 1.4441344160882538e-05
-7.75	 1.25	 1.0929590923415902e-05
-7.75	 1.5	 6.444875916966977e-06
-7.75	 1.75	 3.2508565763209388e-06
-7.75	 2.0	 7.172562987553012e-06
-7.75	 2.25	 9.096202286368316e-06
-7.75	 2.5	 8.956692165093538e-06
-7.75	 2.75	 7.145650186644176e-06
-7.75	 3.0	 3.2119914353950785e-06
-7.75	 3.25	 7.145282112357848e-07
-7.75	 3.5	 9.096265505794537e-06
-7.75	 3.75	 -0.0007246236407052013
-7.75	 4.0	 0.005964551020406295
-7.5	 -4.0	 -0.00016520997797763066
-7.5	 -3.75	 -0.00024234809480958713
-7.5	 -3.5	 -0.0003083531455625073
-7.5	 -3.25	 -2.387344823620574e-06
-7.5	 -3.0	 1.8242479137182965e-07
-7.5	 -2.75	 -0.0004302792783740586
-7.5	 -2.5	 2.0420350296913165e-05
-7.5	 -2.25	 1.2792671481071452e-05
-7.5	 -2.0	 9.917746268601514e-06
-7.5	 -1.75	 6.517375751873347e-06
-7.5	 -1.5	 7.008557070212196e-06
-7.5	 -1.25	 9.83707983951386e-06
-7.5	 -1.0	 1.2573098179586954e-05
-7.5	 -0.75	 8.35020474215624e-06
-7.5	 -0.5	 4.469721500091443e-06
-7.5	 -0.25	 3.2927521562793258e-06
-7.5	 0.0	 2.5985003326020953e-06
-7.5	 0.25	 3.1165949313620434e-06
-7.5	 0.5	 4.467462324592858e-06
-7.5	 0.75	 8.499690526737706e-06
-7.5	 1.0	 1.2089938391915238e-05
-7.5	 1.25	 9.40217619320536e-06
-7.5	 1.5	 6.262043082185323e-06
-7.5	 1.75	 4.7054604679621845e-06
-7.5	 2.0	 7.90553844689807e-06
-7.5	 2.25	 8.620844081852139e-06
-7.5	 2.5	 7.615646444454269e-06
-7.5	 2.75	 4.044396538366302e-06
-7.5	 3.0	 6.939970939486007e-07
-7.5	 3.25	 1.3355832269301704e-07
-7.5	 3.5	 0.0006931557267458466
-7.5	 3.75	 -0.00012363977454304953
-7.5	 4.0	 0.00041600978906394456
-7.25	 -4.0	 -1.0779896424811808e-07
-7.25	 -3.75	 0.0008632603041239528
-7.25	 -3.5	 -3.923997828506748e-05
-7.25	 -3.25	 -5.2392040761952904e-05
-7.25	 -3.0	 -7.818559944472447e-07
-7.25	 -2.75	 -1.005606621546501e-06
-7.25	 -2.5	 2.602216549630644e-05
-7.25	 -2.25	 1.4890708290455842e-05
-7.25	 -2.0	 1.121173646028567e-05
-7.25	 -1.75	 7.761698294801549e-06
-7.25	 -1.5	 7.098517511898439e-06
-7.25	 -1.25	 9.183424848346021e-06
-7.25	 -1.0	 1.1454453793184605e-05
-7.25	 -0.75	 7.96231622048841e-06
-7.25	 -0.5	 4.316020108344545e-06
-7.25	 -0.25	 2.963845956825348e-06
-7.25	 0.0	 2.4392963383829992e-06
-7.25	 0.25	 2.7687165280896806e-06
-7.25	 0.5	 4.1702115275753585e-06
-7.25	 0.75	 7.662558658817417e-06
-7.25	 1.0	 1.0532348527520809e-05
-7.25	 1.25	 8.25379513574951e-06
-7.25	 1.5	 6.251108320041825e-06
-7.25	 1.75	 6.095009576969658e-06
-7.25	 2.0	 8.30713783670639e-06
-7.25	 2.25	 7.948119861317729e-06
-7.25	 2.5	 5.140346012589073e-06
-7.25	 2.75	 1.3832642916499632e-06
-7.25	 3.0	 2.353520979284096e-07
-7.25	 3.25	 5.744609063872488e-06
-7.25	 3.5	 -0.0006417027906408211
-7.25	 3.75	 0.004644746640355756
-7.25	 4.0	 0.00011091006288388265
-7.0	 -4.0	 5.231883761971229e-07
-7.0	 -3.75	 -0.00013847569656122959
-7.0	 -3.5	 -0.00018553221967583522
-7.0	 -3.25	 -0.00028089906788680667
-7.0	 -3.0	 -1.0245002788414337e-06
-7.0	 -2.75	 5.573297335963179e-07
-7.0	 -2.5	 -6.66021366697335e-06
-7.0	 -2.25	 1.8440587176775727e-05
-7.0	 -2.0	 1.3029707686150471e-05
-7.0	 -1.75	 9.163431460657533e-06
-7.0	 -1.5	 7.573984844255061e-06
-7.0	 -1.25	 8.961935635639316e-06
-7.0	 -1.0	 1.0714213773216352e-05
-7.0	 -0.75	 7.744682622649011e-06
-7.0	 -0.5	 4.201758625127679e-06
-7.0	 -0.25	 2.7356333182990827e-06
-7.0	 0.0	 2.2929846858156175e-06
-7.0	 0.25	 2.520878102778637e-06
-7.0	 0.5	 3.890153809169711e-06
-7.0	 0.75	 6.982365512203832e-06
-7.0	 1.0	 9.194571606150129e-06
-7.0	 1.25	 7.423813376080356e-06
-7.0	 1.5	 6.236213358982133e-06
-7.0	 1.75	 6.7560940329933206e-06
-7.0	 2.0	 7.889874537793384e-06
-7.0	 2.25	 6.146280811355348e-06
-7.0	 2.5	 2.272211627012133e-06
-7.0	 2.75	 -8.444865597610762e-08
-7.0	 3.0	 -2.279758366009743e-07
-7.0	 3.25	 0.000473439555466075
-7.0	 3.5	 -8.670057804795704e-05
-7.0	 3.75	 -0.0008943867051027735
-7.0	 4.0	 -1.9643762695167183e-05
-6.75	 -4.0	 2.544489364746799e-07
-6.75	 -3.75	 -1.7395008261936185e-07
-6.75	 -3.5	 0.0006994730959852535
-6.75	 -3.25	 -3.122494961320041e-05
-6.75	 -3.0	 -3.084021089070667e-05
-6.75	 -2.75	 -1.8236742570579278e-07
-6.75	 -2.5	 7.043320578541123e-07
-6.75	 -2.25	 3.3499122551922805e-05
-6.75	 -2.0	 1.5619854786328227e-05
-6.75	 -1.75	 1.1115793735777535e-05
-6.75	 -1.5	 8.737995864356238e-06
-6.75	 -1.25	 9.150662982790499e-06
-6.75	 -1.0	 1.0201804879604419e-05
-6.75	 -0.75	 7.561812226785508e-06
-6.75	 -0.5	 4.093101322141801e-06
-6.75	 -0.25	 2.552243802633747e-06
-6.75	 0.0	 2.1447616246669104e-06
-6.75	 0.25	 2.310578857165485e-06
-6.75	 0.5	 3.590170975381786e-06
-6.75	 0.75	 6.3201705829537755e-06
-6.75	 1.0	 8.035636301216564e-06
-6.75	 1.25	 6.820797118090548e-06
-6.75	 1.5	 6.124384788918323e-06
-6.75	 1.75	 6.5842954019030425e-06
-6.75	 2.0	 6.373890462433446e-06
-6.75	 2.25	 3.004936423797039e-06
-6.75	 2.5	 1.5805135603411125e-07
-6.75	 2.75	 4.145975955778536e-08
-6.75	 3.0	 3.7044791961204915e-06
-6.75	 3.25	 -0.0005460860148486825
-6.75	 3.5	 0.0034019842535471367
-6.75	 3.75	 4.845740269072453e-05
-6.75	 4.0	 -1.31191129340881e-05
-6.5	 -4.0	 1.0294120212500646e-08
-6.5	 -3.75	 5.752838618394707e-07
-6.5	 -3.5	 -0.00010701037890677167
-6.5	 -3.25	 -0.00012719736507980396
-6.5	 -3.0	 -0.000235286368003634
-6.5	 -2.75	 -4.681272886518373e-07
-6.5	 -2.5	 4.6961475360686455e-07
-6.5	 -2.25	 1.2786900357233955e-06
-6.5	 -2.0	 1.7571836823337267e-05
-6.5	 -1.75	 1.30447402222119e-05
-6.5	 -1.5	 1.0340435993121122e-05
-6.5	 -1.25	 9.695795169773445e-06
-6.5	 -1.0	 9.853647000856308e-06
-6.5	 -0.75	 7.34535277963598e-06
-6.5	 -0.5	 3.950394481902833e-06
-6.5	 -0.25	 2.384366232343303e-06
-6.5	 0.0	 1.9826013205482412e-06
-6.5	 0.25	 2.0915914249308026e-06
-6.5	 0.5	 3.2307563655109214e-06
-6.5	 0.75	 5.58960288115154e-06
-6.5	 1.0	 6.960619808774049e-06
-6.5	 1.25	 6.300659139339346e-06
-6.5	 1.5	 5.927315950757066e-06
-6.5	 1.75	 5.572660606866647e-06
-6.5	 2.0	 3.5601994960825223e-06
-6.5	 2.25	 5.691598206295639e-07
-6.5	 2.5	 -1.5286250906569598e-07
-6.5	 2.75	 -3.1010749317224306e-07
-6.5	 3.0	 0.00020161518828835066
-6.5	 3.25	 -5.653121653997027e-05
-6.5	 3.5	 -0.0017243805161057564
-6.5	 3.75	 -1.1411110391957094e-05
-6.5	 4.0	 2.9279879328238806e-06
-6.25	 -4.0	 7.016989905794802e-10
-6.25	 -3.75	 8.928638704774894e-08
-6.25	 -3.5	 -2.5334901739525184e-07
-6.25	 -3.25	 0.0005246615102433121
-6.25	 -3.0	 -2.4697609557998434e-05
-6.25	 -2.75	 -1.5418807488109046e-05
-6.25	 -2.5	 -8.794855822780168e-09
-6.25	 -2.25	 8.223133639156943e-07
-6.25	 -2.0	 1.0055104951670751e-06
-6.25	 -1.75	 1.1431602947600816e-05
-6.25	 -1.5	 1.222740856231773e-05
-6.25	 -1.25	 1.0610036581753558e-05
-6.25	 -1.0	 9.632641971280692e-06
-6.25	 -0.75	 7.001717005619343e-06
-6.25	 -0.5	 3.736948235478696e-06
-6.25	 -0.25	 2.194019437240513e-06
-6.25	 0.0	 1.791966617014848e-06
-6.25	 0.25	 1.839731161153331e-06
-6.25	 0.5	 2.781483522939013e-06
-6.25	 0.75	 4.744950672285787e-06
-6.25	 1.0	 5.880194897160684e-06
-6.25	 1.25	 5.6917322401048645e-06
-6.25	 1.5	 5.33719402796666e-06
-6.25	 1.75	 3.5425555207600767e-06
-6.25	 2.0	 1.0077143078497663e-06
-6.25	 2.25	 -2.431563210954224e-07
-6.25	 2.5	 -1.1324643316851235e-07
-6.25	 2.75	 2.24498576808195e-06
-6.25	 3.0	 -0.00045624644806366646
-6.25	 3.25	 0.002429210718867942
-6.25	 3.5	 1.4226966570139027e-05
-6.25	 3.75	 -3.798185955992961e-06
-6.25	 4.0	 2.794756957654951e-06
-6.0	 -4.0	 1.478313877562032e-10
-6.0	 -3.75	 3.246858051517143e-09
-6.0	 -3.5	 5.719899274850282e-07
-6.0	 -3.25	 -7.297290482677875e-05
-6.0	 -3.0	 -6.808626048424027e-05
-6.0	 -2.75	 -0.00017373908446971682
-6.0	 -2.5	 -2.0145417936080767e-07
-6.0	 -2.25	 2.902052966442803e-07
-6.0	 -2.0	 1.6047350661092113e-06
-6.0	 -1.75	 -9.036314657961605e-06
-6.0	 -1.5	 1.4877632679973461e-05
-6.0	 -1.25	 1.1974121438117907e-05
-6.0	 -1.0	 9.501061004306942e-06
-6.0	 -0.75	 6.528906538656211e-06
-6.0	 -0.5	 3.424788747910003e-06
-6.0	 -0.25	 1.980366326696792e-06
-6.0	 0.0	 1.5581973786217215e-06
-6.0	 0.25	 1.5340316240732357e-06
-6.0	 0.5	 2.2268445873073472e-06
-6.0	 0.75	 3.7577206589709325e-06
-6.0	 1.0	 4.7288210686616955e-06
-6.0	 1.25	 4.830000773736048e-06
-6.0	 1.5	 4.001439947134283e-06
-6.0	 1.75	 1.3840148791119389e-06
-6.0	 2.0	 -1.2410140223795274e-07
-6.0	 2.25	 -6.024195011236633e-08
-6.0	 2.5	 -2.172219616923543e-07
-6.0	 2.75	 -9.38731997579198e-05
-6.0	 3.0	 -3.458497583972743e-05
-6.0	 3.25	 -0.0018156152944838102
-6.0	 3.5	 -4.842984365628633e-06
-6.0	 3.75	 7.2787863848889495e-06
-6.0	 4.0	 3.48080329721015e-07
-5.75	 -4.0	 5.50118110786979e-11
-5.75	 -3.75	 2.882073087129289e-10
-5.75	 -3.5	 3.5145817936510504e-08
-5.75	 -3.25	 -3.191633016954437e-07
-5.75	 -3.0	 0.00033233117882356007
-5.75	 -2.75	 -1.978164214652689e-05
-5.75	 -2.5	 -5.430121551032105e-06
-5.75	 -2.25	 2.1126695403522744e-08
-5.75	 -2.0	 5.232607174759235e-07
-5.75	 -1.75	 2.440923988824076e-06
-5.75	 -1.5	 4.1438442873093645e-05
-5.75	 -1.25	 1.3799135718520726e-05
-5.75	 -1.0	 9.644774210075882e-06
-5.75	 -0.75	 6.036756967347373e-06
-5.75	 -0.5	 3.0034092226832038e-06
-5.75	 -0.25	 1.6919914764962352e-06
-5.75	 0.0	 1.2736625794275078e-06
-5.75	 0.25	 1.1720678680582006e-06
-5.75	 0.5	 1.5872625758082612e-06
-5.75	 0.75	 2.665160608423048e-06
-5.75	 1.0	 3.4417747240764185e-06
-5.75	 1.25	 3.4705763268918013e-06
-5.75	 1.5	 2.019912549508854e-06
-5.75	 1.75	 1.1087765429754204e-08
-5.75	 2.0	 -2.0044482840382571e-07
-5.75	 2.25	 -1.5565852068064046e-07
-5.75	 2.5	 1.2975485317312518e-06
-5.75	 2.75	 -0.0003760336819020847
-5.75	 3.0	 0.0016670172462319947
-5.75	 3.25	 2.4354894083301187e-06
-5.75	 3.5	 5.098753467575046e-06
-5.75	 3.75	 1.0557864585786225e-06
-5.75	 4.0	 5.0915235340343035e-08
-5.5	 -4.0	 2.8594432377460066e-11
-5.5	 -3.75	 9.63780878021625e-11
-5.5	 -3.5	 1.0361502714856252e-09
-5.5	 -3.25	 4.389666962961031e-07
-5.5	 -3.0	 -3.91135980937346e-05
-5.5	 -2.75	 -1.4206715282072402e-05
-5.5	 -2.5	 -0.00012138268621173127
-5.5	 -2.25	 -9.652810570304204e-08
-5.5	 -2.0	 1.2349936109185e-07
-5.5	 -1.75	 8.38214104355306e-07
-5.5	 -1.5	 1.970422544014111e-06
-5.5	 -1.25	 -6.284572226835511e-05
-5.5	 -1.0	 1.260885236062121e-05
-5.5	 -0.75	 5.941804265616538e-06
-5.5	 -0.5	 2.475561334656755e-06
-5.5	 -0.25	 1.3251318590843525e-06
-5.5	 0.0	 9.526220573225636e-07
-5.5	 0.25	 7.715495419988172e-07
-5.5	 0.5	 9.25583285492533e-07
-5.5	 0.75	 1.6171009195962288e-06
-5.5	 1.0	 2.1455162678056874e-06
-5.5	 1.25	 1.711293517140007e-06
-5.5	 1.5	 3.917020943919325e-07
-5.5	 1.75	 -2.2615268605030714e-07
-5.5	 2.0	 -1.7802652633319704e-09
-5.5	 2.25	 -8.679202338247871e-08
-5.5	 2.5	 -0.00025799946566138973
-5.5	 2.75	 -2.0934381471930663e-05
-5.5	 3.0	 -0.001322430087581131
-5.5	 3.25	 4.346338260685645e-07
-5.5	 3.5	 3.9519014586545526e-06
-5.5	 3.75	 9.322670249667375e-08
-5.5	 4.0	 1.5842609696337107e-08
-5.25	 -4.0	 1.581408094752934e-11
-5.25	 -3.75	 4.563717979910731e-11
-5.25	 -3.5	 1.7746122280004606e-10
-5.25	 -3.25	 9.562241746682854e-09
-5.25	 -3.0	 -3.5904354887816847e-07
-5.25	 -2.75	 0.00011335081028033232
-5.25	 -2.5	 -1.593246195375625e-05
-5.25	 -2.25	 -1.2819060886092026e-06
-5.25	 -2.0	 1.4732402416062218e-08
-5.25	 -1.75	 1.6673274300105234e-07
-5.25	 -1.5	 1.1167027838491356e-06
-5.25	 -1.25	 9.709578045209027e-07
-5.25	 -1.0	 -8.656145242074559e-06
-5.25	 -0.75	 1.112590865805143e-05
-5.25	 -0.5	 1.8611172774400664e-06
-5.25	 -0.25	 8.953054652814305e-07
-5.25	 0.0	 6.104353610413352e-07
-5.25	 0.25	 3.8659228269836976e-07
-5.25	 0.5	 3.577917961168284e-07
-5.25	 0.75	 7.849575431196493e-07
-5.25	 1.0	 1.0438104996145225e-06
-5.25	 1.25	 4.6332202389368776e-07
-5.25	 1.5	 -1.557106471660602e-07
-5.25	 1.75	 -5.477974089618254e-08
-5.25	 2.0	 -4.457033352285589e-08
-5.25	 2.25	 6.696638100833069e-07
-5.25	 2.5	 -0.0003098760416658762
-5.25	 2.75	 0.0010154449821138962
-5.25	 3.0	 -2.6385100456056965e-06
-5.25	 3.25	 9.965784881929216e-06
-5.25	 3.5	 2.576549901142644e-07
-5.25	 3.75	 1.7595320749019816e-08
-5.25	 4.0	 8.605982475262675e-09
-5.0	 -4.0	 8.691210945377392e-12
-5.0	 -3.75	 2.491081473043888e-11
-5.0	 -3.5	 7.448373515184237e-11
-5.0	 -3.25	 3.655415085207503e-10
-5.0	 -3.0	 2.2937914066073484e-07
-5.0	 -2.75	 -8.815737490099063e-06
-5.0	 -2.5	 2.7899530993451965e-05
-5.0	 -2.25	 -7.932342167005918e-05
-5.0	 -2.0	 -5.2111523174760976e-08
-5.0	 -1.75	 2.4691095910911454e-08
-5.0	 -1.5	 2.5124486651741107e-07
-5.0	 -1.25	 1.0325980335894325e-06
-5.0	 -1.0	 3.136937194170297e-07
-5.0	 -0.75	 -6.741780170047701e-07
-5.0	 -0.5	 4.886536668735446e-06
-5.0	 -0.25	 4.367824178235988e-07
-5.0	 0.0	 3.03509868859915e-07
-5.0	 0.25	 9.272836509928439e-08
-5.0	 0.5	 -3.2742556761375385e-08
-5.0	 0.75	 2.571634552103394e-07
-5.0	 1.0	 3.541696516522544e-07
-5.0	 1.25	 -1.1281801697710092e-08
-5.0	 1.5	 -9.714465723856258e-08
-5.0	 1.75	 -3.688324124416498e-08
-5.0	 2.0	 3.3671794918282982e-09
-5.0	 2.25	 -0.0002917813649112172
-5.0	 2.5	 -1.5931081776528536e-05
-5.0	 2.75	 -0.000690058910315523
-5.0	 3.0	 4.506742629131408e-06
-5.0	 3.25	 1.086282542120745e-06
-5.0	 3.5	 2.3994465322627057e-08
-5.0	 3.75	 8.472404043960435e-09
-5.0	 4.0	 4.1935861623543236e-09
-4.75	 -4.0	 4.881740844897564e-12
-4.75	 -3.75	 1.367038426902667e-11
-4.75	 -3.5	 3.827676717249595e-11
-4.75	 -3.25	 1.2557190530448903e-10
-4.75	 -3.0	 2.0140696384979284e-09
-4.75	 -2.75	 -3.5007020831104296e-07
-4.75	 -2.5	 -0.00013233542342972263
-4.75	 -2.25	 -1.3349396656193308e-05
-4.75	 -2.0	 -2.5783872685709863e-07
-4.75	 -1.75	 7.94441990144279e-09
-4.75	 -1.5	 2.4240175909920336e-08
-4.75	 -1.25	 3.124612936514226e-07
-4.75	 -1.0	 6.976960979614144e-07
-4.75	 -0.75	 5.818542887685643e-07
-4.75	 -0.5	 8.433583441186387e-07
-4.75	 -0.25	 -4.043849643874803e-07
-4.75	 0.0	 1.0237040422994559e-07
-4.75	 0.25	 -5.4699161173600575e-08
-4.75	 0.5	 -1.8676856796372154e-07
-4.75	 0.75	 3.827956005127142e-09
-4.75	 1.0	 2.2948104284881143e-08
-4.75	 1.25	 -8.590163900167036e-08
-4.75	 1.5	 -1.0999156812782629e-08
-4.75	 1.75	 -4.077956750059286e-09
-4.75	 2.0	 2.1994316859452745e-07
-4.75	 2.25	 -0.0002514344803016648
-4.75	 2.5	 0.0004621713873920897
-4.75	 2.75	 -2.6046325626444267e-06
-4.75	 3.0	 6.310404339727321e-06
-4.75	 3.25	 4.875451509005202e-08
-4.75	 3.5	 9.454300349542866e-09
-4.75	 3.75	 4.289591156239614e-09
-4.75	 4.0	 1.6682683463831172e-09
-4.5	 -4.0	 2.7257328338858855e-12
-4.5	 -3.75	 7.378984576145164e-12
-4.5	 -3.5	 1.939825904073711e-11
-4.5	 -3.25	 6.227020461768706e-11
-4.5	 -3.0	 2.106817203334499e-10
-4.5	 -2.75	 9.095884489010442e-08
-4.5	 -2.5	 1.1616631845033643e-05
-4.5	 -2.25	 5.7696464015667345e-05
-4.5	 -2.0	 -4.7720961942686324e-05
-4.5	 -1.75	 -2.479971169741524e-08
-4.5	 -1.5	 -3.1637001594864156e-09
-4.5	 -1.25	 3.9014608061577194e-08
-4.5	 -1.0	 3.0756597779475064e-07
-4.5	 -0.75	 4.3324339368561865e-07
-4.5	 -0.5	 3.2567130300604347e-07
-4.5	 -0.25	 1.004728943871172e-07
-4.5	 0.0	 6.75271427403451e-08
-4.5	 0.25	 -6.113953377340914e-08
-4.5	 0.5	 -1.550528008946797e-07
-4.5	 0.75	 -7.036948441573737e-08
-4.5	 1.0	 -5.9214585367874106e-08
-4.5	 1.25	 -2.0000780257684037e-08
-4.5	 1.5	 -3.914593619744333e-09
-4.5	 1.75	 2.1468598763313418e-08
-4.5	 2.0	 -0.00025808852116594727
-4.5	 2.25	 -1.9254714570754797e-05
-4.5	 2.5	 -0.00019246255512146183
-4.5	 2.75	 7.407912772101899e-06
-4.5	 3.0	 1.6524785333149605e-07
-4.5	 3.25	 1.2201746784831768e-08
-4.5	 3.5	 5.4750076486365096e-09
-4.5	 3.75	 1.641149972864131e-09
-4.5	 4.0	 1.2077736900872882e-09
-4.25	 -4.0	 1.4585468249839195e-12
-4.25	 -3.75	 3.836157086434255e-12
-4.25	 -3.5	 9.2854439415202e-12
-4.25	 -3.25	 2.999572118467242e-11
-4.25	 -3.0	 1.0886094976847449e-10
-4.25	 -2.75	 4.2234415444097895e-10
-4.25	 -2.5	 -2.397935930757711e-07
-4.25	 -2.25	 -0.00041190602215096517
-4.25	 -2.0	 -1.2205011875054267e-05
-4.25	 -1.75	 -3.4033446758702235e-08
-4.25	 -1.5	 3.983236847998617e-10
-4.25	 -1.25	 -9.256504937549259e-10
-4.25	 -1.0	 4.793027332666844e-08
-4.25	 -0.75	 1.6129479297327665e-07
-4.25	 -0.5	 3.600511823322744e-08
-4.25	 -0.25	 -1.7113489441701601e-07
-4.25	 0.0	 9.168541786801557e-07
-4.25	 0.25	 2.098254414401729e-08
-4.25	 0.5	 -6.396025094886765e-08
-4.25	 0.75	 -5.73763732792526e-08
-4.25	 1.0	 -3.565260581206431e-08
-4.25	 1.25	 -5.6976663873054e-09
-4.25	 1.5	 3.7192612219183463e-09
-4.25	 1.75	 6.149251700893199e-08
-4.25	 2.0	 -0.00019773511242143424
-4.25	 2.25	 3.0223119171762097e-05
-4.25	 2.5	 2.311849603654423e-06
-4.25	 2.75	 1.3319961807943537e-06
-4.25	 3.0	 1.7597891165122004e-08
-4.25	 3.25	 7.2820462385797535e-09
-4.25	 3.5	 2.703527901548597e-09
-4.25	 3.75	 4.4189790368576176e-10
-4.25	 4.0	 9.435812634711604e-10
-4.0	 -4.0	 7.860656570102265e-13
-4.0	 -3.75	 2.0645221643356138e-12
-4.0	 -3.5	 4.615571813637587e-12
-4.0	 -3.25	 1.1692121229534003e-11
-4.0	 -3.0	 5.016532675372609e-11
-4.0	 -2.75	 1.6439948014035366e-10
-4.0	 -2.5	 3.3478533667530286e-08
-4.0	 -2.25	 1.1650084186111409e-05
-4.0	 -2.0	 7.123327050745712e-05
-4.0	 -1.75	 -2.679166016770866e-05
-4.0	 -1.5	 -9.530904626284253e-09
-4.0	 -1.25	 -2.830129547382043e-09
-4.0	 -1.0	 8.247338575961827e-11
-4.0	 -0.75	 1.599900781995567e-08
-4.0	 -0.5	 -4.685044239973596e-08
-4.0	 -0.25	 -2.3281808602011733e-07
-4.0	 0.0	 -7.660058283171303e-07
-4.0	 0.25	 1.1991498912768128e-07
-4.0	 0.5	 2.1029600829822193e-09
-4.0	 0.75	 -2.8776230535584868e-08
-4.0	 1.0	 -7.476150152077587e-09
-4.0	 1.25	 1.9039696659561844e-09
-4.0	 1.5	 1.0337843300151084e-08
-4.0	 1.75	 -0.00016199323851144067
-4.0	 2.0	 -2.9182626563813846e-05
-4.0	 2.25	 6.740873430626307e-06
-4.0	 2.5	 8.328554536462043e-06
-4.0	 2.75	 2.8125776794368784e-08
-4.0	 3.0	 9.936473959609726e-09
-4.0	 3.25	 3.901352463309138e-09
-4.0	 3.5	 1.0860604117424177e-09
-4.0	 3.75	 5.374309278854961e-10
-4.0	 4.0	 5.947311376014452e-10
-3.75	 -4.0	 3.8525259371535725e-13
-3.75	 -3.75	 1.1369533786664832e-12
-3.75	 -3.5	 2.4732924042147886e-12
-3.75	 -3.25	 2.6938035135870564e-12
-3.75	 -3.0	 1.469813853960389e-11
-3.75	 -2.75	 8.957879923943146e-11
-3.75	 -2.5	 3.2121871135215585e-11
-3.75	 -2.25	 1.1332351854305422e-07
-3.75	 -2.0	 -0.0007246494643256187
-3.75	 -1.75	 -1.1702392541931839e-05
-3.75	 -1.5	 -1.587372732217429e-08
-3.75	 -1.25	 -2.3547968783232953e-09
-3.75	 -1.0	 -1.043909327036463e-09
-3.75	 -0.75	 -3.7895012735406075e-09
-3.75	 -0.5	 -2.6880747428306706e-08
-3.75	 -0.25	 -1.24555601076215e-07
-3.75	 0.0	 -3.45099726644163e-07
-3.75	 0.25	 1.6911525961560425e-07
-3.75	 0.5	 3.411218141985417e-08
-3.75	 0.75	 3.124945392729561e-09
-3.75	 1.0	 1.9844165217303145e-09
-3.75	 1.25	 2.4137877894375714e-09
-3.75	 1.5	 1.2474289375757897e-08
-3.75	 1.75	 -0.00015071722289383693
-3.75	 2.0	 -0.0003233334515186613
-3.75	 2.25	 -4.332844542313807e-06
-3.75	 2.5	 1.5374141677446107e-07
-3.75	 2.75	 1.3677539368456282e-08
-3.75	 3.0	 5.236741606323703e-09
-3.75	 3.25	 1.9107583779098825e-09
-3.75	 3.5	 1.7026561063837597e-10
-3.75	 3.75	 6.581653520798536e-10
-3.75	 4.0	 2.799941858228072e-10
-3.5	 -4.0	 1.702422924854119e-13
-3.5	 -3.75	 6.061973839566193e-13
-3.5	 -3.5	 1.3699250067666924e-12
-3.5	 -3.25	 1.1539137700911084e-12
-3.5	 -3.0	 2.8047026506827777e-12
-3.5	 -2.75	 1.7840093985421746e-11
-3.5	 -2.5	 1.3389947484121478e-10
-3.5	 -2.25	 1.0919701570050178e-08
-3.5	 -2.0	 -2.7590294269620036e-05
-3.5	 -1.75	 5.355067022839305e-05
-3.5	 -1.5	 -4.9973464132033185e-06
-3.5	 -1.25	 -2.8519393079767807e-09
-3.5	 -1.0	 -9.179968972483632e-10
-3.5	 -0.75	 -7.639004914739012e-10
-3.5	 -0.5	 -7.583028848942575e-09
-3.5	 -0.25	 -3.267234508549238e-08
-3.5	 0.0	 -1.0799717368049216e-07
-3.5	 0.25	 1.3278474380283567e-07
-3.5	 0.5	 1.896040997817483e-08
-3.5	 0.75	 4.264577782922552e-09
-3.5	 1.0	 1.0904465629069104e-09
-3.5	 1.25	 1.3810174705197742e-09
-3.5	 1.5	 -3.8401532304267044e-05
-3.5	 1.75	 -3.5074530116099845e-05
-3.5	 2.0	 -0.0001951865390960681
-3.5	 2.25	 4.26621093755665e-06
-3.5	 2.5	 1.3668029721913832e-08
-3.5	 2.75	 6.808273961961264e-09
-3.5	 3.0	 2.2687432158635668e-09
-3.5	 3.25	 7.272687816556322e-10
-3.5	 3.5	 2.534437590351324e-10
-3.5	 3.75	 4.606153548858405e-10
-3.5	 4.0	 2.7073740818672754e-11
-3.25	 -4.0	 5.19306819768417e-14
-3.25	 -3.75	 3.1635805086693836e-13
-3.25	 -3.5	 7.519696670899023e-13
-3.25	 -3.25	 7.538362295500534e-13
-3.25	 -3.0	 9.486508800726767e-14
-3.25	 -2.75	 1.661127832508491e-12
-3.25	 -2.5	 3.733964873409157e-11
-3.25	 -2.25	 -8.711934645910802e-11
-3.25	 -2.0	 9.704210171546102e-07
-3.25	 -1.75	 -0.0008530356078006347
-3.25	 -1.5	 -1.1386033723047306e-05
-3.25	 -1.25	 1.1649445644246192e-10
-3.25	 -1.0	 -2.4879447460546267e-10
-3.25	 -0.75	 6.524596262574844e-10
-3.25	 -0.5	 5.306014395217717e-10
-3.25	 -0.25	 -1.3696382040670474e-09
-3.25	 0.0	 -6.693202827916245e-09
-3.25	 0.25	 1.9246162016525736e-08
-3.25	 0.5	 4.79730808376766e-09
-3.25	 0.75	 5.539074164617741e-10
-3.25	 1.0	 -2.4100093969081637e-10
-3.25	 1.25	 -2.5400830883093306e-09
-3.25	 1.5	 -9.413911898365629e-05
-3.25	 1.75	 -0.0005220038838539293
-3.25	 2.0	 3.9349702112372736e-05
-3.25	 2.25	 7.457644640718186e-09
-3.25	 2.5	 9.636825771403013e-09
-3.25	 2.75	 2.3654693880742483e-09
-3.25	 3.0	 7.701917853486506e-10
-3.25	 3.25	 1.2239728154617158e-10
-3.25	 3.5	 3.8135740745848246e-10
-3.25	 3.75	 2.255497767722492e-10
-3.25	 4.0	 -1.4609972953660844e-10
-3.0	 -4.0	 -1.9893808822502024e-14
-3.0	 -3.75	 1.470403659942221e-13
-3.0	 -3.5	 4.413761023336349e-13
-3.0	 -3.25	 4.633758654559728e-13
-3.0	 -3.0	 -4.476280457410553e-14
-3.0	 -2.75	 -1.4166792738912193e-13
-3.0	 -2.5	 7.495688097991504e-13
-3.0	 -2.25	 9.824549333792287e-11
-3.0	 -2.0	 1.0310591621806586e-08
-3.0	 -1.75	 -0.00013362481329297522
-3.0	 -1.5	 7.825391805053178e-06
-3.0	 -1.25	 1.1316276071659387e-05
-3.0	 -1.0	 -4.6011581350535735e-10
-3.0	 -0.75	 -1.0961771941542242e-10
-3.0	 -0.5	 1.3634908445359084e-09
-3.0	 -0.25	 2.595048048843751e-09
-3.0	 0.0	 4.955590177796454e-09
-3.0	 0.25	 -3.801659944312197e-09
-3.0	 0.5	 -8.106319279027607e-10
-3.0	 0.75	 -3.1392166643939845e-11
-3.0	 1.0	 -6.36584458757472e-10
-3.0	 1.25	 2.3657634748680545e-05
-3.0	 1.5	 -3.5552518810828826e-05
-3.0	 1.75	 -0.000815039570013238
-3.0	 2.0	 1.3111241936366452e-06
-3.0	 2.25	 9.943586801175464e-09
-3.0	 2.5	 2.87213350498583e-09
-3.0	 2.75	 6.25068824824937e-10
-3.0	 3.0	 1.894670947910626e-10
-3.0	 3.25	 8.181491942260699e-11
-3.0	 3.5	 2.5618405834204605e-10
-3.0	 3.75	 4.9250660841271277e-11
-3.0	 4.0	 -2.4388083566528884e-10
-2.75	 -4.0	 -5.628136845459153e-14
-2.75	 -3.75	 4.4820050448812765e-14
-2.75	 -3.5	 2.429653700453116e-13
-2.75	 -3.25	 3.1803032429778e-13
-2.75	 -3.0	 3.2241570524504937e-14
-2.75	 -2.75	 -1.8656777511782963e-13
-2.75	 -2.5	 -6.22370210923151e-13
-2.75	 -2.25	 5.2697499142162485e-12
-2.75	 -2.0	 -1.3883314810281266e-10
-2.75	 -1.75	 1.8448887105764616e-06
-2.75	 -1.5	 -0.0008447433357749376
-2.75	 -1.25	 -1.0679816815031828e-05
-2.75	 -1.0	 1.4704376240931571e-09
-2.75	 -0.75	 -9.034839543176076e-11
-2.75	 -0.5	 3.9793608339055986e-10
-2.75	 -0.25	 1.4027189357973535e-09
-2.75	 0.0	 3.352298690376121e-09
-2.75	 0.25	 -5.054709206753216e-09
-2.75	 0.5	 -3.4901096422623734e-10
-2.75	 0.75	 -6.791102576120256e-11
-2.75	 1.0	 2.2232589623472077e-09
-2.75	 1.25	 -3.255762105083826e-05
-2.75	 1.5	 -0.00030534680459427463
-2.75	 1.75	 8.392460127222903e-05
-2.75	 2.0	 -5.961405265264563e-09
-2.75	 2.25	 3.9722031688199655e-09
-2.75	 2.5	 5.588672129241967e-10
-2.75	 2.75	 8.191289313508321e-11
-2.75	 3.0	 3.969288613070443e-11
-2.75	 3.25	 9.270041158304654e-11
-2.75	 3.5	 1.4188934922831908e-10
-2.75	 3.75	 -6.626415909039007e-11
-2.75	 4.0	 -2.8141626529087915e-10
-2.5	 -4.0	 -6.898301374569371e-14
-2.5	 -3.75	 -9.478529072737274e-15
-2.5	 -3.5	 1.1401296573509967e-13
-2.5	 -3.25	 2.0598280026096205e-13
-2.5	 -3.0	 4.414871246360974e-14
-2.5	 -2.75	 -1.4015004434764222e-13
-2.5	 -2.5	 -3.080296434587737e-13
-2.5	 -2.25	 -8.903398851511923e-13
-2.5	 -2.0	 3.959346045467882e-11
-2.5	 -1.75	 1.9494937598257822e-08
-2.5	 -1.5	 -0.00020428717258895793
-2.5	 -1.25	 -4.807135734231915e-07
-2.5	 -1.0	 8.358927766174626e-06
-2.5	 -0.75	 -1.9279125171300926e-11
-2.5	 -0.5	 1.6046532158586757e-11
-2.5	 -0.25	 2.4573321849574725e-10
-2.5	 0.0	 1.109165507703902e-09
-2.5	 0.25	 -1.0485445792879355e-09
-2.5	 0.5	 -4.55733176890627e-11
-2.5	 0.75	 -1.3055114801707735e-10
-2.5	 1.0	 3.550761682119541e-05
-2.5	 1.25	 -3.3472533677258304e-05
-2.5	 1.5	 -0.0016087172861513066
-2.5	 1.75	 7.609011729112908e-07
-2.5	 2.0	 6.232380790269221e-09
-2.5	 2.25	 3.844337972958023e-10
-2.5	 2.5	 2.4968110912126917e-11
-2.5	 2.75	 1.7463617357771355e-12
-2.5	 3.0	 7.346553920761778e-13
-2.5	 3.25	 6.124921576866615e-11
-2.5	 3.5	 5.2129732822092656e-11
-2.5	 3.75	 -1.2739538243766724e-10
-2.5	 4.0	 -2.699066161543362e-10
-2.25	 -4.0	 -7.155213921361536e-14
-2.25	 -3.75	 -3.539703252730675e-14
-2.25	 -3.5	 4.057865155004947e-14
-2.25	 -3.25	 1.2919006142642075e-13
-2.25	 -3.0	 3.7154307408471254e-14
-2.25	 -2.75	 -5.561349991634046e-14
-2.25	 -2.5	 -1.486033518460772e-13
-2.25	 -2.25	 -4.4882847438643125e-13
-2.25	 -2.0	 -9.051370764012745e-13
-2.25	 -1.75	 -1.6100272677566085e-10
-2.25	 -1.5	 3.868635689274411e-06
-2.25	 -1.25	 -0.0005836719688570927
-2.25	 -1.0	 -3.722645104942829e-06
-2.25	 -0.75	 8.345975334445033e-10
-2.25	 -0.5	 -1.274335845180552e-11
-2.25	 -0.25	 -5.924169141358071e-12
-2.25	 0.0	 1.3682536180448235e-10
-2.25	 0.25	 1.643772444548386e-11
-2.25	 0.5	 -4.932505792698549e-12
-2.25	 0.75	 2.841032516881503e-09
-2.25	 1.0	 -2.4398793401422814e-06
-2.25	 1.25	 -0.00021699876851889732
-2.25	 1.5	 9.960309373325919e-05
-2.25	 1.75	 -7.9731526884258e-09
-2.25	 2.0	 5.237032734556335e-10
-2.25	 2.25	 -3.77371571491647e-11
-2.25	 2.5	 -9.538581730028639e-12
-2.25	 2.75	 -5.6688525401638046e-12
-2.25	 3.0	 1.0060695332381187e-11
-2.25	 3.25	 4.2725063070792046e-11
-2.25	 3.5	 -1.5822078022753594e-11
-2.25	 3.75	 -1.3309232882452449e-10
-2.25	 4.0	 -2.1711908833321747e-10
-2.0	 -4.0	 -6.684930387024224e-14
-2.0	 -3.75	 -4.6200890335690303e-14
-2.0	 -3.5	 -1.3530843112619095e-16
-2.0	 -3.25	 7.414728553367667e-14
-2.0	 -3.0	 2.3533258675101365e-14
-2.0	 -2.75	 -2.1833229668644094e-14
-2.0	 -2.5	 -6.817810205284047e-14
-2.0	 -2.25	 -1.6338146113792362e-13
-2.0	 -2.0	 -5.523949353491986e-13
-2.0	 -1.75	 6.995943754861678e-12
-2.0	 -1.5	 2.411750493064302e-08
-2.0	 -1.25	 -1.343449346385972e-05
-2.0	 -1.0	 -6.972576906301431e-07
-2.0	 -0.75	 1.1274738230052095e-06
-2.0	 -0.5	 1.262927262768443e-12
-2.0	 -0.25	 4.227868055650674e-14
-2.0	 0.0	 2.4764947037514418e-11
-2.0	 0.25	 -8.053247305128686e-12
-2.0	 0.5	 -1.8749763894265747e-11
-2.0	 0.75	 1.4343628467481176e-05
-2.0	 1.0	 -9.231058677637571e-06
-2.0	 1.25	 -0.0009450288328418967
-2.0	 1.5	 1.3564417740419277e-07
-2.0	 1.75	 2.542046345990756e-09
-2.0	 2.0	 -9.563303100812437e-11
-2.0	 2.25	 -2.3128728099397478e-11
-2.0	 2.5	 -7.982900798730874e-12
-2.0	 2.75	 -6.633405630340761e-12
-2.0	 3.0	 1.3339333110318208e-11
-2.0	 3.25	 2.7157153262291622e-11
-2.0	 3.5	 -4.507660564256888e-11
-2.0	 3.75	 -1.1084835653540903e-10
-2.0	 4.0	 -1.7092648824101886e-10
-1.75	 -4.0	 -5.830058658062853e-14
-1.75	 -3.75	 -4.755050520000026e-14
-1.75	 -3.5	 -2.0258100752457153e-14
-1.75	 -3.25	 3.164309092529294e-14
-1.75	 -3.0	 2.154179612467999e-14
-1.75	 -2.75	 -8.734332701543224e-15
-1.75	 -2.5	 -3.4409974869475946e-14
-1.75	 -2.25	 -6.078818004517927e-14
-1.75	 -2.0	 -1.6328952079369685e-13
-1.75	 -1.75	 -7.327385226352234e-13
-1.75	 -1.5	 -7.077714282710534e-11
-1.75	 -1.25	 7.531967849420257e-06
-1.75	 -1.0	 -0.00022679439137041416
-1.75	 -0.75	 -2.7067912205733236e-07
-1.75	 -0.5	 -3.493859992986792e-10
-1.75	 -0.25	 -6.421495279962386e-13
-1.75	 0.0	 3.4214818478428555e-12
-1.75	 0.25	 -3.423917399603127e-12
-1.75	 0.5	 1.3298136342099198e-09
-1.75	 0.75	 4.719480520970487e-08
-1.75	 1.0	 -4.0785902832133486e-05
-1.75	 1.25	 0.0005433042844333342
-1.75	 1.5	 -6.453325823371769e-09
-1.75	 1.75	 -9.377030402157871e-11
-1.75	 2.0	 -4.2091866450655324e-11
-1.75	 2.25	 -1.023624067453266e-11
-1.75	 2.5	 -2.4482482013921114e-12
-1.75	 2.75	 3.340145868224731e-12
-1.75	 3.0	 1.4624764940740498e-11
-1.75	 3.25	 7.384995392989424e-12
-1.75	 3.5	 -4.172073797548137e-11
-1.75	 3.75	 -7.23796387408493e-11
-1.75	 4.0	 -1.224221921752866e-10
-1.5	 -4.0	 -4.8308579359002124e-14
-1.5	 -3.75	 -4.296910049994551e-14
-1.5	 -3.5	 -2.718658631550852e-14
-1.5	 -3.25	 4.397524011601206e-15
-1.5	 -3.0	 2.266589693711296e-14
-1.5	 -2.75	 -3.802513859341161e-15
-1.5	 -2.5	 -1.5199647096508784e-14
-1.5	 -2.25	 -2.4015511801422917e-14
-1.5	 -2.0	 -3.9364345116865707e-14
-1.5	 -1.75	 -1.9818868768339826e-13
-1.5	 -1.5	 1.260831716809463e-13
-1.5	 -1.25	 -5.7340407023237505e-09
-1.5	 -1.0	 5.525712010699679e-07
-1.5	 -0.75	 -1.9822734004179554e-06
-1.5	 -0.5	 -6.42652535534638e-07
-1.5	 -0.25	 2.0490727170585643e-12
-1.5	 0.0	 3.216350796808598e-14
-1.5	 0.25	 -3.770086673404727e-12
-1.5	 0.5	 8.956456573269711e-08
-1.5	 0.75	 -2.7442899620117034e-07
-1.5	 1.0	 -2.96917583691228e-05
-1.5	 1.25	 -1.929756548654793e-07
-1.5	 1.5	 5.335934610828375e-10
-1.5	 1.75	 -4.857459746931969e-11
-1.5	 2.0	 -1.5237823156044605e-11
-1.5	 2.25	 -3.255911165678249e-12
-1.5	 2.5	 5.253714130404319e-13
-1.5	 2.75	 5.12141024033852e-12
-1.5	 3.0	 1.3468396536930882e-11
-1.5	 3.25	 -1.0522438823046265e-11
-1.5	 3.5	 -2.61289948011445e-11
-1.5	 3.75	 -4.939103813439427e-11
-1.5	 4.0	 -9.48803292877276e-11
-1.25	 -4.0	 -3.744574095243536e-14
-1.25	 -3.75	 -3.458171249359765e-14
-1.25	 -3.5	 -2.6175242529014042e-14
-1.25	 -3.25	 -8.290243491693161e-15
-1.25	 -3.0	 1.7159884624362576e-14
-1.25	 -2.75	 -1.996666720849305e-15
-1.25	 -2.5	 -6.456640777585676e-15
-1.25	 -2.25	 -7.990136330349173e-15
-1.25	 -2.0	 -1.5664552988070568e-14
-1.25	 -1.75	 -2.8706204080464204e-14
-1.25	 -1.5	 -3.23265719748278e-13
-1.25	 -1.25	 -1.4206653214943188e-11
-1.25	 -1.0	 1.2700215682285437e-05
-1.25	 -0.75	 1.8805615066997544e-05
-1.25	 -0.5	 -1.577322593024344e-08
-1.25	 -0.25	 -2.1504619959755722e-10
-1.25	 0.0	 6.049264214547101e-11
-1.25	 0.25	 3.431792860303373e-09
-1.25	 0.5	 9.520278260177761e-09
-1.25	 0.75	 1.674386222449975e-05
-1.25	 1.0	 0.0008844914035490217
-1.25	 1.25	 -8.743848978198798e-10
-1.25	 1.5	 -4.755726541738614e-11
-1.25	 1.75	 -1.4005017631713024e-11
-1.25	 2.0	 -4.574837036974699e-12
-1.25	 2.25	 -5.967830396524931e-13
-1.25	 2.5	 1.9756869751308415e-12
-1.25	 2.75	 5.430206631573675e-12
-1.25	 3.0	 8.029389653163577e-12
-1.25	 3.25	 -1.3483627409049959e-11
-1.25	 3.5	 -1.7096019044871014e-11
-1.25	 3.75	 -3.140214130392671e-11
-1.25	 4.0	 -6.390424474311818e-11
-1.0	 -4.0	 -2.6223814786341393e-14
-1.0	 -3.75	 -2.5167368189471517e-14
-1.0	 -3.5	 -2.1616389234146993e-14
-1.0	 -3.25	 -1.1280906764277177e-14
-1.0	 -3.0	 5.6968318951078345e-15
-1.0	 -2.75	 1.9290125052862095e-15
-1.0	 -2.5	 -2.8831104170734534e-15
-1.0	 -2.25	 -4.989064716909297e-15
-1.0	 -2.0	 -5.819997261902188e-15
-1.0	 -1.75	 -1.9845236565174673e-15
-1.0	 -1.5	 -4.195428726649908e-14
-1.0	 -1.25	 -8.855867428270159e-13
-1.0	 -1.0	 1.3301892365369383e-09
-1.0	 -0.75	 1.2862091152560096e-07
-1.0	 -0.5	 -9.514917930289468e-08
-1.0	 -0.25	 -9.22177796278123e-09
-1.0	 0.0	 -6.157706811463215e-09
-1.0	 0.25	 -1.2000899683728417e-09
-1.0	 0.5	 1.2199706303159252e-07
-1.0	 0.75	 -4.141996560687311e-06
-1.0	 1.0	 5.987459279800655e-07
-1.0	 1.25	 -5.610068312678074e-11
-1.0	 1.5	 -1.159615459211949e-11
-1.0	 1.75	 -2.3070382410006474e-12
-1.0	 2.0	 -1.391947321294218e-12
-1.0	 2.25	 6.35984320762617e-13
-1.0	 2.5	 1.9694107455947574e-12
-1.0	 2.75	 4.638352202324114e-12
-1.0	 3.0	 -5.690135862490564e-13
-1.0	 3.25	 -9.049457364018743e-12
-1.0	 3.5	 -1.1025652613128045e-11
-1.0	 3.75	 -2.233856676026047e-11
-1.0	 4.0	 -4.7194045546539165e-11
-0.75	 -4.0	 -1.7617851622020453e-14
-0.75	 -3.75	 -1.784683512084939e-14
-0.75	 -3.5	 -1.6524975832155064e-14
-0.75	 -3.25	 -1.0130785099704553e-14
-0.75	 -3.0	 -1.7763568394002505e-15
-0.75	 -2.75	 4.9769216525774596e-15
-0.75	 -2.5	 -1.5699247457590104e-15
-0.75	 -2.25	 -2.4077961846558082e-15
-0.75	 -2.0	 -1.7069679003611782e-15
-0.75	 -1.75	 -1.7555401576885288e-15
-0.75	 -1.5	 -3.2508717939805365e-15
-0.75	 -1.25	 -8.56485021794029e-14
-0.75	 -1.0	 1.8428557291283454e-12
-0.75	 -0.75	 -8.714371682906619e-07
-0.75	 -0.5	 -1.5344924416543781e-07
-0.75	 -0.25	 -2.7325744098027904e-10
-0.75	 0.0	 -2.486858611400189e-09
-0.75	 0.25	 -7.750130398553878e-12
-0.75	 0.5	 8.224785630200904e-07
-0.75	 0.75	 -2.803289337147477e-05
-0.75	 1.0	 2.0440420363254663e-10
-0.75	 1.25	 -1.3991342806551899e-11
-0.75	 1.5	 -7.494855430723035e-13
-0.75	 1.75	 -7.69197205929828e-13
-0.75	 2.0	 -1.8002092871949316e-13
-0.75	 2.25	 6.779906497333954e-13
-0.75	 2.5	 1.3642524610002482e-12
-0.75	 2.75	 3.4682395844143343e-12
-0.75	 3.0	 -4.0707853754540224e-12
-0.75	 3.25	 -5.909210620824723e-12
-0.75	 3.5	 -8.896321179729938e-12
-0.75	 3.75	 -1.992826563490535e-11
-0.75	 4.0	 -4.159080545240723e-11
-0.5	 -4.0	 -1.1128251098391218e-14
-0.5	 -3.75	 -1.1459583282302788e-14
-0.5	 -3.5	 -1.0890593982182395e-14
-0.5	 -3.25	 -7.462780393652224e-15
-0.5	 -3.0	 -3.3653635433950058e-15
-0.5	 -2.75	 3.49893725104522e-15
-0.5	 -2.5	 -6.418476861114186e-16
-0.5	 -2.25	 -1.0651202142497596e-15
-0.5	 -2.0	 -3.191891195797325e-16
-0.5	 -1.75	 -6.071532165918825e-16
-0.5	 -1.5	 -3.625572064791527e-16
-0.5	 -1.25	 -4.5276282722994665e-15
-0.5	 -1.0	 -1.1963693924421648e-13
-0.5	 -0.75	 1.577651899745125e-09
-0.5	 -0.5	 6.777599633814302e-07
-0.5	 -0.25	 9.102336939736944e-13
-0.5	 0.0	 -2.2067833671535197e-12
-0.5	 0.25	 2.512924521247406e-10
-0.5	 0.5	 -6.273326160061848e-06
-0.5	 0.75	 -5.5296718919073395e-08
-0.5	 1.0	 -1.7730764773071783e-11
-0.5	 1.25	 -1.2670940685577392e-12
-0.5	 1.5	 -1.4032178197176393e-13
-0.5	 1.75	 -2.2644906783053642e-13
-0.5	 2.0	 1.570410468332284e-13
-0.5	 2.25	 4.703008815720722e-13
-0.5	 2.5	 9.864296879324996e-13
-0.5	 2.75	 1.39972061719007e-12
-0.5	 3.0	 -3.0736593825686498e-12
-0.5	 3.25	 -4.9134220997393285e-12
-0.5	 3.5	 -9.10577516166633e-12
-0.5	 3.75	 -2.0430839312024496e-11
-0.5	 4.0	 -3.947240624635473e-11
-0.25	 -4.0	 -5.532033164890038e-15
-0.25	 -3.75	 -5.532033164890038e-15
-0.25	 -3.5	 -5.0844745080880216e-15
-0.25	 -3.25	 -4.093947403305265e-15
-0.25	 -3.0	 -2.4060614611798314e-15
-0.25	 -2.75	 1.97758476261356e-16
-0.25	 -2.5	 1.960237527853792e-16
-0.25	 -2.25	 -3.903127820947816e-16
-0.25	 -2.0	 -2.671474153004283e-16
-0.25	 -1.75	 5.412337245047638e-16
-0.25	 -1.5	 4.649058915617843e-16
-0.25	 -1.25	 4.336808689942018e-17
-0.25	 -1.0	 -9.683226442902537e-15
-0.25	 -0.75	 1.112429592886599e-12
-0.25	 -0.5	 -3.259616633555229e-08
-0.25	 -0.25	 -4.034053716073238e-10
-0.25	 0.0	 -9.631309638713503e-12
-0.25	 0.25	 -9.425794589290604e-10
-0.25	 0.5	 -3.157700067188407e-07
-0.25	 0.75	 6.731636428836119e-11
-0.25	 1.0	 -1.8066607238020893e-12
-0.25	 1.25	 -4.29101199017623e-14
-0.25	 1.5	 -3.2317898357447916e-14
-0.25	 1.75	 -5.902049682315891e-14
-0.25	 2.0	 1.0673753547685294e-13
-0.25	 2.25	 2.834885104441298e-13
-0.25	 2.5	 5.759680926642474e-13
-0.25	 2.75	 -7.668414514494515e-13
-0.25	 3.0	 -2.54558353562917e-12
-0.25	 3.25	 -5.032387700998342e-12
-0.25	 3.5	 -8.76515526826438e-12
-0.25	 3.75	 -1.6863442933723327e-11
-0.25	 4.0	 -3.005506780950906e-11
0.0	 -4.0	 -1.9081958235744878e-17
0.0	 -3.75	 -1.734723475976807e-18
0.0	 -3.5	 -4.5102810375396984e-17
0.0	 -3.25	 -3.9898639947466563e-17
0.0	 -3.0	 -3.9898639947466563e-17
0.0	 -2.75	 -8.673617379884035e-18
0.0	 -2.5	 4.597017211338539e-16
0.0	 -2.25	 3.1953606427492787e-15
0.0	 -2.0	 -1.116468029138673e-14
0.0	 -1.75	 6.446232436729815e-15
0.0	 -1.5	 4.7014475645923426e-14
0.0	 -1.25	 3.7516864614950407e-13
0.0	 -1.0	 2.0121751487245376e-13
0.0	 -0.75	 2.5816154769486843e-14
0.0	 -0.5	 -1.0857981180834031e-13
0.0	 -0.25	 -3.139849491518021e-14
0.0	 0.0	 4.062722380737682e-15
0.0	 0.25	 -9.014872182078193e-13
0.0	 0.5	 -6.3844242392807615e-12
0.0	 0.75	 3.5908775952719907e-16
0.0	 1.0	 -2.42861286636753e-17
0.0	 1.25	 4.683753385137379e-17
0.0	 1.5	 -4.85722573273506e-17
0.0	 1.75	 -4.215378046623641e-16
0.0	 2.0	 1.2836953722228372e-15
0.0	 2.25	 4.3576253716537394e-15
0.0	 2.5	 -1.3548190347378863e-15
0.0	 2.75	 1.6601303665098044e-14
0.0	 3.0	 -1.025221574302293e-14
0.0	 3.25	 -5.5153798195206605e-14
0.0	 3.5	 -9.888964647153387e-14
0.0	 3.75	 3.1155633628543455e-15
0.0	 4.0	 2.0126261768282916e-13
0.25	 -4.0	 4.603956105242446e-15
0.25	 -3.75	 4.385380947269368e-15
0.25	 -3.5	 4.083539062449404e-15
0.25	 -3.25	 3.615163723935666e-15
0.25	 -3.0	 1.5161483180037294e-15
0.25	 -2.75	 8.118505867571457e-16
0.25	 -2.5	 1.635844237846129e-15
0.25	 -2.25	 4.544975507059235e-16
0.25	 -2.0	 -9.003214840319629e-16
0.25	 -1.75	 -3.975986206938842e-15
0.25	 -1.5	 -4.289971156090644e-15
0.25	 -1.25	 -2.822395095414265e-15
0.25	 -1.0	 -1.4276774207289122e-15
0.25	 -0.75	 1.4242079737769586e-15
0.25	 -0.5	 8.236550504137075e-11
0.25	 -0.25	 7.936107290114347e-07
0.25	 0.0	 -3.772298445836597e-11
0.25	 0.25	 -2.186322159682119e-06
0.25	 0.5	 6.364628319169285e-09
0.25	 0.75	 1.5153156507352605e-13
0.25	 1.0	 6.279698983036042e-15
0.25	 1.25	 7.042977312465837e-16
0.25	 1.5	 1.2698175844150228e-14
0.25	 1.75	 -1.7277845820729e-14
0.25	 2.0	 -7.33666599694871e-14
0.25	 2.25	 -2.3867019471879303e-13
0.25	 2.5	 -2.8780276772888413e-13
0.25	 2.75	 4.2317364890021025e-13
0.25	 3.0	 9.420988295039123e-13
0.25	 3.25	 2.8632755888491346e-12
0.25	 3.5	 5.808515127214697e-12
0.25	 3.75	 1.1059944626801155e-11
0.25	 4.0	 2.0899105362959247e-11
0.5	 -4.0	 8.378714388967978e-15
0.5	 -3.75	 7.998809947729058e-15
0.5	 -3.5	 7.339615026857871e-15
0.5	 -3.25	 5.5892790395972725e-15
0.5	 -3.0	 1.3149203947904198e-15
0.5	 -2.75	 2.8449465006019636e-16
0.5	 -2.5	 1.1102230246251565e-16
0.5	 -2.25	 4.597017211338539e-16
0.5	 -2.0	 -2.787700625894729e-15
0.5	 -1.75	 -5.9674487573602164e-15
0.5	 -1.5	 -5.88418203051333e-15
0.5	 -1.25	 3.0461744238152733e-15
0.5	 -1.0	 -7.148795444500422e-15
0.5	 -0.75	 -1.3565537582138631e-15
0.5	 -0.5	 -1.3968340373260446e-13
0.5	 -0.25	 -3.6875620980370005e-08
0.5	 0.0	 -1.1275431976986994e-11
0.5	 0.25	 -3.196196259047657e-08
0.5	 0.5	 -2.5268398484712407e-12
0.5	 0.75	 -1.055058818089094e-14
0.5	 1.0	 -1.4224732503009818e-16
0.5	 1.25	 3.0912772341906702e-15
0.5	 1.5	 7.337880303381894e-15
0.5	 1.75	 -2.148281552649678e-14
0.5	 2.0	 -6.038572419875265e-14
0.5	 2.25	 -2.41962699876197e-13
0.5	 2.5	 2.368695517507291e-13
0.5	 2.75	 -1.5241453932279825e-13
0.5	 3.0	 -3.8907418953293416e-13
0.5	 3.25	 -1.7026657861407557e-13
0.5	 3.5	 9.420346447353012e-13
0.5	 3.75	 4.220793853315641e-12
0.5	 4.0	 1.2590716663707369e-11
0.75	 -4.0	 1.1509890263106115e-14
0.75	 -3.75	 1.0835082830951137e-14
0.75	 -3.5	 9.402201239794294e-15
0.75	 -3.25	 6.0385724198752655e-15
0.75	 -3.0	 1.0581813203458523e-15
0.75	 -2.75	 3.469446951953614e-18
0.75	 -2.5	 -9.141992718397773e-16
0.75	 -2.25	 7.563394355258879e-16
0.75	 -2.0	 -5.087943955039975e-15
0.75	 -1.75	 -6.772360450213455e-15
0.75	 -1.5	 -8.999745393367675e-15
0.75	 -1.25	 -1.9255430583342559e-16
0.75	 -1.0	 -4.522944518914329e-14
0.75	 -0.75	 -7.587680483922554e-15
0.75	 -0.5	 -1.3739009929736312e-15
0.75	 -0.25	 -1.808020427124246e-08
0.75	 0.0	 3.9888925496001093e-13
0.75	 0.25	 2.1263038592692074e-07
0.75	 0.5	 -2.6522187224209404e-14
0.75	 0.75	 -5.547645676173829e-15
0.75	 1.0	 -1.4693107841523556e-15
0.75	 1.25	 3.174543961037557e-16
0.75	 1.5	 -3.991598718222633e-15
0.75	 1.75	 -1.8384599398402202e-14
0.75	 2.0	 -5.144495940356819e-14
0.75	 2.25	 -2.0882601203808804e-13
0.75	 2.5	 -1.571312524539792e-14
0.75	 2.75	 -4.0298840653374413e-13
0.75	 3.0	 -1.0505311898167946e-12
0.75	 3.25	 -1.911764149764572e-12
0.75	 3.5	 -2.321413894446067e-12
0.75	 3.75	 -1.0120081855857777e-12
0.75	 4.0	 3.830867914556002e-12
1.0	 -4.0	 1.4150139393542815e-14
1.0	 -3.75	 1.304512053934559e-14
1.0	 -3.5	 1.0606099332122199e-14
1.0	 -3.25	 5.441827544139244e-15
1.0	 -3.0	 7.788908407135864e-16
1.0	 -2.75	 -1.7520707107365752e-16
1.0	 -2.5	 -1.0443035325380379e-15
1.0	 -2.25	 3.443426099813962e-15
1.0	 -2.0	 -7.906869603502287e-15
1.0	 -1.75	 -1.1443970771018996e-14
1.0	 -1.5	 -3.996108999260173e-14
1.0	 -1.25	 -7.384717837233268e-15
1.0	 -1.0	 -5.166179983806529e-14
1.0	 -0.75	 -2.461225667715894e-14
1.0	 -0.5	 -1.887379141862766e-15
1.0	 -0.25	 -3.0639491725020784e-09
1.0	 0.0	 -1.1094108028075755e-09
1.0	 0.25	 3.2541545704617425e-08
1.0	 0.5	 -5.152128723651117e-16
1.0	 0.75	 -9.97465998686664e-16
1.0	 1.0	 -5.065392549852277e-16
1.0	 1.25	 -4.562322741819003e-16
1.0	 1.5	 -1.582067810090848e-15
1.0	 1.75	 -1.2880321809127793e-14
1.0	 2.0	 -4.26707280620775e-14
1.0	 2.25	 -1.8546102154015642e-13
1.0	 2.5	 -1.530234272628661e-13
1.0	 2.75	 -4.2593532867396533e-13
1.0	 3.0	 -1.2789595771334206e-12
1.0	 3.25	 -2.835932877420788e-12
1.0	 3.5	 -4.484950605343485e-12
1.0	 3.75	 -4.7416983534054324e-12
1.0	 4.0	 -2.5744233134172845e-12
1.25	 -4.0	 1.6497220256539435e-14
1.25	 -3.75	 1.4637596690292298e-14
1.25	 -3.5	 1.099641211421698e-14
1.25	 -3.25	 4.6004866582904924e-15
1.25	 -3.0	 4.510281037539698e-16
1.25	 -2.75	 -1.734723475976807e-16
1.25	 -2.5	 -1.3253287356462806e-15
1.25	 -2.25	 -5.6794846603480664e-15
1.25	 -2.0	 -8.614636781700824e-15
1.25	 -1.75	 -1.4052994878888114e-14
1.25	 -1.5	 -5.67098451531578e-14
1.25	 -1.25	 -4.309400059021584e-14
1.25	 -1.0	 -5.89459037136919e-14
1.25	 -0.75	 -6.617970060851519e-14
1.25	 -0.5	 -4.44956571588051e-15
1.25	 -0.25	 2.781147534491879e-11
1.25	 0.0	 -2.0240293496787132e-08
1.25	 0.25	 1.370431580716147e-10
1.25	 0.5	 -3.8163916471489756e-17
1.25	 0.75	 1.5612511283791264e-17
1.25	 1.0	 -6.904199434387692e-16
1.25	 1.25	 -2.0816681711721685e-17
1.25	 1.5	 -9.26342336171615e-16
1.25	 1.75	 -8.36657132463614e-15
1.25	 2.0	 -3.5360603334311236e-14
1.25	 2.25	 1.8068879725774423e-14
1.25	 2.5	 -1.6207868380746504e-13
1.25	 2.75	 -3.6034543404728225e-13
1.25	 3.0	 -1.2665545695567104e-12
1.25	 3.25	 -3.2256506493633097e-12
1.25	 3.5	 -5.858947008108295e-12
1.25	 3.75	 -7.489682485317672e-12
1.25	 4.0	 -7.484282291136957e-12
1.5	 -4.0	 1.8290924330699454e-14
1.5	 -3.75	 1.5626389071599078e-14
1.5	 -3.5	 1.0602629885170245e-14
1.5	 -3.25	 3.6637359812630166e-15
1.5	 -3.0	 2.3592239273284576e-16
1.5	 -2.75	 -2.896988204881268e-16
1.5	 -2.5	 -2.4702462297909733e-15
1.5	 -2.25	 -9.667613931618746e-15
1.5	 -2.0	 -1.3683498778505054e-14
1.5	 -1.75	 -2.0278917434168875e-14
1.5	 -1.5	 -9.954190249850114e-14
1.5	 -1.25	 -1.141899075296493e-13
1.5	 -1.0	 -9.637481784841029e-13
1.5	 -0.75	 -1.3772663565170262e-13
1.5	 -0.5	 -3.0340313594834356e-14
1.5	 -0.25	 3.2501085156511067e-13
1.5	 0.0	 5.2735858346864006e-08
1.5	 0.25	 1.5470916214788133e-11
1.5	 0.5	 -3.226585665316861e-16
1.5	 0.75	 -7.077671781985373e-16
1.5	 1.0	 -5.655198531684391e-16
1.5	 1.25	 -6.696032617270475e-16
1.5	 1.5	 -9.52363188311267e-16
1.5	 1.75	 -5.648259637780484e-15
1.5	 2.0	 -3.0329905253978495e-14
1.5	 2.25	 -5.5691562472759415e-14
1.5	 2.5	 -1.353344519783306e-13
1.5	 2.75	 -2.7513928635425344e-13
1.5	 3.0	 -1.1222030249502524e-12
1.5	 3.25	 -3.3370389784792565e-12
1.5	 3.5	 -6.756768755611375e-12
1.5	 3.75	 -9.555183033693737e-12
1.5	 4.0	 -1.1397533958290573e-11
1.75	 -4.0	 1.9663090600197108e-14
1.75	 -3.75	 1.627170620466245e-14
1.75	 -3.5	 9.934761346919174e-15
1.75	 -3.25	 2.8622937353617317e-15
1.75	 -3.0	 8.153200337090993e-17
1.75	 -2.75	 -4.85722573273506e-16
1.75	 -2.5	 -4.378442053365461e-15
1.75	 -2.25	 -1.422299777953384e-14
1.75	 -2.0	 -1.0722325805012645e-14
1.75	 -1.75	 -3.2796682036817515e-14
1.75	 -1.5	 -1.6337799169097167e-13
1.75	 -1.25	 -3.50715984032135e-13
1.75	 -1.0	 -2.240794355623521e-13
1.75	 -0.75	 -7.638160937073479e-14
1.75	 -0.5	 -1.4299152140129223e-13
1.75	 -0.25	 -1.243467134814935e-13
1.75	 0.0	 2.7293679209089428e-08
1.75	 0.25	 -4.275434173361958e-12
1.75	 0.5	 -1.078998002057574e-15
1.75	 0.75	 -4.562322741819003e-16
1.75	 1.0	 -6.158268339717665e-16
1.75	 1.25	 -6.591949208711867e-17
1.75	 1.5	 -6.435824095873954e-16
1.75	 1.75	 -3.7001651742585295e-15
1.75	 2.0	 -2.6537799735493195e-14
1.75	 2.25	 -5.449807272128737e-14
1.75	 2.5	 -9.940485934389898e-14
1.75	 2.75	 -1.8059165274308953e-13
1.75	 3.0	 -9.272530659965028e-13
1.75	 3.25	 -3.186371305696767e-12
1.75	 3.5	 -7.168860990947046e-12
1.75	 3.75	 -1.097431867602694e-11
1.75	 4.0	 -1.461891718790298e-11
2.0	 -4.0	 2.074902749615859e-14
2.0	 -3.75	 1.6302931227230033e-14
2.0	 -3.5	 9.183626081821217e-15
2.0	 -3.25	 2.373101715136272e-15
2.0	 -3.0	 -7.112366251504909e-17
2.0	 -2.75	 -4.787836793695988e-16
2.0	 -2.5	 -6.073266889394802e-15
2.0	 -2.25	 -2.005860755271982e-14
2.0	 -2.0	 7.34412530789541e-14
2.0	 -1.75	 -1.3151459088422968e-13
2.0	 -1.5	 -3.4500700907269533e-13
2.0	 -1.25	 -8.294441522505025e-13
2.0	 -1.0	 -1.2205514376972815e-13
2.0	 -0.75	 -1.8673777801847535e-13
2.0	 -0.5	 -3.876864107521527e-13
2.0	 -0.25	 -2.6653158846645653e-14
2.0	 0.0	 1.1942439268400329e-08
2.0	 0.25	 -1.1394184207258462e-13
2.0	 0.5	 -1.3374717999781183e-15
2.0	 0.75	 -4.631711680858075e-16
2.0	 1.0	 -6.539907504432563e-16
2.0	 1.25	 -6.314393452555578e-16
2.0	 1.5	 -9.159339953157541e-16
2.0	 1.75	 -3.2439329000766293e-15
2.0	 2.0	 -3.130135040052551e-14
2.0	 2.25	 -4.648365026227452e-14
2.0	 2.5	 -6.234596172660645e-14
2.0	 2.75	 -9.928169397710462e-14
2.0	 3.0	 -7.427704284967973e-13
2.0	 3.25	 -2.9579064891871454e-12
2.0	 3.5	 -7.093457765616762e-12
2.0	 3.75	 -1.1918101922026025e-11
2.0	 4.0	 -1.7354928258384028e-11
2.25	 -4.0	 2.1566082253343666e-14
2.25	 -3.75	 1.6155479731772004e-14
2.25	 -3.5	 8.383918559395909e-15
2.25	 -3.25	 1.7052331768852014e-15
2.25	 -3.0	 -1.1449174941446927e-16
2.25	 -2.75	 -5.169475958410885e-16
2.25	 -2.5	 -4.8433479449272454e-15
2.25	 -2.25	 -2.5810950599058913e-14
2.25	 -2.0	 -6.7914424084492e-14
2.25	 -1.75	 -6.487518855458063e-14
2.25	 -1.5	 -4.618302268388774e-13
2.25	 -1.25	 -9.306583281798453e-13
2.25	 -1.0	 -2.288447209508604e-14
2.25	 -0.75	 -7.248611433308128e-13
2.25	 -0.5	 -3.376118828946062e-14
2.25	 -0.25	 -6.963180032570904e-15
2.25	 0.0	 1.1813879362623791e-09
2.25	 0.25	 6.927208806573049e-12
2.25	 0.5	 -1.4432899320127035e-15
2.25	 0.75	 -1.4641066137244252e-15
2.25	 1.0	 -1.384309333829492e-15
2.25	 1.25	 -1.339206523454095e-15
2.25	 1.5	 -1.0651202142497596e-15
2.25	 1.75	 -2.4980018054066022e-15
2.25	 2.0	 -1.6162418625675912e-14
2.25	 2.25	 -3.9045155997285974e-14
2.25	 2.5	 -2.5124000102572097e-14
2.25	 2.75	 -2.6553412246776986e-14
2.25	 3.0	 -5.832175020703545e-13
2.25	 3.25	 -2.6779307937818686e-12
2.25	 3.5	 -6.888486309142294e-12
2.25	 3.75	 -1.2220238709836906e-11
2.25	 4.0	 -1.9591491623449642e-11
2.5	 -4.0	 2.2154153511699803e-14
2.5	 -3.75	 1.5768636396629176e-14
2.5	 -3.5	 7.33441085642994e-15
2.5	 -3.25	 1.4710455076283324e-15
2.5	 -3.0	 -2.5153490401663703e-16
2.5	 -2.75	 -6.158268339717665e-16
2.5	 -2.5	 -5.5441762292218755e-15
2.5	 -2.25	 -2.5434515604771946e-14
2.5	 -2.0	 -5.168435124325299e-14
2.5	 -1.75	 -6.426630061451277e-14
2.5	 -1.5	 -6.815069342192004e-13
2.5	 -1.25	 -1.9648432186825104e-12
2.5	 -1.0	 -4.716366186485743e-14
2.5	 -0.75	 -1.7559148579593398e-12
2.5	 -0.5	 2.55951509986474e-13
2.5	 -0.25	 1.960237527853792e-16
2.5	 0.0	 2.3282211228381477e-11
2.5	 0.25	 -5.351951520848885e-13
2.5	 0.5	 -1.5994150448506161e-15
2.5	 0.75	 -1.3183898417423734e-15
2.5	 1.0	 -5.811323644522304e-16
2.5	 1.25	 -9.558326352632207e-16
2.5	 1.5	 -1.0286910212542466e-15
2.5	 1.75	 -2.0122792321330962e-15
2.5	 2.0	 -1.6243950629046822e-14
2.5	 2.25	 -3.122328784410655e-14
2.5	 2.5	 7.729927808952652e-15
2.5	 2.75	 3.581336616154118e-14
2.5	 3.0	 -4.3298871432728703e-13
2.5	 3.25	 -2.4584050073439556e-12
2.5	 3.5	 -6.4938523308688545e-12
2.5	 3.75	 -1.2264880083767693e-11
2.5	 4.0	 -2.1300532518364612e-11
2.75	 -4.0	 2.245426067304379e-14
2.75	 -3.75	 1.5216994331268552e-14
2.75	 -3.5	 6.5954186556638206e-15
2.75	 -3.25	 1.169203622808368e-15
2.75	 -3.0	 -1.8908485888147197e-16
2.75	 -2.75	 -7.424616477180734e-16
2.75	 -2.5	 -5.009881398621019e-15
2.75	 -2.25	 -4.044334311892328e-14
2.75	 -2.0	 -8.326672684688674e-14
2.75	 -1.75	 -9.14598258239252e-14
2.75	 -1.5	 -8.307781546035287e-13
2.75	 -1.25	 -2.537125023960307e-12
2.75	 -1.0	 -3.40916531116342e-13
2.75	 -0.75	 -4.4519388175956465e-12
2.75	 -0.5	 2.7824964554667986e-13
2.75	 -0.25	 2.1909557501587074e-15
2.75	 0.0	 -1.673281565389706e-11
2.75	 0.25	 -6.56032519974481e-13
2.75	 0.5	 -2.5118795932144167e-15
2.75	 0.75	 -1.960237527853792e-15
2.75	 1.0	 -1.2455314557513475e-15
2.75	 1.25	 -1.0894063429134349e-15
2.75	 1.5	 -8.89913143176102e-16
2.75	 1.75	 -2.0174834025610267e-15
2.75	 2.0	 -1.535924165629865e-14
2.75	 2.25	 -2.1045665210550624e-14
2.75	 2.5	 3.6892364163598756e-14
2.75	 2.75	 8.224323999606042e-14
2.75	 3.0	 -3.079168864328352e-13
2.75	 3.25	 -2.2131532717573066e-12
2.75	 3.5	 -6.124642459859331e-12
2.75	 3.75	 -1.2017092182459166e-11
2.75	 4.0	 -2.2468530508357176e-11
3.0	 -4.0	 2.2560078805078376e-14
3.0	 -3.75	 1.4656678648528043e-14
3.0	 -3.5	 5.998673779927799e-15
3.0	 -3.25	 8.933825901280557e-16
3.0	 -3.0	 -4.562322741819003e-16
3.0	 -2.75	 -8.673617379884035e-16
3.0	 -2.5	 -5.091413401991929e-15
3.0	 -2.25	 -5.112923973094041e-14
3.0	 -2.0	 -6.963700449613697e-14
3.0	 -1.75	 -2.861599845971341e-14
3.0	 -1.5	 -8.669072404376976e-13
3.0	 -1.25	 -3.348807342540283e-12
3.0	 -1.0	 -8.165378095892351e-13
3.0	 -0.75	 -5.4117925418761814e-12
3.0	 -0.5	 7.591496875569703e-14
3.0	 -0.25	 2.3540197569005272e-15
3.0	 0.0	 -1.824225406149571e-11
3.0	 0.25	 -3.4937504278520493e-13
3.0	 0.5	 -6.279698983036042e-16
3.0	 0.75	 -2.211772431870429e-15
3.0	 1.0	 -1.2542050731312315e-15
3.0	 1.25	 -1.07032438467769e-15
3.0	 1.5	 -1.3409412469300719e-15
3.0	 1.75	 -2.1961599205866378e-15
3.0	 2.0	 -1.4514431323497945e-14
3.0	 2.25	 -9.237402509576498e-15
3.0	 2.5	 6.231820615099082e-14
3.0	 2.75	 1.1611545058798356e-13
3.0	 3.0	 -2.1356701129793265e-13
3.0	 3.25	 -1.9982800136819634e-12
3.0	 3.5	 -5.7790387059108994e-12
3.0	 3.75	 -1.1840722846656604e-11
3.0	 4.0	 -2.318093807185395e-11
3.25	 -4.0	 2.2450791226091837e-14
3.25	 -3.75	 1.3992279557228926e-14
3.25	 -3.5	 5.358560817292357e-15
3.25	 -3.25	 5.30825383648903e-16
3.25	 -3.0	 -6.47051856539349e-16
3.25	 -2.75	 -1.0894063429134349e-15
3.25	 -2.5	 -5.8321403262340255e-15
3.25	 -2.25	 -5.6251878155499924e-14
3.25	 -2.0	 -1.1185496973098452e-13
3.25	 -1.75	 -2.1304485953166363e-13
3.25	 -1.5	 -1.4338738529851014e-12
3.25	 -1.25	 -3.1394348926072624e-12
3.25	 -1.0	 -1.1463417021184696e-12
3.25	 -0.75	 -1.955088868577093e-12
3.25	 -0.5	 -4.827388488948259e-14
3.25	 -0.25	 2.7564756033271465e-15
3.25	 0.0	 -5.939102421664844e-11
3.25	 0.25	 -2.472206467318827e-13
3.25	 0.5	 1.5595164049031496e-15
3.25	 0.75	 -2.4407559306993676e-15
3.25	 1.0	 -1.465841337200402e-15
3.25	 1.25	 -1.3287981825982342e-15
3.25	 1.5	 -1.3825746103535153e-15
3.25	 1.75	 -2.761679773755077e-15
3.25	 2.0	 -1.4153608840494769e-14
3.25	 2.25	 2.149322386735264e-15
3.25	 2.5	 8.29926405376824e-14
3.25	 2.75	 1.476683358925257e-13
3.25	 3.0	 -1.5045950596537239e-13
3.25	 3.25	 -1.8136950274971753e-12
3.25	 3.5	 -5.482668138934166e-12
3.25	 3.75	 -1.1518251630260323e-11
3.25	 4.0	 -2.3741971930113515e-11
3.5	 -4.0	 2.2403953692240464e-14
3.5	 -3.75	 1.3357370765021415e-14
3.5	 -3.5	 4.735795089416683e-15
3.5	 -3.25	 4.0939474033052647e-16
3.5	 -3.0	 -5.342948306008566e-16
3.5	 -2.75	 -1.0373646386341306e-15
3.5	 -2.5	 -6.9909356081865326e-15
3.5	 -2.25	 -7.312553340632633e-14
3.5	 -2.0	 -1.0840460473726665e-13
3.5	 -1.75	 -1.7314968903114902e-13
3.5	 -1.5	 -1.5402817910015187e-12
3.5	 -1.25	 -3.143287713447407e-12
3.5	 -1.0	 -7.304018501130827e-13
3.5	 -0.75	 -6.707152194751487e-13
3.5	 -0.5	 -7.052344819236112e-14
3.5	 -0.25	 2.3713669916602953e-15
3.5	 0.0	 3.1361345811942165e-11
3.5	 0.25	 5.744016373654404e-14
3.5	 0.5	 1.6202317265623378e-15
3.5	 0.75	 -2.975050761300224e-15
3.5	 1.0	 -1.5629858518551032e-15
3.5	 1.25	 -1.4710455076283324e-15
3.5	 1.5	 -1.294103713078698e-15
3.5	 1.75	 -2.4511642715552284e-15
3.5	 2.0	 -1.2856035680464117e-14
3.5	 2.25	 1.2911546831695375e-14
3.5	 2.5	 9.511315346433236e-14
3.5	 2.75	 1.7375337280078895e-13
3.5	 3.0	 -7.980595351231301e-14
3.5	 3.25	 -1.687610121092753e-12
3.5	 3.5	 -5.2268103040153946e-12
3.5	 3.75	 -1.1355520690425891e-11
3.5	 4.0	 -2.3982208580131115e-11
3.75	 -4.0	 2.2180174363839456e-14
3.75	 -3.75	 1.2712053631958042e-14
3.75	 -3.5	 4.277828091758806e-15
3.75	 -3.25	 4.163336342344337e-16
3.75	 -3.0	 -7.73686670285656e-16
3.75	 -2.75	 -1.1622647289044608e-15
3.75	 -2.5	 -7.008282842946301e-15
3.75	 -2.25	 -6.732808754961184e-14
3.75	 -2.0	 -1.1316989012577494e-13
3.75	 -1.75	 -1.7569626309388298e-13
3.75	 -1.5	 -9.842439363527689e-13
3.75	 -1.25	 -3.4524466618890415e-12
3.75	 -1.0	 8.156149367000154e-13
3.75	 -0.75	 -1.4034433337695162e-13
3.75	 -0.5	 2.869232629265639e-14
3.75	 -0.25	 -4.007211229506424e-15
3.75	 0.0	 6.469930190558526e-11
3.75	 0.25	 -8.88492404649277e-13
3.75	 0.5	 -1.3877787807814457e-17
3.75	 0.75	 -3.101685575046531e-15
3.75	 1.0	 -8.760353553682876e-16
3.75	 1.25	 -1.4779844015322396e-15
3.75	 1.5	 -1.169203622808368e-15
3.75	 1.75	 -2.3522850334245504e-15
3.75	 2.0	 -1.145264438839888e-14
3.75	 2.25	 2.086351924557306e-14
3.75	 2.5	 1.0884695922364074e-13
3.75	 2.75	 1.874680966018616e-13
3.75	 3.0	 -2.5174307083375425e-14
3.75	 3.25	 -1.5472085418410941e-12
3.75	 3.5	 -5.080122086886796e-12
3.75	 3.75	 -1.1394432272715527e-11
3.75	 4.0	 -2.4183651609055445e-11
4.0	 -4.0	 2.186792413816363e-14
4.0	 -3.75	 1.2016429518091343e-14
4.0	 -3.5	 3.965577866082981e-15
4.0	 -3.25	 1.7694179454963432e-16
4.0	 -3.0	 -1.1483869410966463e-15
4.0	 -2.75	 -1.457167719820518e-15
4.0	 -2.5	 -8.472389456670726e-15
4.0	 -2.25	 -9.563877467755333e-14
4.0	 -2.0	 -1.5204677794589117e-13
4.0	 -1.75	 -1.673244875988189e-13
4.0	 -1.5	 -5.815677800447006e-13
4.0	 -1.25	 -2.3468796350734067e-12
4.0	 -1.0	 -1.2540784383174852e-12
4.0	 -0.75	 -3.293025574446773e-14
4.0	 -0.5	 1.4763537614648214e-13
4.0	 -0.25	 -4.779163176316104e-16
4.0	 0.0	 1.8722526133607698e-11
4.0	 0.25	 -3.8703415472518543e-13
4.0	 0.5	 1.97758476261356e-16
4.0	 0.75	 -3.4122010772463796e-15
4.0	 1.0	 -7.684824998577255e-16
4.0	 1.25	 -3.559652572704408e-15
4.0	 1.5	 -2.3314683517128287e-15
4.0	 1.75	 -3.5284275501368256e-15
4.0	 2.0	 -8.515757543570146e-15
4.0	 2.25	 2.938101151261918e-14
4.0	 2.5	 1.1929519871944905e-13
4.0	 2.75	 1.9936136075315858e-13
4.0	 3.0	 2.203098814490545e-15
4.0	 3.25	 -1.4277173193688597e-12
4.0	 3.5	 -4.939541831117111e-12
4.0	 3.75	 -1.141172573104754e-11
4.0	 4.0	 -2.4286513772286966e-11
4.25	 -4.0	 2.1423834928313568e-14
4.25	 -3.75	 1.1607034777760816e-14
4.25	 -3.5	 3.4226094181022404e-15
4.25	 -3.25	 -1.214306433183765e-16
4.25	 -3.0	 -8.430756093247282e-16
4.25	 -2.75	 -1.790234627208065e-15
4.25	 -2.5	 -9.669348655094723e-15
4.25	 -2.25	 -8.053106792527132e-14
4.25	 -2.0	 -1.0764479585478881e-13
4.25	 -1.75	 -1.8632664855466885e-13
4.25	 -1.5	 -5.794358048927251e-13
4.25	 -1.25	 -1.5209899312251807e-12
4.25	 -1.0	 -1.3765811407440154e-12
4.25	 -0.75	 -1.3837021806129002e-13
4.25	 -0.5	 1.1406500743937897e-13
4.25	 -0.25	 1.8127860323957634e-16
4.25	 0.0	 -4.207924373528238e-11
4.25	 0.25	 -3.9182719568930935e-13
4.25	 0.5	 9.08995101411847e-16
4.25	 0.75	 -1.5612511283791264e-15
4.25	 1.0	 -3.2040342601291627e-15
4.25	 1.25	 -2.366162821232365e-15
4.25	 1.5	 -5.325601071248798e-16
4.25	 1.75	 -4.9855952699573436e-15
4.25	 2.0	 -4.56926163572291e-15
4.25	 2.25	 3.362587985833443e-14
4.25	 2.5	 1.2241423152925535e-13
4.25	 2.75	 2.1509356795679224e-13
4.25	 3.0	 2.2499363483419188e-14
4.25	 3.25	 -1.3449866220760498e-12
4.25	 3.5	 -4.805099027005433e-12
4.25	 3.75	 -1.1479874342801288e-11
4.25	 4.0	 -2.4589087710413793e-11
4.5	 -4.0	 2.098321516541546e-14
4.5	 -3.75	 1.0979064879457212e-14
4.5	 -3.5	 3.1953606427492787e-15
4.5	 -3.25	 -2.0469737016526324e-16
4.5	 -3.0	 -1.0737938316296436e-15
4.5	 -2.75	 -1.7468665403086447e-15
4.5	 -2.5	 -8.585146482609218e-15
4.5	 -2.25	 -8.367959103416922e-14
4.5	 -2.0	 -1.6026936722202123e-13
4.5	 -1.75	 -2.0625168239973846e-13
4.5	 -1.5	 -2.2245920383578976e-13
4.5	 -1.25	 -9.375000775690978e-13
4.5	 -1.0	 -1.0793223953475817e-12
4.5	 -0.75	 -2.7157269488764513e-13
4.5	 -0.5	 4.403422071419527e-14
4.5	 -0.25	 7.997075224253081e-16
4.5	 0.0	 -5.970852761869039e-11
4.5	 0.25	 -5.342375847261494e-13
4.5	 0.5	 1.4016565685892601e-15
4.5	 0.75	 -8.326672684688674e-17
4.5	 1.0	 -2.8119867545584043e-15
4.5	 1.25	 -2.624636619152909e-15
4.5	 1.5	 -2.1354445989274495e-15
4.5	 1.75	 -5.734995811579324e-15
4.5	 2.0	 2.822395095414265e-15
4.5	 2.25	 3.843279861026616e-14
4.5	 2.5	 1.2781962988039908e-13
4.5	 2.75	 2.262044718204237e-13
4.5	 3.0	 5.261416302637656e-14
4.5	 3.25	 -1.3153436673185581e-12
4.5	 3.5	 -4.686553228827606e-12
4.5	 3.75	 -1.1450075262930959e-11
4.5	 4.0	 -2.4980736229585077e-11
4.75	 -4.0	 2.064494408759998e-14
4.75	 -3.75	 1.0390993621101074e-14
4.75	 -3.5	 2.8640284588377085e-15
4.75	 -3.25	 -2.8102520310824275e-16
4.75	 -3.0	 -1.3183898417423734e-15
4.75	 -2.75	 -1.8492152253912764e-15
4.75	 -2.5	 -1.1716322356747355e-14
4.75	 -2.25	 -6.936291818693263e-14
4.75	 -2.0	 -1.91027749174566e-13
4.75	 -1.75	 -1.9893635350154426e-13
4.75	 -1.5	 -3.6579940465575334e-13
4.75	 -1.25	 -8.119945688056518e-13
4.75	 -1.0	 -9.788021088086296e-13
4.75	 -0.75	 -3.3766045515193355e-13
4.75	 -0.5	 -3.805983306293115e-15
4.75	 -0.25	 7.450637329320386e-16
4.75	 0.0	 -3.9459490796395214e-11
4.75	 0.25	 -1.0407889827757089e-12
4.75	 0.5	 7.806255641895632e-16
4.75	 0.75	 -4.614364446098307e-16
4.75	 1.0	 -4.605690828718423e-15
4.75	 1.25	 -1.4606371667724716e-15
4.75	 1.5	 -3.3306690738754696e-15
4.75	 1.75	 -8.704842402451618e-15
4.75	 2.0	 7.877379304410681e-15
4.75	 2.25	 4.358839678086923e-14
4.75	 2.5	 1.3805102894171029e-13
4.75	 2.75	 2.286643097093588e-13
4.75	 3.0	 7.394432288698738e-14
4.75	 3.25	 -1.247519448854817e-12
4.75	 3.5	 -4.6825026495112e-12
4.75	 3.75	 -1.1308218250682955e-11
4.75	 4.0	 -2.5120058810834678e-11
5.0	 -4.0	 2.0018708912772354e-14
5.0	 -3.75	 9.922618282587337e-15
5.0	 -3.5	 2.6142282782970483e-15
5.0	 -3.25	 -6.92154666914746e-16
5.0	 -3.0	 -1.457167719820518e-15
5.0	 -2.75	 -1.925543058334256e-15
5.0	 -2.5	 -9.003214840319629e-15
5.0	 -2.25	 -6.559162935015905e-14
5.0	 -2.0	 -1.6767837118791817e-13
5.0	 -1.75	 -2.2402218968764487e-13
5.0	 -1.5	 -2.525375741857516e-13
5.0	 -1.25	 -5.465454477882048e-13
5.0	 -1.0	 -6.57675303106231e-13
5.0	 -0.75	 -2.4053675717894407e-13
5.0	 -0.5	 -2.1163626406917047e-15
5.0	 -0.25	 -1.3478801408339791e-15
5.0	 0.0	 2.447836594879349e-11
5.0	 0.25	 -1.825536249944193e-12
5.0	 0.5	 -8.89913143176102e-16
5.0	 0.75	 -5.0306980803327406e-17
5.0	 1.0	 -3.308117668687771e-15
5.0	 1.25	 -4.3038489438984584e-15
5.0	 1.5	 -6.637052019087264e-15
5.0	 1.75	 -1.2784912017949068e-14
5.0	 2.0	 1.431146867680866e-14
5.0	 2.25	 5.03225933146112e-14
5.0	 2.5	 1.4963030814385547e-13
5.0	 2.75	 2.351851352555556e-13
5.0	 3.0	 8.624177760818696e-14
5.0	 3.25	 -1.1942166006084776e-12
5.0	 3.5	 -4.6518604940315456e-12
5.0	 3.75	 -1.1425940055209693e-11
5.0	 4.0	 -2.4830819692067685e-11
5.25	 -4.0	 1.946706684741173e-14
5.25	 -3.75	 9.346690088563037e-15
5.25	 -3.5	 2.3800406090401793e-15
5.25	 -3.25	 -4.0245584642661925e-16
5.25	 -3.0	 -1.8283985436795547e-15
5.25	 -2.75	 -1.850949948867253e-15
5.25	 -2.5	 -6.180819744905364e-15
5.25	 -2.25	 -5.914366218995326e-14
5.25	 -2.0	 -1.771239405146119e-13
5.25	 -1.75	 -1.6255573276335866e-13
5.25	 -1.5	 -1.8753748554090066e-13
5.25	 -1.25	 -3.97838012533569e-13
5.25	 -1.0	 -4.1116936244645075e-13
5.25	 -0.75	 -2.781559704789771e-13
5.25	 -0.5	 1.4474532683550478e-14
5.25	 -0.25	 -4.6265075104301445e-15
5.25	 0.0	 5.6885932596395516e-11
5.25	 0.25	 -2.498680949647447e-12
5.25	 0.5	 -4.746203430272544e-15
5.25	 0.75	 5.155598170603071e-15
5.25	 1.0	 -7.854827899222983e-15
5.25	 1.25	 -7.820133429703446e-15
5.25	 1.5	 -1.1367642938076017e-14
5.25	 1.75	 -1.5407813913626e-14
5.25	 2.0	 2.0197385430797965e-14
5.25	 2.25	 6.117849282727406e-14
5.25	 2.5	 1.6202664210318574e-13
5.25	 2.75	 2.439541624266184e-13
5.25	 3.0	 8.344019919448442e-14
5.25	 3.25	 -1.1537559102547945e-12
5.25	 3.5	 -4.625811886316278e-12
5.25	 3.75	 -1.1503496072373665e-11
5.25	 4.0	 -2.4961911010423776e-11
5.5	 -4.0	 1.882001499087238e-14
5.5	 -3.75	 9.126380207113982e-15
5.5	 -3.5	 2.267283583101687e-15
5.5	 -3.25	 -7.389922007661198e-16
5.5	 -3.0	 -1.4814538484841933e-15
5.5	 -2.75	 -2.4251434194155763e-15
5.5	 -2.5	 -8.409939411535561e-15
5.5	 -2.25	 -4.6945086706884354e-14
5.5	 -2.0	 -1.6260257029721004e-13
5.5	 -1.75	 -1.4327428132787645e-13
5.5	 -1.5	 -1.8943006885319136e-13
5.5	 -1.25	 -3.392806868784959e-13
5.5	 -1.0	 -2.5808521986192545e-13
5.5	 -0.75	 -1.9229583203550504e-13
5.5	 -0.5	 2.2667631660588938e-14
5.5	 -0.25	 -9.96425164601078e-15
5.5	 0.0	 6.963954890179536e-11
5.5	 0.25	 -4.166783237891103e-12
5.5	 0.5	 -8.978928711655954e-15
5.5	 0.75	 1.3985340663325019e-14
5.5	 1.0	 -4.143387022370604e-14
5.5	 1.25	 -1.6415688253168526e-14
5.5	 1.5	 -1.8398477186210016e-14
5.5	 1.75	 -1.3848297508722851e-14
5.5	 2.0	 3.256075964408467e-14
5.5	 2.25	 7.797582024515748e-14
5.5	 2.5	 1.811623767666859e-13
5.5	 2.75	 2.512001023857735e-13
5.5	 3.0	 9.022643743250569e-14
5.5	 3.25	 -1.1529371207741335e-12
5.5	 3.5	 -4.5592644243308555e-12
5.5	 3.75	 -1.1542655720120365e-11
5.5	 4.0	 -2.5092469768672743e-11
5.75	 -4.0	 1.839674246273404e-14
5.75	 -3.75	 8.503614479238308e-15
5.75	 -3.5	 1.8093165854438098e-15
5.75	 -3.25	 -1.0130785099704553e-15
5.75	 -3.0	 -1.6670692604137116e-15
5.75	 -2.75	 -2.4251434194155763e-15
5.75	 -2.5	 -6.094083571106523e-15
5.75	 -2.25	 -2.674076238218248e-14
5.75	 -2.0	 -1.1342315975326756e-13
5.75	 -1.75	 -1.572041108399702e-13
5.75	 -1.5	 -1.2176544494924002e-13
5.75	 -1.25	 -2.7674737501648394e-13
5.75	 -1.0	 -1.4444001550373287e-13
5.75	 -0.75	 -1.3477934046601803e-13
5.75	 -0.5	 1.8920628952479035e-14
5.75	 -0.25	 -1.5964660149414556e-14
5.75	 0.0	 3.631960053887551e-11
5.75	 0.25	 -6.763208916515939e-12
5.75	 0.5	 -1.3596762604706214e-14
5.75	 0.75	 2.4716340085717547e-14
5.75	 1.0	 -7.147806652119115e-13
5.75	 1.25	 -2.8047009159593017e-14
5.75	 1.5	 -3.135859627523274e-14
5.75	 1.75	 -4.983860546481367e-15
5.75	 2.0	 5.6387186586626115e-14
5.75	 2.25	 1.0591354182576396e-13
5.75	 2.5	 2.0517615384463284e-13
5.75	 2.75	 2.6009749909405855e-13
5.75	 3.0	 7.85274623105181e-14
5.75	 3.25	 -1.1305539837636047e-12
5.75	 3.5	 -4.561575076000857e-12
5.75	 3.75	 -1.1541826522298848e-11
5.75	 4.0	 -2.4994926267618567e-11
6.0	 -4.0	 1.794051018855214e-14
6.0	 -3.75	 8.28503932126523e-15
6.0	 -3.5	 1.8735013540549517e-15
6.0	 -3.25	 -3.5735303605122226e-16
6.0	 -3.0	 -2.121566811119635e-15
6.0	 -2.75	 -2.8449465006019636e-15
6.0	 -2.5	 -5.6517290847324375e-15
6.0	 -2.25	 -2.46226650180148e-14
6.0	 -2.0	 -6.591428791669074e-14
6.0	 -1.75	 -1.2294332218942827e-13
6.0	 -1.5	 -9.448518356602875e-14
6.0	 -1.25	 -1.420807915764044e-13
6.0	 -1.0	 -1.186412079690058e-13
6.0	 -0.75	 -1.39492584150247e-13
6.0	 -0.5	 9.313730342519477e-15
6.0	 -0.25	 -2.3076159039181476e-14
6.0	 0.0	 -1.3148744679863933e-11
6.0	 0.25	 -9.725883293176807e-12
6.0	 0.5	 -1.8179902028236938e-14
6.0	 0.75	 3.061960407446662e-14
6.0	 1.0	 2.075041527493937e-13
6.0	 1.25	 -4.935982178544407e-14
6.0	 1.5	 -5.6246673985071993e-14
6.0	 1.75	 1.1976530878143876e-14
6.0	 2.0	 9.198718176062215e-14
6.0	 2.25	 1.4907172718459094e-13
6.0	 2.5	 2.3564830642364143e-13
6.0	 2.75	 2.7028553006847034e-13
6.0	 3.0	 4.6743858783671044e-14
6.0	 3.25	 -1.1558688034485343e-12
6.0	 3.5	 -4.5650254409945745e-12
6.0	 3.75	 -1.1499499269485014e-11
6.0	 4.0	 -2.5053044708234218e-11
6.25	 -4.0	 1.7392337570143468e-14
6.25	 -3.75	 8.005748841632965e-15
6.25	 -3.5	 1.8665624601510444e-15
6.25	 -3.25	 -5.48172618408671e-16
6.25	 -3.0	 -1.7572748811645056e-15
6.25	 -2.75	 -2.5379004453540688e-15
6.25	 -2.5	 -4.69416172599324e-15
6.25	 -2.25	 -1.4422490979271174e-14
6.25	 -2.0	 -4.993054580904044e-14
6.25	 -1.75	 -8.799037887197159e-14
6.25	 -1.5	 -1.1328438187518941e-13
6.25	 -1.25	 -6.539040142694574e-14
6.25	 -1.0	 -7.599650075906794e-14
6.25	 -0.75	 -8.447062493921464e-14
6.25	 -0.5	 3.87363752185621e-15
6.25	 -0.25	 -3.170640833216609e-14
6.25	 0.0	 -1.2416576686095915e-10
6.25	 0.25	 -9.264717465429229e-12
6.25	 0.5	 -7.16093850883226e-15
6.25	 0.75	 3.925852698483112e-14
6.25	 1.0	 1.4649739754624136e-13
6.25	 1.25	 -9.431344594190705e-14
6.25	 1.5	 -1.0742795542029171e-13
6.25	 1.75	 4.768060946069852e-14
6.25	 2.0	 1.3762949113704792e-13
6.25	 2.25	 2.0968643488217253e-13
6.25	 2.5	 2.7794259949143196e-13
6.25	 2.75	 2.747073402087352e-13
6.25	 3.0	 -3.760880495917718e-15
6.25	 3.25	 -1.2581446301451749e-12
6.25	 3.5	 -4.552138180291543e-12
6.25	 3.75	 -1.159060521171984e-11
6.25	 4.0	 -2.4613457105804315e-11
6.5	 -4.0	 1.7263968032921184e-14
6.5	 -3.75	 7.795847301039771e-15
6.5	 -3.5	 1.6289053439422219e-15
6.5	 -3.25	 -1.1379786002407855e-15
6.5	 -3.0	 -1.3010426069826053e-15
6.5	 -2.75	 -2.319325287380991e-15
6.5	 -2.5	 -3.1710745140856034e-15
6.5	 -2.25	 -1.0769163338864018e-14
6.5	 -2.0	 -4.80709222427933e-14
6.5	 -1.75	 -7.514128208541138e-14
6.5	 -1.5	 -8.380622584791553e-14
6.5	 -1.25	 -3.8464023632833744e-14
6.5	 -1.0	 -8.407857743364389e-14
6.5	 -0.75	 -5.98514293681518e-14
6.5	 -0.5	 1.8388068845354155e-16
6.5	 -0.25	 -4.349819116011844e-14
6.5	 0.0	 -1.9485894039820983e-10
6.5	 0.25	 -4.026856972871862e-12
6.5	 0.5	 2.98806118737005e-14
6.5	 0.75	 4.882205750789126e-14
6.5	 1.0	 1.5846005063657742e-13
6.5	 1.25	 -2.466620657726182e-13
6.5	 1.5	 -1.826420958916941e-13
6.5	 1.75	 1.0193061672492121e-13
6.5	 2.0	 2.1647440784366978e-13
6.5	 2.25	 3.0066574230325216e-13
6.5	 2.5	 3.302445122921327e-13
6.5	 2.75	 2.685074385055941e-13
6.5	 3.0	 -8.761741332463657e-14
6.5	 3.25	 -1.3915101709782718e-12
6.5	 3.5	 -4.596413527568899e-12
6.5	 3.75	 -1.1622688922408031e-11
6.5	 4.0	 -2.4378079416242926e-11
6.75	 -4.0	 1.6698448179752745e-14
6.75	 -3.75	 7.441963711940502e-15
6.75	 -3.5	 1.5456386170953351e-15
6.75	 -3.25	 -7.441963711940502e-16
6.75	 -3.0	 -1.294103713078698e-15
6.75	 -2.75	 -2.007075061705166e-15
6.75	 -2.5	 -3.0357660829594124e-15
6.75	 -2.25	 -4.640385298237959e-15
6.75	 -2.0	 -2.5694724126168467e-14
6.75	 -1.75	 -7.129019596874286e-14
6.75	 -1.5	 -6.103798022571993e-14
6.75	 -1.25	 -1.7911019889460533e-14
6.75	 -1.0	 -5.118475088217167e-14
6.75	 -0.75	 -5.6288307348495437e-14
6.75	 -0.5	 -7.28583859910259e-16
6.75	 -0.25	 -5.961550697541895e-14
6.75	 0.0	 -1.1356818762318921e-10
6.75	 0.25	 4.254591470798097e-13
6.75	 0.5	 6.982435463154246e-14
6.75	 0.75	 6.654746198542227e-14
6.75	 1.0	 2.2529721144248782e-13
6.75	 1.25	 -7.570402638101825e-13
6.75	 1.5	 -2.5264859648821414e-13
6.75	 1.75	 1.840784469298029e-13
6.75	 2.0	 3.2238794966943374e-13
6.75	 2.25	 4.0559743064161324e-13
6.75	 2.5	 3.7933024776837243e-13
6.75	 2.75	 2.3094894052722026e-13
6.75	 3.0	 -2.16980947098655e-13
6.75	 3.25	 -1.5872633069013986e-12
6.75	 3.5	 -4.846952700310325e-12
6.75	 3.75	 -1.1660764367982246e-11
6.75	 4.0	 -2.4644834784037783e-11
7.0	 -4.0	 1.628905343942222e-14
7.0	 -3.75	 7.440228988464526e-15
7.0	 -3.5	 2.060851489460447e-15
7.0	 -3.25	 -4.510281037539698e-16
7.0	 -3.0	 -1.3235940121703038e-15
7.0	 -2.75	 -1.9099305470504646e-15
7.0	 -2.5	 -2.6315755130568164e-15
7.0	 -2.25	 -4.916206330918271e-15
7.0	 -2.0	 -1.5111176199233967e-14
7.0	 -1.75	 -9.513743959299603e-14
7.0	 -1.5	 -6.836198274129401e-14
7.0	 -1.25	 2.6003504904892338e-14
7.0	 -1.0	 -3.55653007044765e-14
7.0	 -0.75	 -3.5350194993455375e-14
7.0	 -0.5	 -9.194034422677078e-16
7.0	 -0.25	 -8.254941868957033e-14
7.0	 0.0	 -8.476471824794829e-11
7.0	 0.25	 6.452807038703767e-13
7.0	 0.5	 1.0111703141468809e-13
7.0	 0.75	 1.0345370393682884e-13
7.0	 1.0	 3.555315764014466e-13
7.0	 1.25	 -2.5039709888874384e-12
7.0	 1.5	 -2.9120456046527465e-13
7.0	 1.75	 2.8743327162850107e-13
7.0	 2.0	 4.4414819044824583e-13
7.0	 2.25	 4.920508445138694e-13
7.0	 2.5	 4.1091609281895813e-13
7.0	 2.75	 1.5621878790561539e-13
7.0	 3.0	 -4.1538127104612244e-13
7.0	 3.25	 -1.8823310965476736e-12
7.0	 3.5	 -5.1174706833245764e-12
7.0	 3.75	 -1.1763673368747618e-11
7.0	 4.0	 -2.4655562314013224e-11
7.25	 -4.0	 1.567496132892643e-14
7.25	 -3.75	 7.44369843541648e-15
7.25	 -3.5	 2.2620794126737565e-15
7.25	 -3.25	 -1.9081958235744878e-16
7.25	 -3.0	 -8.482797797526587e-16
7.25	 -2.75	 -1.429412144204889e-15
7.25	 -2.5	 -1.4710455076283324e-15
7.25	 -2.25	 -2.661065812148422e-15
7.25	 -2.0	 -8.795048023202412e-15
7.25	 -1.75	 -6.323414014630657e-14
7.25	 -1.5	 -3.5632954920039595e-14
7.25	 -1.25	 4.966860256416794e-14
7.25	 -1.0	 -3.189115638235762e-14
7.25	 -0.75	 -1.723968190425751e-14
7.25	 -0.5	 -5.776629175002768e-16
7.25	 -0.25	 -1.0974814806941069e-13
7.25	 0.0	 1.0160495234881259e-09
7.25	 0.25	 -2.7449344880414728e-12
7.25	 0.5	 1.113102665595278e-13
7.25	 0.75	 1.7807630370292316e-13
7.25	 1.0	 5.63736557435135e-13
7.25	 1.25	 2.6787773388381453e-13
7.25	 1.5	 -2.823297151621773e-13
7.25	 1.75	 4.2688422241532464e-13
7.25	 2.0	 5.91257945381507e-13
7.25	 2.25	 5.643454453752028e-13
7.25	 2.5	 4.113133444949568e-13
7.25	 2.75	 2.5939320136281196e-14
7.25	 3.0	 -7.243147054358801e-13
7.25	 3.25	 -2.2858451242946387e-12
7.25	 3.5	 -5.561100191453505e-12
7.25	 3.75	 -1.2221657713640255e-11
7.25	 4.0	 -2.4619526903246758e-11
7.5	 -4.0	 1.5574347367319774e-14
7.5	 -3.75	 7.212980213111564e-15
7.5	 -3.5	 2.831068712794149e-15
7.5	 -3.25	 4.3021142204224816e-16
7.5	 -3.0	 -9.610368056911511e-16
7.5	 -2.75	 -1.4814538484841933e-15
7.5	 -2.5	 -2.230854390106174e-15
7.5	 -2.25	 -2.8727020762175925e-15
7.5	 -2.0	 -8.052586375484339e-15
7.5	 -1.75	 -5.158720672859829e-14
7.5	 -1.5	 -3.8609740404815796e-14
7.5	 -1.25	 -8.003667173461793e-14
7.5	 -1.0	 -1.8344700758454735e-14
7.5	 -0.75	 -1.2014694794615366e-14
7.5	 -0.5	 4.683753385137379e-17
7.5	 -0.25	 -1.336899341231046e-13
7.5	 0.0	 3.932177298289659e-09
7.5	 0.25	 -8.555538222321246e-12
7.5	 0.5	 8.583411759133242e-14
7.5	 0.75	 3.112753110823263e-13
7.5	 1.0	 8.632001363695352e-13
7.5	 1.25	 -2.8948993896493747e-10
7.5	 1.5	 -2.010804717178516e-13
7.5	 1.75	 6.139637409585674e-13
7.5	 2.0	 7.572709820324874e-13
7.5	 2.25	 6.109453221103678e-13
7.5	 2.5	 3.1775103381814773e-13
7.5	 2.75	 -2.434510926185851e-13
7.5	 3.0	 -1.2216651301688586e-12
7.5	 3.25	 -2.8514794692124923e-12
7.5	 3.5	 -6.21895937524819e-12
7.5	 3.75	 -1.2788940045860286e-11
7.5	 4.0	 -2.470393334341736e-11
7.75	 -4.0	 1.5525775109992423e-14
7.75	 -3.75	 8.056055822436292e-15
7.75	 -3.5	 3.2040342601291627e-15
7.75	 -3.25	 2.636779683484747e-16
7.75	 -3.0	 -6.140921104957897e-16
7.75	 -2.75	 -1.5265566588595902e-15
7.75	 -2.5	 -1.3981871216373065e-15
7.75	 -2.25	 -1.726049858596923e-15
7.75	 -2.0	 -4.721917301608869e-15
7.75	 -1.75	 -2.3587035102856646e-14
7.75	 -1.5	 -2.619258976377381e-14
7.75	 -1.25	 -3.138635185084837e-14
7.75	 -1.0	 -8.493206138382448e-15
7.75	 -0.75	 -8.928621730852626e-15
7.75	 -0.5	 3.3480163086352377e-16
7.75	 -0.25	 -1.4491012556572258e-13
7.75	 0.0	 1.1249501392701297e-08
7.75	 0.25	 -1.5905639652591397e-11
7.75	 0.5	 1.0786510573623787e-14
7.75	 0.75	 5.111345374730902e-13
7.75	 1.0	 1.2488950845712665e-12
7.75	 1.25	 5.967535493534015e-12
7.75	 1.5	 -5.737077479750496e-14
7.75	 1.75	 8.341886209572991e-13
7.75	 2.0	 9.31281093907721e-13
7.75	 2.25	 6.250572975874391e-13
7.75	 2.5	 7.550210456841455e-14
7.75	 2.75	 -8.491176511915555e-13
7.75	 3.0	 -2.0470569683794793e-12
7.75	 3.25	 -3.765755068885213e-12
7.75	 3.5	 -7.14238043708626e-12
7.75	 3.75	 -1.3662897202504354e-11
7.75	 4.0	 -2.551502412129203e-11
8.0	 -4.0	 1.5775575290533084e-14
8.0	 -3.75	 8.455042221910958e-15
8.0	 -3.5	 3.4781205693334982e-15
8.0	 -3.25	 1.186550857568136e-15
8.0	 -3.0	 2.185751579730777e-16
8.0	 -2.75	 -1.0928757898653885e-15
8.0	 -2.5	 -1.3027773304585821e-15
8.0	 -2.25	 -1.5681900222830336e-15
8.0	 -2.0	 -2.9629076969683865e-15
8.0	 -1.75	 -1.9245022242486698e-14
8.0	 -1.5	 -2.3554075356813087e-14
8.0	 -1.25	 -3.601979825518242e-14
8.0	 -1.0	 -9.039644033315142e-15
8.0	 -0.75	 -5.393255286811893e-15
8.0	 -0.5	 9.471590178833367e-16
8.0	 -0.25	 -1.3881517463287807e-13
8.0	 0.0	 3.973415374069339e-08
8.0	 0.25	 -2.435138288930938e-11
8.0	 0.5	 -1.3120754482898178e-13
8.0	 0.75	 7.049725386787387e-13
8.0	 1.0	 1.6871053165612437e-12
8.0	 1.25	 4.134682179968152e-12
8.0	 1.5	 1.790911169363696e-13
8.0	 1.75	 1.1026856511220373e-12
8.0	 2.0	 1.0643534664733778e-12
8.0	 2.25	 5.652631140939945e-13
8.0	 2.5	 -3.465717296480264e-13
8.0	 2.75	 -1.8028321890906085e-12
8.0	 3.0	 -3.3456223902383897e-12
8.0	 3.25	 -5.39812465560896e-12
8.0	 3.5	 -8.547173385720086e-12
8.0	 3.75	 -1.514626445098255e-11
8.0	 4.0	 -2.666056785061155e-11
8.25	 -4.0	 1.62456853525228e-14
8.25	 -3.75	 9.154135782729611e-15
8.25	 -3.5	 4.848552115355176e-15
8.25	 -3.25	 1.6948248360293405e-15
8.25	 -3.0	 3.365363543395006e-16
8.25	 -2.75	 -1.9081958235744878e-16
8.25	 -2.5	 -1.087671619437458e-15
8.25	 -2.25	 -1.1015494072452725e-15
8.25	 -2.0	 -1.968911145233676e-15
8.25	 -1.75	 -1.1983469772047783e-14
8.25	 -1.5	 -1.978799069046744e-14
8.25	 -1.25	 -2.6548208076349056e-14
8.25	 -1.0	 -5.941427905220564e-15
8.25	 -0.75	 -2.4147350785597155e-15
8.25	 -0.5	 7.632783294297951e-16
8.25	 -0.25	 -1.0987044607446705e-13
8.25	 0.0	 -0.01249428135128463
8.25	 0.25	 -3.376549994466016e-11
8.25	 0.5	 -3.5541708465203214e-13
8.25	 0.75	 8.168708764966226e-13
8.25	 1.0	 2.072493218707727e-12
8.25	 1.25	 3.192033443122355e-12
8.25	 1.5	 5.584508550038336e-13
8.25	 1.75	 1.4312023788320971e-12
8.25	 2.0	 1.1132761379428757e-12
8.25	 2.25	 3.83101536605146e-13
8.25	 2.5	 -1.0779779846536997e-12
8.25	 2.75	 -2.924650105429194e-12
8.25	 3.0	 -5.177563239255889e-12
8.25	 3.25	 -7.747906483057676e-12
8.25	 3.5	 -1.0751519466389858e-11
8.25	 3.75	 -1.7225800647002742e-11
8.25	 4.0	 -2.8384201239406437e-11
8.5	 -4.0	 1.6781714906599632e-14
8.5	 -3.75	 1.0104764247564901e-14
8.5	 -3.5	 5.662137425588298e-15
8.5	 -3.25	 3.0097452308197603e-15
8.5	 -3.0	 1.7243151351209463e-15
8.5	 -2.75	 2.6020852139652106e-17
8.5	 -2.5	 -6.591949208711867e-16
8.5	 -2.25	 -1.1848161340921592e-15
8.5	 -2.0	 -1.8110513089197866e-15
8.5	 -1.75	 -5.9223459469848194e-15
8.5	 -1.5	 -1.4915152446448587e-14
8.5	 -1.25	 -2.214547989431992e-14
8.5	 -1.0	 -5.054984208996416e-15
8.5	 -0.75	 -2.022687572988957e-15
8.5	 -0.5	 6.002143226879753e-16
8.5	 -0.25	 -4.849679685614561e-14
8.5	 0.0	 -0.01212472300924624
8.5	 0.25	 -4.395966143183605e-11
8.5	 0.5	 -6.768110377697312e-13
8.5	 0.75	 7.548614511243557e-13
8.5	 1.0	 2.3903622137222413e-12
8.5	 1.25	 2.5150333204937425e-12
8.5	 1.5	 1.210486572089664e-12
8.5	 1.75	 1.7926476275631487e-12
8.5	 2.0	 1.012875547323766e-12
8.5	 2.25	 -7.111325417419323e-14
8.5	 2.5	 -2.2069672478419733e-12
8.5	 2.75	 -4.269255088340529e-12
8.5	 3.0	 -7.197947099468749e-12
8.5	 3.25	 -1.0564271679669446e-11
8.5	 3.5	 -1.4770474773828646e-11
8.5	 3.75	 -2.0397249861359157e-11
8.5	 4.0	 -3.145488383649031e-11
8.75	 -4.0	 1.780346703394997e-14
8.75	 -3.75	 1.2063267051942717e-14
8.75	 -3.5	 7.936359902593892e-15
8.75	 -3.25	 5.691627724679904e-15
8.75	 -3.0	 2.6957602816679582e-15
8.75	 -2.75	 2.896988204881268e-16
8.75	 -2.5	 -4.3368086899420177e-16
8.75	 -2.25	 -7.095019016745141e-16
8.75	 -2.0	 -1.3357370765021415e-15
8.75	 -1.75	 -4.3749726064135075e-15
8.75	 -1.5	 -9.797718192317006e-15
8.75	 -1.25	 -1.8721135752741702e-14
8.75	 -1.0	 -4.407932352457067e-15
8.75	 -0.75	 -1.4085954624931674e-15
8.75	 -0.5	 2.931682674400804e-16
8.75	 -0.25	 5.246063999875261e-14
8.75	 0.0	 -0.011775826217967127
8.75	 0.25	 -5.465437998009026e-11
8.75	 0.5	 -1.0985726217604963e-12
8.75	 0.75	 2.599656601098843e-13
8.75	 1.0	 2.64911877156937e-12
8.75	 1.25	 1.9732358108592862e-12
8.75	 1.5	 2.4069635173873394e-12
8.75	 1.75	 2.0968678182686773e-12
8.75	 2.0	 6.341299013667978e-13
8.75	 2.25	 -9.68383359611913e-13
8.75	 2.5	 -3.789385472074969e-12
8.75	 2.75	 -6.301605071090677e-12
8.75	 3.0	 -9.277162371645886e-12
8.75	 3.25	 -1.396387172558633e-11
8.75	 3.5	 -2.031254331402721e-11
8.75	 3.75	 -2.6002514377787556e-11
8.75	 4.0	 -3.592977304567313e-11
9.0	 -4.0	 1.9735948986188134e-14
9.0	 -3.75	 1.5222198501696482e-14
9.0	 -3.5	 1.135549987374418e-14
9.0	 -3.25	 7.0811412289373266e-15
9.0	 -3.0	 3.361894096443052e-15
9.0	 -2.75	 1.2177758801357186e-15
9.0	 -2.5	 -4.40619762898109e-16
9.0	 -2.25	 -7.129713486264677e-16
9.0	 -2.0	 -1.115427195053087e-15
9.0	 -1.75	 -2.2169766022983595e-15
9.0	 -1.5	 -6.0958182945825e-15
9.0	 -1.25	 -1.521179016084062e-14
9.0	 -1.0	 -2.7842311789427754e-15
9.0	 -0.75	 -6.38378239159465e-16
9.0	 -0.5	 -1.734723475976807e-17
9.0	 -0.25	 2.0081505902602714e-13
9.0	 0.0	 -0.01144615370860396
9.0	 0.25	 -6.54571917502178e-11
9.0	 0.5	 -1.6263726476672957e-12
9.0	 0.75	 -5.783793582958552e-13
9.0	 1.0	 2.956053804514802e-12
9.0	 1.25	 1.4512124141274896e-12
9.0	 1.5	 4.780334114662388e-12
9.0	 1.75	 2.122758566147631e-12
9.0	 2.0	 -1.1986418801956944e-13
9.0	 2.25	 -2.346197888747348e-12
9.0	 2.5	 -5.907583450204257e-12
9.0	 2.75	 -9.598582345615725e-12
9.0	 3.0	 -1.2858832054707392e-11
9.0	 3.25	 -1.8027402487463817e-11
9.0	 3.5	 -2.5922288621194056e-11
9.0	 3.75	 -3.511847583570482e-11
9.0	 4.0	 -4.299664617402055e-11
9.25	 -4.0	 2.3184579256430027e-14
9.25	 -3.75	 1.973768370966411e-14
9.25	 -3.5	 1.4852702401313422e-14
9.25	 -3.25	 8.935560624756533e-15
9.25	 -3.0	 4.909267437014364e-15
9.25	 -2.75	 1.941155569618047e-15
9.25	 -2.5	 8.101158632811689e-16
9.25	 -2.25	 -3.382710778154774e-16
9.25	 -2.0	 -5.048045315092509e-16
9.25	 -1.75	 -1.1744077932362984e-15
9.25	 -1.5	 -3.811187476721045e-15
9.25	 -1.25	 -8.749945212827015e-15
9.25	 -1.0	 -2.6853519408120974e-15
9.25	 -0.75	 -2.914335439641036e-16
9.25	 -0.5	 -6.071532165918825e-16
9.25	 -0.25	 3.888703595245069e-13
9.25	 0.0	 -0.01113419653643052
9.25	 0.25	 -7.584983249125932e-11
9.25	 0.5	 -2.2605198962688533e-12
9.25	 0.75	 -7.580810978957686e-13
9.25	 1.0	 3.4434885498590972e-12
9.25	 1.25	 8.746493113109821e-13
9.25	 1.5	 1.1609989011840405e-11
9.25	 1.75	 1.5219856625003914e-12
9.25	 2.0	 -1.4286887645154067e-12
9.25	 2.25	 -4.372001025099159e-12
9.25	 2.5	 -8.523712985430976e-12
9.25	 2.75	 -1.4644143536690635e-11
9.25	 3.0	 -1.92912005814172e-11
9.25	 3.25	 -2.3612061958444563e-11
9.25	 3.5	 -3.3247059619267993e-11
9.25	 3.75	 -4.6894176042311386e-11
9.25	 4.0	 -5.450881759849757e-11
9.5	 -4.0	 2.84598733468755e-14
9.5	 -3.75	 2.4414498200897583e-14
9.5	 -3.5	 1.8218065944708428e-14
9.5	 -3.25	 1.1050188541972261e-14
9.5	 -3.0	 7.143591274072492e-15
9.5	 -2.75	 3.472916398905568e-15
9.5	 -2.5	 1.7676832220203664e-15
9.5	 -2.25	 -4.475586568020162e-16
9.5	 -2.0	 -5.464378949326942e-16
9.5	 -1.75	 -1.3617579286417936e-15
9.5	 -1.5	 -2.4494295480792516e-15
9.5	 -1.25	 -6.876443858772063e-15
9.5	 -1.0	 -1.8388068845354155e-15
9.5	 -0.75	 2.42861286636753e-17
9.5	 -0.5	 -1.6740081543176188e-15
9.5	 -0.25	 5.830769894688004e-13
9.5	 0.0	 -0.010838586188836048
9.5	 0.25	 -8.517332412277812e-11
9.5	 0.5	 -2.9929201478262613e-12
9.5	 0.75	 -4.4209601257616526e-13
9.5	 1.0	 4.311646525922974e-12
9.5	 1.25	 1.7563901721917574e-13
9.5	 1.5	 -5.033092345674284e-11
9.5	 1.75	 -3.717425672844499e-13
9.5	 2.0	 -3.577031032486744e-12
9.5	 2.25	 -7.40807415411382e-12
9.5	 2.5	 -1.2106768712549787e-11
9.5	 2.75	 -2.0410924686520282e-11
9.5	 3.0	 -2.8604126012243825e-11
9.5	 3.25	 -3.339347375008739e-11
9.5	 3.5	 -4.3557536050231604e-11
9.5	 3.75	 -5.690605972552554e-11
9.5	 4.0	 -6.944843658485134e-11
9.75	 -4.0	 3.4399566528620085e-14
9.75	 -3.75	 2.8596916501477665e-14
9.75	 -3.5	 2.0761170560490427e-14
9.75	 -3.25	 1.4249018631673493e-14
9.75	 -3.0	 1.0096090630185017e-14
9.75	 -2.75	 5.599687380453133e-15
9.75	 -2.5	 2.1371793224034263e-15
9.75	 -2.25	 6.366435156834882e-16
9.75	 -2.0	 -2.6020852139652106e-17
9.75	 -1.75	 -3.3133218391157016e-16
9.75	 -1.5	 -1.0807327255335508e-15
9.75	 -1.25	 -1.4710455076283324e-15
9.75	 -1.0	 -4.562322741819003e-16
9.75	 -0.75	 5.238864897449957e-16
9.75	 -0.5	 -2.418204525511669e-15
9.75	 -0.25	 7.617430991535556e-13
9.75	 0.0	 -0.010558087473449764
9.75	 0.25	 -9.238019377244555e-11
9.75	 0.5	 -3.870686757223574e-12
9.75	 0.75	 4.77048955893622e-16
9.75	 1.0	 5.7029641425954125e-12
9.75	 1.25	 -7.22821108523064e-13
9.75	 1.5	 6.241326899747435e-13
9.75	 1.75	 -4.860185170985076e-12
9.75	 2.0	 -7.091795900526776e-12
9.75	 2.25	 -1.1790434947811512e-11
9.75	 2.5	 -1.7916267427975363e-11
9.75	 2.75	 -2.702663960685303e-11
9.75	 3.0	 -4.028004145506525e-11
9.75	 3.25	 -5.115113194120724e-11
9.75	 3.5	 -5.637003537561913e-11
9.75	 3.75	 -6.885151129787381e-11
9.75	 4.0	 -8.22009769280152e-11
10.0	 -4.0	 3.962975780869016e-14
10.0	 -3.75	 3.236994006172722e-14
10.0	 -3.5	 2.412306465693348e-14
10.0	 -3.25	 1.9468801570887706e-14
10.0	 -3.0	 1.3900339213002155e-14
10.0	 -2.75	 7.230327447871332e-15
10.0	 -2.5	 2.8275992658421956e-15
10.0	 -2.25	 1.5942108744226857e-15
10.0	 -2.0	 9.71445146547012e-17
10.0	 -1.75	 -6.678685382510707e-16
10.0	 -1.5	 -9.141992718397773e-16
10.0	 -1.25	 -2.0088097851811426e-15
10.0	 -1.0	 -8.326672684688674e-17
10.0	 -0.75	 7.008282842946301e-16
10.0	 -0.5	 -3.679348492546808e-15
10.0	 -0.25	 8.94998485045928e-13
10.0	 0.0	 -0.010291584304325814
10.0	 0.25	 -9.618021049734304e-11
10.0	 0.5	 -4.9641298016656066e-12
10.0	 0.75	 5.250140600043807e-13
10.0	 1.0	 7.925117159746087e-12
10.0	 1.25	 -1.9277617696600302e-12
10.0	 1.5	 8.264462031393194e-12
10.0	 1.75	 -1.3310373636610251e-11
10.0	 2.0	 -1.342920739888509e-11
10.0	 2.25	 -1.8306745008800362e-11
10.0	 2.5	 -2.733321381731546e-11
10.0	 2.75	 -3.623665256746733e-11
10.0	 3.0	 -5.291051798084201e-11
10.0	 3.25	 -6.968650829997092e-11
10.0	 3.5	 -7.46299515241855e-11
10.0	 3.75	 -8.322628697321477e-11
10.0	 4.0	 -9.252852997687633e-11
