<svg width="233" height="109" viewBox="0 0 233 109" fill="none" xmlns="http://www.w3.org/2000/svg">
<path d="M45.6459 24.2875C18.5237 44.9414 -7.854 81.2875 5.646 97.7875C19.146 114.288 188.146 103.788 218.146 97.7875C248.146 91.7875 221.146 40.7875 188.146 20.2875C155.146 -0.21249 89.6192 -9.19841 45.6459 24.2875Z" fill="#FDB157" stroke="#7A5319" stroke-width="3"/>
<path d="M42.5 62.5C34.9905 49.6647 58 16 64 13C70 10 74.7304 8.30413 81 6.5C92.5983 3.16249 101.5 3 101.5 3C101.5 3 46.1109 68.6718 42.5 62.5Z" fill="#D68C36" stroke="#7F5423" stroke-width="2.5"/>
<path d="M89.7534 65.5C85.911 52.8719 112.383 2.80415 125 2.50001C137.617 2.19587 150 6 150 6C150 6 91.8348 72.3408 89.7534 65.5Z" fill="#D68C36" stroke="#7F5423" stroke-width="2.5"/>
<path d="M144 65.5001C140.158 52.8719 154.5 7.99999 163.5 9.5C172.5 11 188 20 188 20C188 20 146.081 72.3409 144 65.5001Z" fill="#D68C36" stroke="#7F5423" stroke-width="2.5"/>
</svg>
