{
  "locations": {
    "54.184,7.88516666666667": [
      {
        "gsnId": "599",
        "monasteryName": "\"Monasterium\" auf der Insel Farria, Helgoland?",
        "orders": []
      }
    ],
    "49.41952565,8.74004566": [
      {
        "gsnId": "20595",
        "monasteryName": "Adeliges Damenstift Neuburg",
        "orders": []
      },
      {
        "gsnId": "20594",
        "monasteryName": "Benediktinerinnenabtei Neuburg",
        "orders": []
      },
      {
        "gsnId": "20215",
        "monasteryName": "Jesuitenniederlassung Neuburg",
        "orders": []
      },
      {
        "gsnId": "20596",
        "monasteryName": "Lazaristenniederlassung Neuburg/Heidelberg",
        "orders": []
      }
    ]
  }
}
