{
    "total": 71,
    "list": [
        {
            "id": 325,
            "name": "Augustinerchorfrauenstift Barsinghausen, zuvor Doppelstift",
            "places": [],
            "dioceses": [
                "Minden"
            ],
            "timeRanges": [
                [
                    "1185",
                    "?"
                ]
            ]
        },
        {
            "id": 30204,
            "name": "Augustinerchorfrauenstift Immichenhain",
            "places": [],
            "dioceses": [
                "Mainz"
            ],
            "timeRanges": [
                [
                    "1124",
                    "1527"
                ]
            ]
        },
        {
            "id": 30268,
            "name": "Augustinerchorfrauenstift Mittelheim (Oestrich-Winkel)",
            "places": [],
            "dioceses": [
                "Mainz"
            ],
            "timeRanges": [
                [
                    "1108",
                    "1257"
                ]
            ]
        },
        {
            "id": 40240,
            "name": "Augustinerchorherren- und -chorfrauenstift, Ravengiersburg",
            "places": [],
            "dioceses": [
                "Mainz"
            ],
            "timeRanges": [
                [
                    "1073",
                    "1697"
                ]
            ]
        },
        {
            "id": 380,
            "name": "Augustinerchorherren-/-doppelstift Fredelsloh",
            "places": [],
            "dioceses": [
                "Mainz"
            ],
            "timeRanges": [
                [
                    "1132",
                    "1634"
                ]
            ]
        },
        {
            "id": 215,
            "name": "Augustinerchorherrenstift Hamersleben, gegr\u00fcndet in Osterwieck",
            "places": [],
            "dioceses": [
                "Halberstadt"
            ],
            "timeRanges": [
                [
                    "1107",
                    "1804"
                ]
            ]
        },
        {
            "id": 5089,
            "name": "Augustinerchorherrenstift Herzogenburg, zeitweise Doppelstift, \u00d6sterreich",
            "places": [],
            "dioceses": [
                "Passau"
            ],
            "timeRanges": [
                [
                    "1112",
                    "?"
                ]
            ]
        },
        {
            "id": 5170,
            "name": "Augustinerchorherrenstift Reichersberg, zeitweise Doppelstift, \u00d6sterreich",
            "places": [],
            "dioceses": [
                "Passau"
            ],
            "timeRanges": [
                [
                    "1084",
                    "?"
                ]
            ]
        },
        {
            "id": 5000,
            "name": "Augustinerchorherrenstift St. Florian, \u00d6sterreich",
            "places": [],
            "dioceses": [
                "Passau"
            ],
            "timeRanges": [
                [
                    "801",
                    "?"
                ]
            ]
        },
        {
            "id": 40148,
            "name": "Augustinerdoppelstift Lonnig (Maifeld)",
            "places": [],
            "dioceses": [
                "Trier"
            ],
            "timeRanges": [
                [
                    "1078",
                    "1326"
                ]
            ]
        },
        {
            "id": 850,
            "name": "Benediktiner- (Doppel-?) Kloster, sp\u00e4ter Augustinerchorherren Marienkamp",
            "places": [],
            "dioceses": [
                "Bremen-Hamburg"
            ],
            "timeRanges": [
                [
                    "1185",
                    "1530"
                ]
            ]
        },
        {
            "id": 889,
            "name": "Benediktiner-(Doppel-?)Kloster, sp\u00e4ter Augustinerchorherrenstift Sielm\u00f6nken",
            "places": [],
            "dioceses": [
                "M\u00fcnster"
            ],
            "timeRanges": [
                [
                    "1148",
                    "1551"
                ]
            ]
        },
        {
            "id": 4706,
            "name": "Benediktiner-Doppelkloster Germania, Thesinge, Niederlande",
            "places": [],
            "dioceses": [
                "M\u00fcnster"
            ],
            "timeRanges": [
                [
                    "1283",
                    "1602"
                ]
            ]
        },
        {
            "id": 4697,
            "name": "Benediktiner-Doppelkloster Holwierde, Niederlande (Altes Kloster am Damm)",
            "places": [],
            "dioceses": [
                "M\u00fcnster"
            ],
            "timeRanges": [
                [
                    "1200",
                    "1588"
                ]
            ]
        },
        {
            "id": 851,
            "name": "Benediktiner-Doppelkloster Marienthal",
            "places": [],
            "dioceses": [
                "Bremen-Hamburg"
            ],
            "timeRanges": [
                [
                    "1170",
                    "1559"
                ]
            ]
        },
        {
            "id": 5419,
            "name": "Benediktiner-Doppelkloster Oldenklooster (bei den Dam), Niederlande",
            "places": [],
            "dioceses": [
                "M\u00fcnster"
            ],
            "timeRanges": [
                [
                    "1200",
                    "1588"
                ]
            ]
        },
        {
            "id": 3540,
            "name": "Benediktiner-Doppelkloster Paulinzella",
            "places": [],
            "dioceses": [
                "Mainz"
            ],
            "timeRanges": [
                [
                    "1107",
                    "1533"
                ]
            ]
        },
        {
            "id": 672,
            "name": "Benediktiner-Doppelkloster Seem, D\u00e4nemark",
            "places": [],
            "dioceses": [
                "Ribe"
            ],
            "timeRanges": [
                [
                    "1000",
                    "1173"
                ]
            ]
        },
        {
            "id": 898,
            "name": "Benediktiner-Doppelkloster Thedinga",
            "places": [],
            "dioceses": [
                "M\u00fcnster"
            ],
            "timeRanges": [
                [
                    "1288",
                    "1616"
                ]
            ]
        },
        {
            "id": 835,
            "name": "Benediktiner-Doppelkloster, sp\u00e4ter Zisterzienserinnen Meerhusen",
            "places": [],
            "dioceses": [
                "Bremen-Hamburg"
            ],
            "timeRanges": [
                [
                    "1183",
                    "1561"
                ]
            ]
        },
        {
            "id": 4691,
            "name": "Benediktinerdoppelkloster Ten Boer, Niederlande",
            "places": [],
            "dioceses": [
                "M\u00fcnster"
            ],
            "timeRanges": [
                [
                    "1301",
                    "1465"
                ]
            ]
        },
        {
            "id": 4624,
            "name": "Benediktinerinnenabtei Kloster Zella (genannt Friedensspring)",
            "places": [],
            "dioceses": [
                "Mainz"
            ],
            "timeRanges": [
                [
                    "950",
                    "1810"
                ]
            ]
        },
        {
            "id": 30311,
            "name": "Benediktinerinnenkloster Eibingen",
            "places": [],
            "dioceses": [
                "Mainz"
            ],
            "timeRanges": [
                [
                    "1148",
                    "1814"
                ]
            ]
        },
        {
            "id": 406,
            "name": "Benediktinerinnenkloster Heiligenrode (zeitweilig Doppelkloster)",
            "places": [],
            "dioceses": [
                "Bremen-Hamburg"
            ],
            "timeRanges": [
                [
                    "1182",
                    "1816"
                ]
            ]
        },
        {
            "id": 60010,
            "name": "Benediktinerkloster Asbach, zun\u00e4chst Doppelkloster",
            "places": [],
            "dioceses": [
                "Passau"
            ],
            "timeRanges": [
                [
                    "1090",
                    "1803"
                ]
            ]
        },
        {
            "id": 1061,
            "name": "Benediktinerkloster Benediktbeuern, zeitweise Doppelkloster",
            "places": [],
            "dioceses": [
                "Augsburg"
            ],
            "timeRanges": [
                [
                    "735",
                    "1803"
                ]
            ]
        },
        {
            "id": 260,
            "name": "Benediktinerkloster Huysburg, Huy",
            "places": [],
            "dioceses": [
                "Halberstadt"
            ],
            "timeRanges": [
                [
                    "1075",
                    "1804"
                ]
            ]
        },
        {
            "id": 3950,
            "name": "Benediktinerkloster Sch\u00f6nau, Str\u00fcth",
            "places": [],
            "dioceses": [
                "Trier"
            ],
            "timeRanges": [
                [
                    "?",
                    "?"
                ]
            ]
        },
        {
            "id": 858,
            "name": "Benediktinerkloster St. Blasius, Northeim",
            "places": [],
            "dioceses": [
                "Mainz"
            ],
            "timeRanges": [
                [
                    "1033",
                    "1616"
                ]
            ]
        },
        {
            "id": 911,
            "name": "Benediktinerkloster Wietmarschen",
            "places": [],
            "dioceses": [
                "M\u00fcnster"
            ],
            "timeRanges": [
                [
                    "1154",
                    "1811"
                ]
            ]
        }
    ]
}