<?xml version="1.0" encoding="UTF-8" standalone="no"?>
<!DOCTYPE svg PUBLIC "-//W3C//DTD SVG 1.1//EN" "http://www.w3.org/Graphics/SVG/1.1/DTD/svg11.dtd">
<svg width="100%" height="100%" viewBox="0 0 1890 945" version="1.1" xmlns="http://www.w3.org/2000/svg" xmlns:xlink="http://www.w3.org/1999/xlink" xml:space="preserve" xmlns:serif="http://www.serif.com/" style="fill-rule:evenodd;clip-rule:evenodd;stroke-linejoin:round;stroke-miterlimit:2;">
    <g id="Ebene-1" serif:id="Ebene 1" transform="matrix(4.16667,0,0,4.16667,0,0)">
        <g transform="matrix(1,0,0,1,137.484,218.048)">
            <path d="M0,-206C-31.117,-206 -55.734,-195.305 -73.852,-173.914C-91.977,-152.523 -101.031,-127.609 -101.031,-99.187C-101.031,-70.469 -91.594,-46.758 -72.719,-28.055C-53.844,-9.352 -30.164,0 -1.695,0C12.484,0 27.891,-3.094 44.523,-9.273C56.742,-13.805 66.625,-16.078 74.156,-16.078C76.016,-16.078 78.117,-15.883 80.469,-15.5L80.469,-36.828C80.469,-54.109 81,-64.992 82.078,-69.484C83.148,-73.977 85.367,-77.187 88.734,-79.109C92.094,-81.031 98.508,-82 107.969,-82L107.969,-88.5L22.469,-88.5L22.469,-82L27.164,-82C34.992,-82 40.367,-81.383 43.305,-80.148C46.242,-78.914 48.414,-76.5 49.836,-72.898C51.258,-69.297 51.969,-62.125 51.969,-51.375C51.969,-42.203 50.445,-34.609 47.414,-28.594C44.375,-22.578 38.688,-17.469 30.359,-13.281C22.031,-9.094 12.766,-7 2.578,-7C-17.313,-7 -33.977,-14.359 -47.398,-29.086C-60.82,-43.812 -67.531,-68.844 -67.531,-104.172C-67.531,-139.594 -60.547,-164.258 -46.563,-178.156C-32.586,-192.047 -16.195,-199 2.617,-199C20.828,-199 36.313,-193.023 49.063,-181.086C61.813,-169.148 69.609,-152.953 72.469,-132.5L78.969,-132.5L78.969,-199L72.469,-199C71.609,-191.031 69.609,-183.602 66.469,-176.719C48.938,-196.234 26.781,-206 0,-206" style="fill:rgb(156,28,35);fill-rule:nonzero;"/>
        </g>
        <g transform="matrix(1,0,0,1,339.885,218.048)">
            <path d="M0,-206C-14.938,-206 -27.273,-201.281 -37.016,-191.859C-46.766,-182.437 -51.633,-170.641 -51.633,-156.477C-51.633,-147.195 -49.375,-138.453 -44.844,-130.25C-40.32,-122.047 -34.016,-115.375 -25.938,-110.25C-17.859,-105.125 -5.883,-99.141 9.992,-92.305C27.805,-84.68 40.078,-77.547 46.797,-70.891C53.508,-64.133 56.867,-55.758 56.867,-45.773C56.867,-35.883 53.047,-26.945 45.422,-18.969C37.789,-10.984 27.023,-7 13.125,-7C-17.789,-7 -37.375,-27.828 -45.633,-69.5L-53.133,-69.5L-53.133,-5.5L-45.633,-5.5C-44.07,-13.891 -41.68,-20.414 -38.453,-25.055C-23.977,-8.352 -5.898,0 15.773,0C34.617,0 49.68,-5.32 60.953,-15.969C72.227,-26.609 77.867,-40.437 77.867,-57.437C77.867,-68.18 75.531,-77.656 70.859,-85.859C66.188,-94.062 59.992,-100.484 52.258,-105.125C44.523,-109.766 32.164,-115.922 15.18,-123.594C-2.594,-131.656 -14.898,-138.898 -21.734,-145.32C-28.672,-151.641 -32.133,-159.375 -32.133,-168.516C-32.133,-176.094 -29.398,-183.07 -23.93,-189.445C-18.461,-195.812 -9.859,-199 1.859,-199C14.156,-199 24.984,-194.633 34.328,-185.898C43.672,-177.164 50.18,-165.203 53.867,-150L60.367,-150L60.367,-202L53.867,-202C53.281,-195.75 50.742,-189.937 46.25,-184.57C38.492,-193.297 30.93,-199.047 23.563,-201.828C16.188,-204.609 8.336,-206 0,-206" style="fill:rgb(156,28,35);fill-rule:nonzero;"/>
        </g>
        <g transform="matrix(1,0,0,1,121.441,121.746)">
            <path d="M0,-17.25C-2.23,-17.25 -4.09,-16.415 -5.577,-14.745C-7.064,-13.075 -7.808,-10.979 -7.808,-8.459C-7.808,-6.679 -7.423,-5.165 -6.653,-3.918C-5.884,-2.67 -4.896,-1.705 -3.689,-1.023C-2.482,-0.342 -1.201,0 0.156,0C1.617,0 2.968,-0.376 4.207,-1.126C5.446,-1.876 6.274,-2.918 6.692,-4.25L5.771,-4.25C4.777,-2.083 3.092,-1 0.714,-1C-1.037,-1 -2.354,-1.707 -3.235,-3.121C-4.117,-4.535 -4.558,-6.65 -4.558,-9.467C-4.558,-9.845 -4.532,-10.418 -4.479,-11.187L6.692,-11.187C6.627,-12.674 6.021,-14.056 4.872,-15.333C3.724,-16.61 2.1,-17.25 0,-17.25M-4.401,-12C-3.942,-14.958 -2.518,-16.437 -0.127,-16.437C0.857,-16.437 1.688,-16.12 2.365,-15.485C3.041,-14.851 3.38,-13.957 3.38,-12.805C3.38,-12.568 3.359,-12.301 3.32,-12L-4.401,-12" style="fill:rgb(156,28,35);fill-rule:nonzero;"/>
        </g>
        <g transform="matrix(1,0,0,1,141.373,121.121)">
            <path d="M0,-16.625C-0.938,-16.625 -1.899,-16.234 -2.883,-15.454C-3.866,-14.673 -4.576,-13.704 -5.013,-12.547C-5.052,-14.238 -5.261,-15.598 -5.638,-16.625C-7.62,-16.015 -9.225,-15.64 -10.45,-15.5L-10.45,-14.687L-10.044,-14.687C-9.218,-14.687 -8.643,-14.565 -8.32,-14.321C-7.998,-14.077 -7.813,-13.735 -7.769,-13.294C-7.724,-12.853 -7.7,-11.762 -7.7,-10.023L-7.7,-5.457C-7.7,-3.586 -7.732,-2.452 -7.797,-2.058C-7.861,-1.662 -8.059,-1.355 -8.388,-1.139C-8.718,-0.921 -9.27,-0.812 -10.044,-0.812L-10.45,-0.812L-10.45,0L-1.95,0L-1.95,-0.812L-2.502,-0.812C-3.344,-0.812 -3.929,-0.93 -4.257,-1.165C-4.586,-1.399 -4.773,-1.739 -4.819,-2.184C-4.865,-2.627 -4.888,-3.704 -4.888,-5.415L-4.888,-8.274C-4.888,-9.71 -4.779,-10.84 -4.562,-11.662C-4.345,-12.484 -3.853,-13.278 -3.085,-14.042C-2.318,-14.806 -1.66,-15.187 -1.11,-15.187C-0.65,-15.187 -0.306,-14.859 -0.075,-14.205C0.266,-13.234 0.764,-12.75 1.42,-12.75C1.787,-12.75 2.098,-12.888 2.354,-13.165C2.609,-13.441 2.737,-13.771 2.737,-14.153C2.737,-14.72 2.493,-15.273 2.005,-15.814C1.517,-16.354 0.848,-16.625 0,-16.625" style="fill:rgb(156,28,35);fill-rule:nonzero;"/>
        </g>
        <g transform="matrix(1,0,0,1,169.227,121.121)">
            <path d="M0,-16.625C-1.085,-16.625 -2.15,-16.322 -3.195,-15.719C-4.24,-15.114 -5.26,-14.208 -6.252,-13C-6.578,-14.208 -7.151,-15.114 -7.972,-15.719C-8.792,-16.322 -9.86,-16.625 -11.176,-16.625C-12.335,-16.625 -13.419,-16.344 -14.429,-15.781C-15.438,-15.219 -16.38,-14.375 -17.252,-13.25C-17.252,-14.623 -17.442,-15.748 -17.821,-16.625L-18.017,-16.625C-19.233,-16.223 -20.771,-15.932 -22.627,-15.75L-22.627,-14.937C-21.728,-14.937 -21.104,-14.832 -20.759,-14.621C-20.413,-14.41 -20.211,-14.098 -20.152,-13.683C-20.094,-13.268 -20.064,-12.139 -20.064,-10.295L-20.064,-5.455C-20.064,-3.506 -20.104,-2.34 -20.182,-1.958C-20.26,-1.576 -20.472,-1.29 -20.817,-1.099C-21.163,-0.907 -21.767,-0.812 -22.627,-0.812L-22.627,0L-14.689,0L-14.689,-0.812C-15.591,-0.812 -16.217,-0.924 -16.566,-1.146C-16.916,-1.369 -17.118,-1.696 -17.172,-2.128C-17.226,-2.56 -17.252,-3.66 -17.252,-5.428L-17.252,-12.125C-16.379,-13.166 -15.521,-13.947 -14.68,-14.469C-13.839,-14.989 -13.015,-15.25 -12.206,-15.25C-11.372,-15.25 -10.674,-15.024 -10.113,-14.573C-9.553,-14.122 -9.217,-13.579 -9.105,-12.945C-8.995,-12.311 -8.939,-11.287 -8.939,-9.875L-8.939,-5.422C-8.939,-3.473 -8.981,-2.309 -9.064,-1.93C-9.148,-1.551 -9.36,-1.27 -9.7,-1.087C-10.041,-0.903 -10.642,-0.812 -11.502,-0.812L-11.502,0L-3.814,0L-3.814,-0.812C-4.631,-0.812 -5.198,-0.933 -5.516,-1.175C-5.833,-1.417 -6.015,-1.757 -6.06,-2.194C-6.104,-2.632 -6.127,-3.706 -6.127,-5.419L-6.127,-11.75C-5.267,-12.923 -4.409,-13.8 -3.555,-14.38C-2.701,-14.96 -1.851,-15.25 -1.003,-15.25C-0.169,-15.25 0.51,-15.053 1.031,-14.66C1.553,-14.268 1.875,-13.796 1.999,-13.246C2.123,-12.696 2.186,-11.878 2.186,-10.791L2.186,-5.429C2.186,-3.503 2.146,-2.348 2.067,-1.961C1.988,-1.574 1.774,-1.286 1.427,-1.097C1.078,-0.907 0.477,-0.812 -0.377,-0.812L-0.377,0L7.686,0L7.686,-0.812C6.736,-0.812 6.088,-0.91 5.739,-1.106C5.39,-1.303 5.179,-1.604 5.106,-2.009C5.034,-2.414 4.998,-3.552 4.998,-5.423L4.998,-10.249C4.998,-11.884 4.906,-13.067 4.724,-13.8C4.54,-14.532 4.018,-15.186 3.155,-15.762C2.293,-16.337 1.241,-16.625 0,-16.625" style="fill:rgb(156,28,35);fill-rule:nonzero;"/>
        </g>
        <g transform="matrix(1,0,0,1,186.426,121.559)">
            <path d="M0,-17.063C-2.221,-17.063 -3.856,-16.635 -4.908,-15.782C-5.96,-14.927 -6.485,-14.128 -6.485,-13.385C-6.485,-12.628 -6.091,-12.25 -5.302,-12.25C-4.423,-12.25 -3.88,-12.923 -3.673,-14.27C-3.452,-15.59 -2.368,-16.25 -0.419,-16.25C0.556,-16.25 1.342,-16.054 1.939,-15.662C2.537,-15.269 2.907,-14.824 3.05,-14.326C3.192,-13.828 3.265,-13.023 3.265,-11.911L3.265,-11.125L0.247,-9.895C-2.05,-8.944 -3.851,-7.965 -5.154,-6.959C-6.459,-5.954 -7.11,-4.777 -7.11,-3.431C-7.11,-2.398 -6.722,-1.568 -5.942,-0.941C-5.164,-0.315 -4.236,0 -3.159,0C-2.315,0 -1.358,-0.237 -0.288,-0.709C0.782,-1.18 1.967,-1.881 3.265,-2.813C3.422,-1.881 3.76,-1.18 4.278,-0.709C4.796,-0.237 5.502,0 6.395,0C8.481,0 9.584,-1.104 9.702,-3.313L8.983,-3.313C8.771,-2.063 8.227,-1.438 7.352,-1.438C6.82,-1.438 6.475,-1.653 6.316,-2.083C6.156,-2.512 6.077,-3.482 6.077,-4.993L6.077,-11.458C6.077,-12.825 5.931,-13.84 5.639,-14.504C5.347,-15.168 4.746,-15.76 3.837,-16.282C2.928,-16.802 1.648,-17.063 0,-17.063M-1.55,-1.438C-2.236,-1.438 -2.793,-1.688 -3.22,-2.19C-3.647,-2.691 -3.86,-3.352 -3.86,-4.172C-3.86,-6.243 -2.191,-7.961 1.148,-9.329L3.265,-10.188L3.265,-3.875C2.268,-3.063 1.368,-2.454 0.565,-2.047C-0.237,-1.641 -0.942,-1.438 -1.55,-1.438" style="fill:rgb(156,28,35);fill-rule:nonzero;"/>
        </g>
        <g transform="matrix(1,0,0,1,209.213,121.121)">
            <path d="M0,-16.625C-1.115,-16.625 -2.186,-16.35 -3.211,-15.8C-4.236,-15.249 -5.214,-14.418 -6.148,-13.305C-6.187,-14.706 -6.353,-15.812 -6.648,-16.625L-7.175,-16.625C-8.7,-16.193 -10.191,-15.902 -11.648,-15.75L-11.648,-14.937C-10.7,-14.937 -10.051,-14.835 -9.702,-14.631C-9.353,-14.426 -9.142,-14.123 -9.07,-13.721C-8.998,-13.318 -8.96,-12.174 -8.96,-10.288L-8.96,-5.462C-8.96,-3.483 -9.003,-2.306 -9.089,-1.93C-9.175,-1.554 -9.396,-1.273 -9.751,-1.089C-10.107,-0.904 -10.74,-0.812 -11.648,-0.812L-11.648,0L-3.461,0L-3.461,-0.812C-4.41,-0.812 -5.058,-0.913 -5.407,-1.116C-5.756,-1.319 -5.967,-1.623 -6.04,-2.028C-6.112,-2.434 -6.148,-3.565 -6.148,-5.423L-6.148,-11.977C-5.384,-13.109 -4.571,-13.959 -3.709,-14.525C-2.848,-15.092 -1.945,-15.375 -0.998,-15.375C-0.17,-15.375 0.514,-15.166 1.051,-14.748C1.588,-14.33 1.92,-13.85 2.043,-13.308C2.166,-12.765 2.227,-11.86 2.227,-10.593L2.227,-5.418C2.227,-3.628 2.207,-2.55 2.168,-2.185C2.129,-1.818 1.967,-1.498 1.68,-1.224C1.395,-0.949 0.783,-0.812 -0.152,-0.812L-0.523,-0.812L-0.523,0L7.602,0L7.602,-0.812C6.697,-0.812 6.076,-0.913 5.738,-1.116C5.4,-1.319 5.199,-1.623 5.135,-2.028C5.07,-2.434 5.039,-3.565 5.039,-5.423L5.039,-10.445C5.039,-11.936 4.922,-13.07 4.689,-13.849C4.455,-14.627 3.934,-15.284 3.123,-15.82C2.313,-16.356 1.271,-16.625 0,-16.625" style="fill:rgb(156,28,35);fill-rule:nonzero;"/>
        </g>
        <g transform="matrix(1,0,0,1,222.419,121.121)">
            <path d="M0,-26.875C-0.563,-26.875 -1.044,-26.676 -1.442,-26.278C-1.842,-25.88 -2.041,-25.405 -2.041,-24.854C-2.041,-24.288 -1.842,-23.807 -1.442,-23.409C-1.044,-23.011 -0.563,-22.812 0,-22.812C0.563,-22.812 1.04,-23.011 1.433,-23.409C1.825,-23.807 2.021,-24.288 2.021,-24.854C2.021,-25.405 1.825,-25.88 1.433,-26.278C1.04,-26.676 0.563,-26.875 0,-26.875M1.771,-16.625L1.342,-16.625C0.067,-16.157 -1.727,-15.803 -4.041,-15.562L-4.041,-14.75L-3.519,-14.75C-2.796,-14.75 -2.29,-14.697 -1.999,-14.592C-1.709,-14.486 -1.477,-14.224 -1.303,-13.804C-1.129,-13.383 -1.041,-12.227 -1.041,-10.334L-1.041,-5.445C-1.041,-3.645 -1.064,-2.557 -1.109,-2.183C-1.154,-1.808 -1.315,-1.486 -1.593,-1.217C-1.87,-0.947 -2.467,-0.812 -3.383,-0.812L-4.041,-0.812L-4.041,0L4.584,0L4.584,-0.812L4.171,-0.812C3.331,-0.812 2.748,-0.93 2.42,-1.165C2.092,-1.4 1.902,-1.74 1.85,-2.186C1.797,-2.63 1.771,-3.709 1.771,-5.423L1.771,-16.625" style="fill:rgb(156,28,35);fill-rule:nonzero;"/>
        </g>
        <g transform="matrix(1,0,0,1,236.426,121.559)">
            <path d="M0,-17.063C-2.221,-17.063 -3.855,-16.635 -4.908,-15.782C-5.959,-14.927 -6.484,-14.128 -6.484,-13.385C-6.484,-12.628 -6.09,-12.25 -5.301,-12.25C-4.422,-12.25 -3.879,-12.923 -3.672,-14.27C-3.451,-15.59 -2.367,-16.25 -0.418,-16.25C0.557,-16.25 1.342,-16.054 1.939,-15.662C2.537,-15.269 2.908,-14.824 3.051,-14.326C3.193,-13.828 3.266,-13.023 3.266,-11.911L3.266,-11.125L0.248,-9.895C-2.049,-8.944 -3.85,-7.965 -5.154,-6.959C-6.459,-5.954 -7.109,-4.777 -7.109,-3.431C-7.109,-2.398 -6.721,-1.568 -5.941,-0.941C-5.164,-0.315 -4.236,0 -3.158,0C-2.314,0 -1.357,-0.237 -0.287,-0.709C0.783,-1.18 1.967,-1.881 3.266,-2.813C3.422,-1.881 3.76,-1.18 4.279,-0.709C4.797,-0.237 5.502,0 6.395,0C8.482,0 9.584,-1.104 9.703,-3.313L8.984,-3.313C8.771,-2.063 8.227,-1.438 7.352,-1.438C6.82,-1.438 6.475,-1.653 6.316,-2.083C6.156,-2.512 6.078,-3.482 6.078,-4.993L6.078,-11.458C6.078,-12.825 5.932,-13.84 5.639,-14.504C5.348,-15.168 4.746,-15.76 3.838,-16.282C2.928,-16.802 1.648,-17.063 0,-17.063M-1.549,-1.438C-2.236,-1.438 -2.793,-1.688 -3.219,-2.19C-3.646,-2.691 -3.859,-3.352 -3.859,-4.172C-3.859,-6.243 -2.191,-7.961 1.148,-9.329L3.266,-10.188L3.266,-3.875C2.268,-3.063 1.369,-2.454 0.566,-2.047C-0.236,-1.641 -0.941,-1.438 -1.549,-1.438" style="fill:rgb(156,28,35);fill-rule:nonzero;"/>
        </g>
        <g transform="matrix(1,0,0,1,324.703,183.92)">
            <path d="M0,-17.063C-2.221,-17.063 -3.855,-16.635 -4.908,-15.782C-5.959,-14.927 -6.484,-14.128 -6.484,-13.385C-6.484,-12.628 -6.09,-12.25 -5.301,-12.25C-4.422,-12.25 -3.879,-12.923 -3.672,-14.27C-3.451,-15.59 -2.367,-16.25 -0.418,-16.25C0.557,-16.25 1.342,-16.054 1.939,-15.662C2.537,-15.269 2.908,-14.824 3.051,-14.326C3.193,-13.828 3.266,-13.023 3.266,-11.911L3.266,-11.125L0.248,-9.895C-2.049,-8.944 -3.85,-7.965 -5.154,-6.959C-6.459,-5.954 -7.109,-4.777 -7.109,-3.431C-7.109,-2.398 -6.721,-1.568 -5.941,-0.941C-5.164,-0.315 -4.236,0 -3.158,0C-2.314,0 -1.357,-0.237 -0.287,-0.709C0.783,-1.18 1.967,-1.881 3.266,-2.813C3.422,-1.881 3.76,-1.18 4.279,-0.709C4.797,-0.237 5.502,0 6.395,0C8.482,0 9.584,-1.104 9.703,-3.313L8.984,-3.313C8.771,-2.063 8.227,-1.438 7.352,-1.438C6.82,-1.438 6.475,-1.653 6.316,-2.083C6.156,-2.512 6.078,-3.482 6.078,-4.993L6.078,-11.458C6.078,-12.825 5.932,-13.84 5.639,-14.504C5.348,-15.168 4.746,-15.76 3.838,-16.282C2.928,-16.802 1.648,-17.063 0,-17.063M-1.549,-1.438C-2.236,-1.438 -2.793,-1.688 -3.219,-2.19C-3.646,-2.691 -3.859,-3.352 -3.859,-4.172C-3.859,-6.243 -2.191,-7.961 1.148,-9.329L3.266,-10.188L3.266,-3.875C2.268,-3.063 1.369,-2.454 0.566,-2.047C-0.236,-1.641 -0.941,-1.438 -1.549,-1.438" style="fill:rgb(156,28,35);fill-rule:nonzero;"/>
        </g>
        <g transform="matrix(1,0,0,1,344.705,184.107)">
            <path d="M0,-17.25C-2.277,-17.25 -4.252,-16.437 -5.92,-14.813C-7.59,-13.188 -8.424,-11.07 -8.424,-8.459C-8.424,-5.912 -7.65,-3.865 -6.104,-2.319C-4.557,-0.772 -2.65,0 -0.385,0C3.135,0 5.336,-1.521 6.217,-4.562L5.404,-4.562C4.703,-2.187 3.07,-1 0.504,-1C-1.402,-1 -2.826,-1.709 -3.766,-3.129C-4.705,-4.548 -5.174,-6.514 -5.174,-9.027C-5.174,-11.462 -4.74,-13.285 -3.869,-14.496C-2.998,-15.707 -1.697,-16.312 0.031,-16.312C0.998,-16.312 1.648,-16.164 1.984,-15.868C2.307,-15.571 2.545,-15.049 2.701,-14.302C2.895,-13.309 3.418,-12.812 4.271,-12.812C4.672,-12.812 4.98,-12.954 5.193,-13.238C5.406,-13.522 5.514,-13.826 5.514,-14.149C5.514,-15.015 4.938,-15.748 3.785,-16.349C2.633,-16.949 1.371,-17.25 0,-17.25" style="fill:rgb(156,28,35);fill-rule:nonzero;"/>
        </g>
        <g transform="matrix(1,0,0,1,363.57,183.482)">
            <path d="M0,-16.625C-0.938,-16.625 -1.898,-16.234 -2.883,-15.454C-3.865,-14.673 -4.576,-13.704 -5.012,-12.547C-5.051,-14.238 -5.26,-15.598 -5.637,-16.625C-7.619,-16.015 -9.225,-15.64 -10.449,-15.5L-10.449,-14.687L-10.043,-14.687C-9.217,-14.687 -8.643,-14.565 -8.32,-14.321C-7.998,-14.077 -7.813,-13.735 -7.768,-13.294C-7.723,-12.853 -7.699,-11.762 -7.699,-10.023L-7.699,-5.457C-7.699,-3.586 -7.732,-2.452 -7.797,-2.058C-7.861,-1.662 -8.059,-1.355 -8.387,-1.139C-8.717,-0.921 -9.27,-0.812 -10.043,-0.812L-10.449,-0.812L-10.449,0L-1.949,0L-1.949,-0.812L-2.502,-0.812C-3.344,-0.812 -3.928,-0.93 -4.256,-1.165C-4.586,-1.399 -4.773,-1.739 -4.818,-2.184C-4.865,-2.627 -4.887,-3.704 -4.887,-5.415L-4.887,-8.274C-4.887,-9.71 -4.779,-10.84 -4.561,-11.662C-4.344,-12.484 -3.852,-13.278 -3.084,-14.042C-2.318,-14.806 -1.66,-15.187 -1.109,-15.187C-0.65,-15.187 -0.305,-14.859 -0.074,-14.205C0.266,-13.234 0.764,-12.75 1.42,-12.75C1.787,-12.75 2.098,-12.888 2.354,-13.165C2.609,-13.441 2.738,-13.771 2.738,-14.153C2.738,-14.72 2.494,-15.273 2.006,-15.814C1.518,-16.354 0.848,-16.625 0,-16.625" style="fill:rgb(156,28,35);fill-rule:nonzero;"/>
        </g>
        <g transform="matrix(1,0,0,1,375.133,183.92)">
            <path d="M0,-17.063C-2.221,-17.063 -3.855,-16.635 -4.908,-15.782C-5.959,-14.927 -6.484,-14.128 -6.484,-13.385C-6.484,-12.628 -6.09,-12.25 -5.301,-12.25C-4.422,-12.25 -3.879,-12.923 -3.672,-14.27C-3.451,-15.59 -2.367,-16.25 -0.418,-16.25C0.557,-16.25 1.342,-16.054 1.939,-15.662C2.537,-15.269 2.908,-14.824 3.051,-14.326C3.193,-13.828 3.266,-13.023 3.266,-11.911L3.266,-11.125L0.248,-9.895C-2.049,-8.944 -3.85,-7.965 -5.154,-6.959C-6.459,-5.954 -7.109,-4.777 -7.109,-3.431C-7.109,-2.398 -6.721,-1.568 -5.941,-0.941C-5.164,-0.315 -4.236,0 -3.158,0C-2.314,0 -1.357,-0.237 -0.287,-0.709C0.783,-1.18 1.967,-1.881 3.266,-2.813C3.422,-1.881 3.76,-1.18 4.279,-0.709C4.797,-0.237 5.502,0 6.395,0C8.482,0 9.584,-1.104 9.703,-3.313L8.984,-3.313C8.771,-2.063 8.227,-1.438 7.352,-1.438C6.82,-1.438 6.475,-1.653 6.316,-2.083C6.156,-2.512 6.078,-3.482 6.078,-4.993L6.078,-11.458C6.078,-12.825 5.932,-13.84 5.639,-14.504C5.348,-15.168 4.746,-15.76 3.838,-16.282C2.928,-16.802 1.648,-17.063 0,-17.063M-1.549,-1.438C-2.236,-1.438 -2.793,-1.688 -3.219,-2.19C-3.646,-2.691 -3.859,-3.352 -3.859,-4.172C-3.859,-6.243 -2.191,-7.961 1.148,-9.329L3.266,-10.188L3.266,-3.875C2.268,-3.063 1.369,-2.454 0.566,-2.047C-0.236,-1.641 -0.941,-1.438 -1.549,-1.438" style="fill:rgb(156,28,35);fill-rule:nonzero;"/>
        </g>
    </g>
</svg>
