t_430,t_syr_422,t_syr_611,t_syr_612
ܐܘ,ܕܐܚܛܥܝܢܝܟ̈ܘܐܦܣܘܩܠܫܢܟ܂ܘܒܣܝܦܐܐܫܩܘܠܪܫܟ܂ܘܟܠܒܝܫ̈ܬܐܐܣܒܠܟ܂,,
ܒܪܝܐܡܝܪ,,ܒܪܝܐܡܝܪ,ܒܪܝܐܡܝܪ
ܒܡܬ̈ܠܐܕܥܬܝ̈ܩܐ,,ܗ̄ܘ̣ܒܡ̈ܬܠܐ܂ܡ̇ܢ,ܗ̄ܘܒܡܬ̈ܠܐ܂
ܡܢ,,,ܡܢ
ܕܠܐܫܡܥܒܐܕܢܗ,,ܕܠܐܫܡܥܒܐܕܢܗ,ܕܠܐܫܡܥܒܐܕܢܗ
ܡܫܡܥܝܢܠܗ,,ܡ̣ܢ,ܡ̣ܢ
ܒܣܬܪ,,ܒܣܬܪ,ܒܣܬܪ
ܩܕܠܗ܆ܗܝܕܝܢܐܡܪ,,ܩܕܠܗ,ܩܕܠܗ
,,ܐܫܡܥܘܗܝ܀,ܐܫܡܥܝܘܗܝ܀ܐ܀
,ܘܥܢܐܢܕܢܘܐܡܪ,ܘܥܢܐܢܕܢܘܐܡܪ,ܘܥܢܐܢܕܢܘܐܡܪ
ܠܝ,ܠܝ,ܠܝ܂ܥܠܡܢܐ,ܠܝ܂ܥܠܡܢܐ
ܢܐܕܢܒܝܫܓܕܐܡܛܠܡ̇ܢ,ܚܣܠܟܕܢܗܘܘܢܠܟܒܝ̈ܫܬܐ,,
ܪܓܝܙ,,ܪܓܝܙ,ܪܓܝܙ
ܐܢ̄ܬ,ܐܢ̄ܬ,ܐܢ̄ܬ,ܐܢ̄ܬ
ܥܠܝ܂ܐܡܪܬܠܗܡܛܠܕܚܒܒܬܟܘܝܩܪܬܟܘܪܒܝܬܟܘܥܠܝܬܟܠܕܪܓܐܕܐܝܩܪܐ܂,ܐܝܟܛܝܒ݂ܘܬܟܥܒܕܥܡܝܘܚܣܐܠܝܚܘܒܝ̈ܘܗܘܡܐܕܚܛܝܬܩܕܡܝܟ܂ܕܐܠܗܐܫܒܩܚܘ̈ܒܐܕܚܝܒ̈ܐܘܕܚܛ̈ܝܐܘܡܩܒܠܠܬܝܒ݂̈ܐ܂,ܥܠܝܐܘ,ܥܠܝܐܘ
,,ܐܚܝܩܪ܂,ܐܚܝܩܪ
,,ܐܡܝܪ,ܐܡܝܪ
,,ܒܟܬܒܐ܂,ܒܟܬܒܐ܇
,,ܕܠܐܬܦܪܘܥܒܝܫܬܐ,ܕܠܐܬܦܪܘܥܒܝܫܬܐ
,,ܒܓܘ,ܚܠܦ
,,ܒܝܫܬܐ܀,ܒܝܫܬܐ܀
,,,ܒ܀
,,ܬܘܒܐܡܪܐܚܝܩܪ܂ܒܪܝ,ܬܘܒܐܡܪܐܚܝܩܪ܂ܒܪܝ
,ܐܢܐ,ܐܢܐ,ܐܢܐ
,ܕܝܢܩܒܠܝܢܝܕܐܗܘܐܡܫܡܫܪ̈ܟܫܝܟܘܐܪܥܐܚܙܝܪ̈ܝܟܘܐܚܡܙܒ݂ܠܟ܂ܘܐܢܐܡ̇ܢܐܬܩܪܐܓܒܪܐܒܝܫܐ,ܝܩܪܬܟܘܪܒܝܬܟ܂ܘܩܕܡܟܘܪܣܝܡܠܟܘܬܐ,ܝܩܪܬܟܘܪܒܝܬܟ܂ܘܩܕܡܟܘܪܣܝܡܠܟܘܬܐ
,,ܐܩܝܡܬܟ܂,ܐܩܝܡܬܟ܇
ܘܐܢ̄ܬ,ܘܐܢ̄ܬ,ܘܐܢ̄ܬ,ܘܐܢ̄ܬ
ܕܝܢ,ܓܒܪܐܛܒܐ܆ܐܡܪܬܠܗܓܝܪ,ܕܝܢ,ܕܝܢ
ܣܚܦܬܢܝ,,ܕܚܝܬܢܝ,ܕܚܝܬܢܝ
ܡ̣ܢ,,ܡ̣ܢ,ܡܢ
ܩܝܡܝ,,ܡܘܬܒܝ܂,ܡܘܬܒܝ܂
ܘܪܚܡܬܩܛܠܝ܂ܒܪܡ,,ܘܪܚܡܬܩܛܠܝ܂ܒܪܡ,ܘܪܚܡܬܩܛܠܝ܂ܒܪܡ
,,ܕܝܢ,ܕܝܢ
ܐܠܗܐ,,ܐܠܗܐ,ܐܠܗܐ
ܦܨܢܝܕܝܕܥ,,ܦܨܝܢܝ,ܦܨܝܢܝ
ܕܛܠܝܡ,,ܕܛܠܝܡ,ܕܛܠܝܡ
ܐ̄ܢܐ܂ܘܗܘ̤ܝܘܡܡܟܟ,,ܗ̄ܘܝܬ܂ܡܛܠܕܐܠܗܐܕܚܐ,ܗ̄ܘܝܬ܂ܡܛܠܕܐܠܗܐܕܚܐ
ܠܡܫܩ̈ܠܐ܂,,ܠܡܫܩ̈ܠܐ܂,ܠܡܫܩ̈ܠܐ܂
ܐܘ,,ܘܝܨܦ,ܘܝܨܦ
,,ܕܬܒܝܪܝ,ܕܬܒܝܖ̈ܝ
,,ܠܒܐ܀,ܠܒܐ܀
,,,ܓ܀
ܒܪܝ,ܒܪܝ,ܒܪܝ,ܒܪܝ
ܗܘܝܬܠܝܐܝܟܥܩܪܒܐ,ܥܠܝܡܘܬܢܫܪܐܛܒܐܗ̄ܝܡ̣ܢܥܠܝܡܘܬܥܘܪܒܐܣܪܝܐ܂,ܗܘܝܬܠܝܐܝܟܥܩܪܒܐ,ܗܘܝܬܠܝܐܝܟܥܩܪܒܐ
ܕܢܩܫܬܥܘܩܣܗܒܢܚܫܐ,,ܕܡܚܬܥܘܩܣܗ̇ܒܫܘܥܐ,ܕܡܚܬܥܘܩܣܗ̇ܒܫܘܥܐ
ܘܠܐ,,ܘܠܐ,ܘܠܐ
ܐܪܓܫ܂ܘܡܚܬܗܠܡܚܛܐܗܝܕܝܢܐܡܪܬ,,ܪܓܫ,ܪܓܫ
,,ܒܗ̇܂,ܒܗ̇܆
,,ܘܡܚܬ̤ܒܡܚܛܐ܂ܘܐܡܪܬ̤,ܘܡܚܬ̤ܒܡܚܛܐ܂ܘܐܡܪܬ̤
ܡܚܛܐ,,ܡܚܛܐ,ܡܚܛܐ
ܠܥܩܪܒ݂ܐ,,ܠܥܩ̱ܪܒܐ܂,ܠܥܩܪܒܐ܇
ܗܐ,,ܗܐ,ܗܐ
ܗܘ̤ܐ,,ܥܘ̣ܩܣܝ,
ܥܘܩܣܝ,,,ܥܘܩܣܝ
ܝܬܝܪ,,ܩܫܐܗ̄ܘ,ܩܫܐܗ̄ܘ
ܡ̣ܢ,,ܡ̣ܢ,ܡ̣ܢ
ܕܝܠܟܝ܂ܐܘ,,ܕܝܠܟܝ܀,ܕܝܠܟܝ܀
ܒܪܝ,ܒܪܝ,,܂܂ܕ܂܂
ܗ̄ܘܝܬ,ܐܡܪܘܠܕܐܒܐܐܬܪܚ̄ܩܡ̣ܢܩܪܝܒܘܬܗܕܥܢ̈ܐܕܠܐܬܐܬܐܢܦܬܗܥܠܝܟ܂ܐܡܪܕܝܢܕܐܒܐܠܐܡܬܪܚܩܐ̱ܢܐܒܕܢܦܬܐܓܝܪܕܥܢܐܣܡܐܗ̄ܝܠܥܝܢܝ̈܂ܒܪܝܐܥܠܘܗܝܕܐܒܐܠܘܬܣܦܪ̈ܐܕܢܐܠܦܣܦܪܐܐܡܪܗܟܝܠܡܠܦܢܐܐܡܪܐܠܦܒܝܬ܂ܥܢܐܕܝܢܕܐܒܐܘܐܡܪܐܡܪܐܓܕܝܐܐܟܡܐܕܒܟܪܣܝ܂,ܒܪܝܗܘܝܬܠܝܗܟܝܠܐܝܟܐ̄ܢܫܕܫܩܠܟܐܦ̈ܐܕܢܪܓܘܡ,ܒܪܝܗܘܝܬܠܝܗܟܝܠܐܝܟܐ̄ܢܫܕܫܩܠܟܐܦ̈ܐܕܢܪܓܘܡ
,,ܠܐܠܗܐ܂,ܠܐܠܗܐ܇
,,ܘܟܐܦܘ̈ܗܝܠܐ,ܘܟܐܦܘ̈ܗܝܠܐ
,,ܡܬܡܢܥܝܢ܂,ܡܬܡܢܥܝܢ܇
,,ܘܡܩܕܐܠܗܚܛܗܐ,ܘܡܩܕܐܠܗܚܛܗܐ
,,ܪܒܐ܀,ܪܒܐ܀ܗ܀
,,ܒܪܝܗܘܝܬ,ܒܪܝܗܘܝܬ
ܠܝ,,ܠܟ,ܠܝ
ܐܝܟܥܙܐܕܩܡܬܥܠ,,ܐܝܟܥܙܐܕܩܡܬܥܠ,ܐܝܟܥܙܐܕܩܡܬܥܠ
ܥܣܒܐ,,ܥܣܒܐ,
ܕܦܘܬܐ,,ܕܦܘܬܐ,ܕܦܘܬܐ
,,,ܥܣܒܐ
,,ܕܬܐܟܘܠܝ,
ܕܬܐܟܘܠ,,,ܕܬܐܟܘܠ
ܡܢܗ,,ܡܢܗ܂,ܡܢܗ܂
ܐܡܪܬܦܘܬܐ,,ܐܡܪܬܦܘܬܐ,ܐܡܪܬܦܘܬܐ
ܠܥܙܐܡܛܠܡ̇ܢܐܟܠܬܝ܂ܡܢܝܕܡܫܟܟܝ,,ܠܥܙܐ܂ܠܡܢܐ,ܠܥܙܐ܂ܠܡܢܐ
,,ܐܟܠܐܐܢ̄ܬܝܡܢܝ܂,ܐܟܠܬܝܡܢܝ܆
,,ܕܓܠܕܟܝ,ܕܓܠܕܟܝ
ܒܝ,,ܒܝ,ܒܝ
ܡܨܛܒܥ܂ܦܢܝܬ,,ܨܒܥܝܢܠܗ܂ܐܡܪܬܕܝܢ,ܨܒܥܝܢܠܗ܂ܐܡܪܬܕܝܢ
ܥܙܐ,,ܥܙܐ,ܥܙܐ
ܘܐܡܪܬܟܕܒܚܝ̈ܐܐܝܬܝ,,ܒܚܝ̈ܝ,ܒܚܝܝ
,,ܡܢܟܝ,ܡܢܟܝ
ܐܟܠܐ,,ܐܟܠܐ,ܐܟܠܢܐ܂
ܡܢܟ܂ܘܟܕܐܡܘܬܝܡܦܩܝܥܩܪܟܘܨܒܥܝܢ,,ܐ̄ܢܐ܂,
,,ܘܒܡܘܬܝ,ܘܒܡܘܬܝ
,,ܒܥܢ̈ܩܟܝܓܠܕܝܡܨܛܒܥܢܐ܀,ܒܥܢܩܟܝ
ܡܫܟܝ,,,ܡܫܟܝ
ܒܗ܂ܐܘ̇,,,ܡܨܬܒܥܐܐ̄ܢܐܓܠܕܝ܀ܘ܀
ܒܪܝ,ܒܪܝ,ܒܪܝ,ܒܪܝ
ܗܘܝܬܠܝܐܝܟ,ܡ̣ܢܙܒܢܐܕܐܠܦܬܟ,ܗܘܝܬܠܝܐܝܟ,ܗܘܝܬܠܝܐܝܟ
ܐ̄ܢܫܐܕܢܣܒܟܐ̈ܦܐܕܢܪܓܘܡܠܐܠܗܐ܂ܘܟܐ̈ܦܐ,,ܐ̄ܢܫܕܚܙܐܟܢܬܗܕܡ̣ܢ,ܐ̄ܢܫܕܚܙܐܟܢܬܗܕܡ̣ܢ
ܠܐ,ܠܐ,,
ܡܛܝܢܒܪܡܗܦ̈ܟܢܥܠܘܗܝܘܐܦܩܢܐܚܛܝܬܐ܂ܐܘ̇ܒܪܝܗܘܝܬܠܝܐܝܟܓܒܪܐܕܪܥܠܡܢ,ܐܡܪܗ̄ܘܝܬܠܟܕܐܠܗܐܫܠܝܛܐܗَܘ̣ܘܕܝܢܐܬܪܝܨܐܕܥܒܕܝܢܓܝܪܛܒܬܐܦܪܥܠܗܘܢܒܛܒܬܐܘܕܥܒܕܝܢܒܝܫܬܐܦܪܥܠܗܘܢܒܒܝܫܬܐܘܣܐܡܒܪܫܗܘܢܓܗܢܐܘܫܘܢܩܐܒܪܠܝܬܒܝܢܝܘܠܟܣܛܪܡ̣ܢܐܠܗܐܫܠܝܛܐܗ̄ܘܕܝܢܕܢܦܪ̱ܥܟ,,
ܩܘܪܫܐ,,ܩܘܪܫܐ,ܩܘܪܫܐ
ܘܐ̄ܚܪܢܐܢܣܟܥܠܘܗܝܩܘܠܬܐܕܡܝ̈ܐ܂ܐܘ,,ܪܥܠ܂ܫܩܠܡܝ̈ܐܘܢܣܟܒܪܫܗ܀,ܪܥܠ܂ܫܩܠܡܝ̈ܐܘܢܣܟܒܪܫܗ܀
,,ܒܪܝܗܘ̇ܝܬ,ܙ܀
ܒܪܝ,,,ܒܪܝ
ܬܗܘܐ,,,ܗܘܝܬ
ܝܕܥ,,ܝܕܥ,ܝܕܥ
ܐܢܗܘܕܢܐܪܟܕܘܢܒܐܕܟܠܒܐ,,ܕܐܢܢܐܪܟ,ܕܐܢܢܐܪܟ
,,ܕܘܢܒ̇ܗ,ܕܘܢܒܗ
,,ܕܚܙܝܪܐ,ܕܚܙܝܪܐ
ܫܒܥ,,ܫܒ̣ܥ,ܫܒܥ
ܐܡ̈ܝܢܒܕܘܟܬܐܕܣܘܣܝܐ,,ܐܡ̈ܝܢ܂,ܐܡ̈ܝܢ܂
ܠܐ,,ܠܐ,ܠܐ
ܩܐܡ܆ܘܐܦܢ,,ܩܐܡܒܕܘܟܬܣܘܣܝܐ܂ܘܐܦܠܐܐܢ,ܩܐܡܒܕܘܟܬܣܘܣܝܐ܂ܘܐܦܠܐܐܢ
ܢܗܘܐܣܥܪܗܪܟܝܟ,,ܢܗܘܐܣܥܪܗܪܟܝܟ,ܢܗܘܐܣܥܪܗܪܟܝܟ
ܡ̣ܢܙܚܘܪܝܬܐ܂ܐܘ,ܐܝܟ,ܐܝܟ,ܐܝܟ
,ܥܒܕܝܟ̈܂,ܬܟ̱ܠܬܐ܀,ܬܟܠܬܐ܀ܚ܀
ܒܪܝ,ܒܪܝ,ܒܪܝ,ܒܪܝ
ܐܢܐܐܡܪܬ,ܪܫܗܓܝܪܕܚܡܪܐܣܡܘܗܝܥܠܦܬܘܪܐܘܢܦܠܘܐܬܓܢܕܪܥܠܐܪܥܐܐܡܪܘ,ܐܢܐܐܡܪܬ,ܐܢܐܐܡܪܬ
ܬܩܘܡܒܕܘܟܬܝ,,ܕܐܢ̄ܬܬܗܘܐܚܠܦܝ܂ܘܬܐܚܘܕܕܘܟܬܝ܂,ܕܐܢ̄ܬܬܗܘܐܚܠܦܝ܂ܘܬܐܚܘܕܕܘܟܬܝ܂
ܘܬܩܢܐ,,ܘܬܩܢܐ,ܘܬܩܢܐ
ܝܘܠܦܢܝ܂,,ܝܘܠܦܢܝ̈ܘܗܘܦܟܝ̈,ܝܘܠܦܢܝ̈ܘܗܘܦܟܝ̈
,,ܟܠܗܘܢ܁,ܟܠܗܘܢ܂
ܐܢ̄ܬ,,ܐܢ̄ܬ,ܐܢ̄ܬ
ܕܝܢ,ܕܝܢ,ܗܟܝܠܠܝܘܠܦܢܝ̈ܠܐܩܒܠܬ̇ܘܠܡ̈ܠܝܠܐ,ܗܟܝܠܠܝܘܠܦܢܝ̈ܠܐܩܒܠܬ̇ܘܠܡ̈ܠܝܠܐ
ܣܢܝܬܡܪܕܘܬܝܘܠܐܫܡܥܬܡܠܬܝܘܠܐܕܚܠܬ,,ܫܡܥܬ݁܂,ܫܡܥܬ܂
,,ܘܠܐ,ܘܠܐ
ܠܐܠܗܐ,,ܠܐܠܗܐ,ܠܐܠܗܐ
ܘܠܐ,,,
,,ܐܟܫܪܬ܂ܘܠܐ,ܐܟܫܪܬ܂ܘܠܐ
,,ܗܘ̣,ܗܘ
ܫܡܥ,,ܫܡܥ,ܫܡܥ
ܩܠܟ܂ܐܘ̇,,ܩܠܟ܀,ܩܠܟ܀
,,ܒܪܝܗܘܝܬܠܝܐܝܟ,ܛ܀
ܒܪܝ,,,ܒܪܝ
ܗܘ̇ܝܬܠܝܐܝܟܐܪܝܐܕܚܙܐܚܡܪܐ,,,ܗܘܝܬܠܝܐܝܟ܂
,,ܐܪܝܐܕܐܪܥ,ܐܪܝܐܕܐܪܥ
,,ܚܡ̣ܪܐ,ܚܡܪܐ܇
ܒܥܕܢ,,ܒܥܕܢ,ܒܥܕܢ
ܨܦܪܐ,,ܨܦܪܐ܂,ܨܦܪܐ܂
ܘܐܡܪ,,ܘܐܡܪ,ܘܐܡܪ
,,ܓܝܪܐܪܝܐ,ܓܝܪܐܪܝܐ
,,ܠܚܡܪܐ܂,ܠܚܡܪܐ܇
ܫܠܡ,,ܫܠܡ,ܫܠܡ
ܠܟܐܚܝ܂ܗܘ̤,,ܗ̄ܘܡܐܬܝܟ܂,ܗ̄ܘܡܐܬܝܟ܂
,,ܐܡ̣ܪ,ܐܡܪ
,,ܕܝܢ,ܕܝܢ
ܚܡܪܐ,,ܚܡܪܐ,ܚܡܪܐ
ܦܢܝ,,,
ܫܠܡܟ,,ܫܠܡܟ,ܫܠܡܟ
ܗܢܐܢܐܬܐ,,ܢܦ̮ܓܥܗ̄ܘ̣ܐ,ܢܦܓܥܗ̄ܘܐ
ܥܠ,ܥܠ,ܒܗܘ,ܒܗܘ
ܡ̇ܢ,ܢܦܫܗܗܘܐܬܚܡܬ,,
ܕܐܣܪܢܝ,,ܕܐܣܪܢܝ,ܕܐܣܪܢܝ
ܗܪܟܐܒܥܕܢ,,ܒܙܒܢ,ܒܙܒܢ
ܪܡܫܐ܂,,ܪܡܫܐ܂,ܪܡܫܐ܂
ܛܒܗ̄ܘܐܠܝ,,ܘܠܘܝܠܐܚܙܝܬܦܪܨܘܦܟ܀,ܘܠܘܝܠܐܚܙܝܬܦܪܨܘܦܟ܀
ܕܠܐ,ܕܠܐ,,ܝ܀
ܐܚܙܐܐܦܝ̈ܟ܂ܐܘܒܪܝܗ̤ܘܝܬ,ܢܩܒܠܪܘܡܪܡܐ܂ܘܐܝܩܪܐܒܪܝܐܫܬܪܪܬܓܝܪܡܠܬܐܕܐܡܝܪܐܕܝܠܕܬܝܗܝܩܪܝܘܗܝܒܪܟܘܕܪܒܝܬܝܗܝܕܝܢܩܪܝܘܗܝܥܒܕܟܒܪܝܝܬ݁ܝܪܡܢܗܕܐܡܠܬܐܕܫܪܝܪܐܠܝܬܐܢܕܝܢܒܪܚܬܟܗ̄ܘܒܐܣܬܐܫܩܦܝܗܝ܂ܘܥܠܐܪܥܐܫܕܝܘܗܝܘܕܝܕܥܓܝܪܟܣ̈ܝܬܐܐܠܗܐܗ̄ܘ̣܂ܘܦܪܥܠܟܠܢܫܐܝܟܦܘܠܚܢܗ,ܒܪܝܗَܘܝܬ,ܒܪܝܗَܘܝܬ
ܠܝܐܝܟܦܚܐ,,ܠܝܐܝܟܦܚܐ,ܠܝܐܝܟܦܚܐ
ܕܢܨܝܒܥܠܩܩܠܬܐܘܐܡܪܬܠܗ,,ܕܥܠܙܒܠܐ܂ܐܡܪܬܠܗ̇,ܕܥܠܙܒܠܐ܂ܐܡܪܬܠܗ̇
ܨܦܪܐܡܢܐ,,ܨܦܪܐܡܢܐ,ܨܦܪܐܡܢܐ
ܥܒܕܬ,,ܥܒܕܐܐܢ̄ܬ,ܥܒܕܐܐܢ̄ܬ
ܗܪܟܐ,,ܗܪܟܐ,ܗܪܟܐ
܂ܐܡܪܦܚܐܡܨܠܢܐܠܐܠܗܝ܂ܘܐܡܪܬ,,ܦܚܐ܂,ܦܚܐ܁
,,ܐܡܪܓܝܪܦܚܐܡܨܠܐܐ̄ܢܐܠܐܠܗܐܡܪܝܡܐ܂ܐܡܪܬܬܘܒ,ܐܡܪܓܝܪܦܚܐܡܨܠܐܐ̄ܢܐܠܐܠܗܐܡܪܝܡܐ܂ܐܡܪܬܬܘܒ
,,ܨܦܪܐܘܡܢ̇ܘܗܢܐ,ܘܡܢܘ
ܗܢܐ,,,ܗܢܐ
ܡܢܘ,,,ܕܣܡܝܟܐܐܢ̄ܬܝ
ܕܣܡܝܟܐܢ̄ܬ,,ܕܣܡܝܟܐܢ̄ܬ,
ܥܠܘܗܝ܂,,ܥܠܘܗܝ܂,ܥܠܘܗܝ܂
ܐܡܪܦܚܐ,,ܐܡܪܬܦܚܐ܂,ܐܡܪܦܚܐ
ܗܢܐ,,,
ܚܘܛܪܝ,,ܚܘܛܪܝ,ܚܘܛܪܝ
ܗ̄ܘ̤,,ܗ̄ܘ,ܐܝܬܘܗܝ
ܕܡܣܬܡܟܐ̄ܢܐ,,ܕܡܣܬܡܟܐ̄ܢܐ,ܕܡܣܬܡܟܐ̄ܢܐ
ܥܠܘܗܝܒܥܕܢܨܠܘܬܐ܂,,ܒܗܒܨܠܘܬܐ܂,ܒܗܒܨܠܘܬܐ܂
ܘܐܡܪܬ,,ܘܐܡ̣ܪܬ,ܘܐܡܪܬ
ܨܦܪܐ,,ܨܦܪܐ܂ܘܡܢܘܗܢܐ,ܨܦܪܐ܂ܘܡܢܘܗܢܐ
,,ܕܒܦܘܡܟ܂ܐܡܪ,ܕܒܦܘܡܟ܂ܐܡܪ
,,ܦܚܐ܂,ܦܚܐ܂
ܗܢܐ,,ܗܢܐ,ܗܢܐ
ܡܢܘ,,ܡܐܟܠܐ,ܡܐܟܠܐܐ
ܗ̄ܘ,,ܗ̄ܘ,ܗ̄ܘ
ܕܒܦܘܡܟ܂ܐܡܪ,,,
,,ܘܡܫܬܝܐܕܐܝܠܝܢܕܨܝܒܝܢ,ܘܡܫܬܝܐܕܐܝܠܝܢܕܨܝܒܝܢ
ܦܚܐܗܢܐܐܘܟܠܐܗ̄ܘܠܕܡܣܬܩܒܠܝܢ,,,
ܠܘܬܝ܂,,ܠܘܬܝ܂,ܠܘܬܝ܂
,,ܨܦܪܐܕܝܢ,ܨܦܪܐܕܝܢ
ܐܡܪܬ,,ܐܡܪܬ,ܐܡܪܬ
ܐܩܕܡ܂ܘܐܟܘܠ܂ܐܡܪܐܟܘܠ܂ܘܟܕܩܪܒܬ,,ܡܕܝܢܐܦܐܢܐ,ܡܕܝܢܐܦܐܢܐ
,,ܩܪܒܢܐ,ܩܪܒܐܐ̄ܢܐ
,,ܘܐܟܠܢܐ܂ܐܡܪܦܚܐ,ܘܐܟܠܢܐ܂ܐܡܪܦܚܐ
,,ܐܡܪܩܕܡܝ܂,ܩܪܘܒܝ܂
,,ܘܩܪܒܬ̤,ܘܩܪܒܬ̤
ܨܦܪܐ,,ܨܦܪܐ,ܨܦܪܐ
ܐܚܕ,,ܕܬܐܟܘܠܝ,ܕܬܐܟܘܠܝ
,,ܘܐܚܕܗ̇,ܘܐܚܕܬܗ̇
ܦܚܐ,,ܦܚܐ,ܦܚܐ
ܒܩܕܠܗ̇܂ܦܢܝܬ,,ܒܨܘܪܗ܂ܗܝܕܝܢܥܢܬܨܦܪܐ,ܒܨܘܪܗ܂ܗܝܕܝܢܥܢܬܨܦܪܐ
ܘܐܡܪܬܠܦܚܐ܂,,ܘܐܡܪܬܠܦܚܐ܂,ܘܐܡܪܬܠܦܚܐ܂
ܐܢ,ܐܢ,ܐܢܗܘܕܠܚܡܟ,ܐܢܗܘܕܠܚܡܟ
ܡ̇ܢ,ܛܒܬܐܘܐܢܒܝܫܬܐ܂ܘܗܘ̤ܢܕܘܢܒܝܢܝܘܠܟ܂ܐܢܐܗܟܝܠܡܟܝܠ,,
ܗܢܐ,,ܗܢܐ,ܗܢܐ
ܗ̄ܘܠܚܡܟ,,,ܠܟܦܢ̈ܐܗ̄ܘ܇
ܠܟܦ̈ܢܐ,,ܠܟܦ̈ܢܐ,
,,ܗ̄ܘ܂,
ܠܐ,ܠܐ,ܠܐ,ܠܐ
ܢܩܒܠܐܠܗܐ,ܐܡ̇ܪܐ̄ܢܐܡܕܡܒܪܡܡܪܝܐܦܪܥܐܟܡܐܕܫܘܐܐܢ̄ܬ݁܂,ܢܩܒܠܐܠܗܐ,ܢܩܒܠܐܠܗܐ
ܙܕܩܬܟ܂ܘܐܢܬܘܒ,,ܙܕܩ̈ܬܟ܂,
,,ܘܐܢܗܘܕܨܘܡܟ,ܘܐܢܗܘܕܨܘܡܟ
ܗܢܐ,,ܗܢܐ,ܗܢܐ
ܗ̄ܘ̣,,ܘܨܠܘܬܟܠܐܠܗܐ,ܘܨܠܘܬܟܠܐܠܗܐ
,,ܗ̄ܘ̣܂,ܗ̄ܘ̣܆
,,ܠܐ,ܠܐ
,,ܢܩܒܠ,ܢܩܒܠ
ܨܘܡܟ,,ܨܘܡܟ,ܨܘܡܟ
ܘܨܠܘܬܟ܂,,ܘܐܦܠܐ,ܘܐܦܠܐ
ܠܐ,,,
,,ܨܠܘ̈ܬܟ܂,ܨܠܘܬܟ̈܇
ܢܫܡܥ,,,
ܐܠܗܐ,,,
ܨܠܘܬܟ܂,,,
ܘܠܐܢܫܠܡ,,ܘܠܐܢܫܠܡ,ܘܠܐܢܫܠܡ
,,ܐܠܗܐ,ܐܠܗܐ
,,ܥܡܟ,ܥܡܟܝ
,,ܒܛܒܬܐ܀,ܒܛܒܬܐ܀
,,,ܝܐ܀
,,ܒܪܝܗܘܝܬܠܝܐܝܟܩܠܡܐܕܗܘܝܐ,ܒܪܝܗܘܝܬܠܝܐܝܟܩܠܡܐܕܗܘܝܐ
,,ܒܚ̈ܛܐ܂,ܒܚܛ̈ܐ܆
,,ܘܠܐܡܘܬܪܐ,ܘܠܐܡܘܬܪܐ
,,ܡܕܡ܂,ܡܕܡ܆
,,ܐܠܐܡܚܒܠܘܡܚܒܠܐ܀,ܐܠܐܡܚܒܠܘܡܚܒܠܐ܀
,,,ܝܒ܀
,,ܒܪܝܗܘܝܬܠܝܐܝܟܟܠܒܐ,ܒܪܝܗܘܝܬܠܝܐܝܟܟܠܒܐ
,,ܕܡ̣ܢ,ܕܡܢ
,,ܩܘܪܐܥܠܠܒܝܬܐܠܡܫܚܢ܂ܘܟܕ,ܩܘܪܐܥܠܠܒܝܬܐܠܡܫܚܢ܂ܘܟܕ
,,ܫܚܢ܂,ܫܚܢ܇
,,ܫܪܝܢܒܚܥܠܒܢܝ̈ܒܝܬܐ܀,ܫܪܝܢܒܚܥܠܒܢܝ̈ܒܝܬܐ܀
,,,ܝܓ܀
,,ܒܪܝܗܘܝܬܠܝܐܝܟܚܙܝܪܐܕܐܙܠܥܡ,ܒܪܝܗܘܝܬܠܝܐܝܟܚܙܝܪܐܕܐܙܠܥܡ
,,ܪ̈ܘܪܒܢܐܠܒ̈ܢܐ,ܪܘܪ̈ܒܢܐܠܒܢ̈ܐ
,,ܕܢܣܚܐ܂ܘܟܕܣܚܐ,ܕܢܣܚܐ܂ܘܟܕܣܚܐ
,,ܘܢܦ̣ܩܡ̣ܢܒܢܐ܂,ܘܢܦܩܡܢܒܠܢܐ܂
,,ܐܫܟܚܣܝܢܐܘܐܬܓܪܓܚܒܗ܀,ܐܫܟܚܣܝܢܐܘܐܬܓܪܓܚܒܗ܀
,,,ܝܕ܀
,,ܒܪܝܟܠܒܐܐܝܢܐܕܠܐܡܬܐ̱ܟܠܡ̣ܢ,ܒܪܝܟܠܒܐܐܝܢܐܕܠܐܡܬܐ̱ܟܠܡ̣ܢ
,,ܨܝܕܗ܂,ܨܝܕܗ
,,ܡܐܟܠܐܕܕܐܒܐܢܗܘܐ܀,ܡܐܟܠܐܕܕܐܒܐܢܗܘܐ܀
,,,ܝܗ܀
,,ܒܪܝܐܝܕܐܕܠܐܦܠܚܐ,ܒܪܝܐܝܕܐܕܠܐܦܠܚܐ
,,ܘܡܘܬܪܐ܁,ܘܡܘܬܪܐ
,,ܡܬܩܛܥܐ܀,ܡܬܩܛܥܐ܀
,,,ܝܘ܀
,,ܒܪܝܥܝܢܐܕܕܝܩܐܠܡܕܡܢܚܨܘܢܗ̇܀,ܒܪܝܥܝܢܐܕܕܝܩܐܠܡܕܡܢܚܨܘܢܗ̇܀
,,,ܝܙ܀
,,ܒܪܝܐܢܐܦܪܨܘܦ,ܒܪܝܐܢܐܦܪܨܘܦ
,,ܡܠܟ̇ܐ,ܡܠܟܐ
,,ܚܘܝܬܟ܂ܘܠܐܝܩܪܐܪܒܐ,ܚܘܝܬܟ܂ܘܠܐܝܩܪܐܪܒܐ
,,ܡܢܥܬܟ,ܡܥܠܬܟ
,,ܘܪܒܝܬܟ܂ܘܚܠܦܛܒܬܐܦܪܥܬܢܝܒܝܫܬܐ܂ܕܥܒܕ,ܘܪܒܝܬܟ܂ܘܚܠܦܛܒܬܐܦܪܥܬܢܝܒܝܫܬܐ܂ܕܥܒܕ
ܥܡܟ,,,ܥܡܟ
ܒܛܒܬܐ܂ܐܘܒܪܝ,,ܒܝܫܬܐ,ܒܝܫܬܐ
,,ܥܡܟ,
,,ܡܢܐ,ܡܢܐ
,,ܬܦܪܥܝܘܗܝ܀,ܬܦܪܥܝܘܗܝ܀ܝܚ܀
,,ܒܪܝܗܘܝܬܠܝܐܝܟܟܟܘܫܬܐ܂ܐܡܪܘ,ܒܪܝܗܘܝܬܠܝܐܝܟܟܟܘܫܬܐ܂ܐܡܪܘ
,,ܠܗ̇,ܠܗ
,,ܓܝܪܐܪܦܝܡܢܟܝܓܢܒܘܬܐܘܢܥܒܕܠܟܝܡܠܟܐܗܡܢܝܟܐܡܢܕܗܒܐ܂ܐܡܪܬܕܝܢܐܢܐܐܘܡܢܘܬܐܒܝܘܐܡܝܠܐܫܒܩܐ,ܓܝܪܐܪܦܝܡܢܟܝܓܢܒܘܬܐܘܢܥܒܕܠܟܝܡܠܟܐܗܡܢܝܟܐܡܢܕܗܒܐ܂ܐܡܪܬܕܝܢܐܢܐܐܘܡܢܘܬܐܒܝܘܐܡܝܠܐܫܒܩܐ
,,ܐܢܐ܀,ܐ̄ܢܐ܀ܝܛ܀
,,ܒܪܝܐܢܐܟܠܡܐܟܠܐܒܣܝܡܐܐܘܟܠܬܟ܂,ܒܪܝܐܢܐܟܠܡܐܟܠܐܒܣܝܡܐܐܘܟܠܬܟ܂
,,ܘܐܢ̄ܬ̇,ܘܐܢ̄ܬ
,,ܕܝܢܠܚܡܐܒܨܝܪܐܠܐܣܒܥܬܢܝ܂ܘܐܢܐܛܡܝܪ,ܕܝܢܠܚܡܐܒܨܝܪܐܠܐܣܒܥܬܢܝ܂ܘܐܢܐܛܡܝܪ
,,ܘܡܚܦܝ܂ܘܐܢ̄ܬ̇,ܘܡܚܦܝ܆ܘܐܢ̄ܬ
,,ܫܬܐܚܡܪ̈ܢܐ,ܫܬܐܚܡܪ̈ܢܐ
,,ܘܠܢܫ̈ܝ,ܘܠܢܫܝ̈
,,ܕܪܒܝܘܟܨܒܐ,ܕܪܒܝܘܟܨܒܐ
,,ܗ̄ܘ̇ܝܬ,ܗ̄ܘܝܬ
,,ܠܒܝܫܘܬܟ܀,ܠܒܝܫܘܬܟ܀
,,,ܟܟ܀
,,ܒܪܝܪܒܝܬܟܐܝܟܐܪܙܐ,ܒܪܝܪܒܝܬܟܐܝܟܐܪܙܐ
,,ܦܐܝܐ܂ܘܐܢ̄ܬ̇,ܦܐܝܐ܆ܘܐܢ̄ܬ
,,ܐܡܟܬܢܝ܂ܘܠܚܦܪܐ,ܐܡܟܬܢܝ܂ܘܠܚܦܪܐ
,,ܐܚܬܬܢܝܒܣܘܓܐܬ,ܐܚܕܬܢܝܒܣܘܓܐ̈ܬ
,,ܢܫܒܝ̈ܟ܀,ܢܫܒܝ̈ܟ܀
,,,ܟܐ܀
,,ܒܪܝܐܢܐܣܒܪܗ̄ܘܝܬܕܒܢܝܬܠܝܡܓܕܠܐܚܣܝܢܐܕܐܣܬܬܪܒܗܡ̣ܢܒܥܠܕܒܒܝ̈ܘܡܪܝܐܦܨܢܝܡܢܗ܂ܒܕܐܢܐܒܥܝܬܠܟܛܒ̈ܬܐܘܐܢ̄ܬܦܪܥܬܢܝܒ̈ܝܫܬܐ܂,ܒܪܝܐܢܐܣܒܪܗ̄ܘܝܬܕܒܢܝܬܠܝܡܓܕܠܐܚܣܝܢܐܕܐܣܬܬܪܒܗܡ̣ܢܒܥܠܕܒܒܝ̈ܘܡܪܝܐܦܨܢܝܡܢܗ܂ܒܕܐܢܐܒܥܝܬܠܟܛܒ̈ܬܐܘܐܢ̄ܬܦܪܥܬܢܝܒ̈ܝܫܬܐ܂
,,ܒܥܢܐ,ܒܥܐ
,,ܗܟܝܠܕܐܚܛ,ܗܟܝܠܕܐܚܛ
,,ܥܝܢ̈ܝܟܘܐܦܣܘܩܠܫܢܟ܂ܘܒܣܝܦܐ,ܥܝܢܝ̈ܟܘܐܦܣܘܩܠܫܢܟ܆ܘܒܣܝܦܐ
,,ܐܣܒ,ܐܣܒ
,,ܪܫܟ܀,ܪܫܟ܀ܟܒ܀
,,ܘܥܢܐ,ܘܥܢܐ
,,ܢܕܢ,
,,ܘܐܡܪ,ܘܐܡܪ
,,ܠܐܚܝܩܪ܂,
,,ܚܣܠܟ,ܚܣܠܟ
,,ܕܢܗܘܝ̈ܢ,ܕܢܗ̈ܘܝܢ
,,ܡܢܟ,ܡܢܟ
,,ܒܝܫ̈ܬܐ,ܒ̈ܝܫܬܐ
,,ܐܠܐܐܢܛܒ̈ܬܐ܂ܘܐܝܟ,ܐܠܐܐܢܛܒ̈ܬܐ܂ܘܐܝܟ
,,ܛܝܒܘ̈ܬܟ,ܛܝܒ̈ܘܬܟ
,,ܥܒܕܥܡܝ܂ܘܫܒܘܩܠܝ,ܥܒܕܥܡܝ܂ܘܫܒܘܩܠܝ
,,ܟܠܡܐ,ܟܠܡܐ
,,ܕܩܕܡܬ,ܕܩܕܡܬ
,,ܘܐܡܪܬ܂,ܘܐܡܪܬ܆
,,ܡܛܠܕܠܐܠܗܐܐܪܓܙܬ,ܡܛܠܕܠܐܠܗܐܐܪܓܙܬ
,,ܒܚܛܗ̈ܝ܂,ܒܚܛܗܝ̈܂
,,ܘܒܐܡܝܢܘܕܝܢܡܩܒܠ,ܘܒܐܡܝܢܘܕܝܢܡܩܒܠ
,,ܠܬܝ̈ܒܐܘܠܕܚ̈ܛܝܢ܂,ܠܬܝܒ̈ܐܘܠܕܚܛܝܢ܂
,,ܐܢ̄ܬܕܝܢܩܒܠܝܢܝܕܐܗܘܐܡܫܡܫܪܟܫܟܘܐܪܥܐܠܚܙܝܪ̈ܝܟ܂ܘܐܚܡ,ܐܢ̄ܬܕܝܢܩܒܠܝܢܝܕܐܗܘܐܡܫܡܫܪܟܫܟܘܐܪܥܐܠܚܙܝܪ̈ܝܟ܂ܘܐܚܡ
,,,ܘܐܢܐ
,,ܡܢܐܬܩܪܐܓܒܪܐ,ܡܢܐܬܩܪܐܓܒܪܐ
,,ܒܝܫܐ܂ܘܐܢ̄ܬ,ܒܝܫܐ܇ܘܐܢ̄ܬܕܝܢ
,,ܓܒܪܐܛܒܐ܀,ܓܒܪܐܛܒܐ܀
,,,ܟܓ܀
,,ܬܘܒܐܡܪܠܗܐܚܝܩܪܒܪܝܢܕܢ܂ܥܠܝܡܘܬܢܫܪܐܛܒܐܗ̄ܝܡ̣ܢܥܠܝܡܘܬܥܘܪܒܐܣܪܝܐ܀,ܬܘܒܐܡܪܠܗܐܚܝܩܪܒܪܝܢܕܢ܂ܥܠܝܡܘܬܢܫܪܐܛܒܐܗ̄ܝܡ̣ܢܥܠܝܡܘܬܥܘܪܒܐܣܪܝܐ܀
,,,ܟܕ܀
,,ܒܪܝ,ܒܪܝ
,,ܐܡ̣ܪܘ,ܐܡܪܘ
,,ܠܕܐܒܐܐܬܪܚܩ,ܠܕܐܒܐܐܬܪܚܩ
,,ܡ̣ܢܩܪܝܒܘܬܗ̇,ܡܢܩܪܝܒܘܬܗ
,,ܕܥܢ̈ܐܕܠܐܬܐܬܐ,ܕܥܢ̈ܐܕܠܐܬܐܬܐ
,,ܢܦܬܗ̇,ܢܦܬܗ
,,ܥܠܝܟ܂ܐܡܪ,ܥܠܝܟ܂ܐܡܪ
,,ܓܝܪܕܐܒܐܠܐܡܬܪܚܩ,ܕܐܒܐܠܐܪܚܩ
,,ܐ̄ܢܐ܂,ܐ̄ܢܐ܂
,,ܒܕܢܦܬܐܓܝܪܕܥ̈ܢܐ,ܒܕܢܦܬܗ̇ܕܥܢܐ
,,ܣܡܐܗ̄ܝܠܥܝ̈ܢܐܕܝܠܝ܀,ܣܡܐܗ̄ܝܠܥܝ̈ܢܐܕܝܠܝ܀
,,,ܟܓ܀
,,ܒܪܝܐܥܠܘܗܝܠܕܐܒܐܠܘܬܣܦܪܐ,ܒܪܝܐܥܠܘܗܝܠܕܐܒܐܠܘܬܣܦܪܐ
,,ܕܢܐܠܦ܂,ܐܝܟܢܐܕܢܐܠܦ܇
,,ܐܡܪܠܗܣܦܪܐܡܠܦܢܐ܂ܐܡܪܐܠܦ,ܐܡܪܠܗܣܦܪܐܡܠܦܢܐ܂ܐܡܪܐܠܦ
,,ܒܝܬ܂,ܒܝܬ܆
,,ܥܢܐܕܐܒܐ,ܥܢܐܕܐܒܐ
,,ܘܐܡܪ,ܘܐܡܪ܇
,,ܐܡܪܐܘܓܕܝܐܒܟܪܣܝ܀,ܐܡܪܐܘܓܕܝܐܒܟܪܣܝ܀
,,,ܟܘ܀
,,ܒܪܝܡܢܙܒܢܐܕܐܠܦܬܟܐܡܪܬܠܟܕܐܠܗܐܫܠܝܛܐܗ̄ܘܟܐܢܐܘܕܝܢܐܬܪܝܨܐ܂ܕܥܒܕܝܢܛܒ̈ܬܐܦܪܥܠܗܘܢܛܒ̈ܬܐ܂ܘܕܥܒܕܝܢܒܝ̈ܫܬܐܦܪܥܠܗܘܢ,ܒܪܝܡܢܙܒܢܐܕܐܠܦܬܟܐܡܪܬܠܟܕܐܠܗܐܫܠܝܛܐܗ̄ܘܟܐܢܐܘܕܝܢܐܬܪܝܨܐ܂ܕܥܒܕܝܢܛܒ̈ܬܐܦܪܥܠܗܘܢܛܒ̈ܬܐ܂ܘܕܥܒܕܝܢܒܝ̈ܫܬܐܦܪܥܠܗܘܢ
,,ܒܝ̈ܫܬܐ܂,ܒ̈ܝܫܬܐ܇
,,ܘܣܐܡܒܪܫܗܘܢܫܘܢܩܐܕܒܓܗܢܐ܂ܒܕܠܝܬܓܝܪ,ܘܣܐܡܒܪܫܗܘܢܫܘܢܩܐܕܒܓܗܢܐ܂ܒܕܠܝܬܓܝܪ
,,ܒܝܢ̈ܝܘܠܟܣܛܪܡ̣ܢܐܠܗܐ,ܒܝܢܝܘܠܟܣܛܪܡܢܐܠܗܐ
,,ܫܠܝܛܐ܂,ܫܠܝܛܐ܂
,,ܗܘ̣,ܗܘ
,,ܕܝܢ,ܕܝܢ
,,ܢܦܪ̱ܥܟ,ܢܦܪܥܟ
,,ܐܝܟ,ܐܝܟ
,,ܡܐ,ܐܟܡܐ
,,ܕܫܘܐܐܢ̄ܬ܀,ܕܫܘܐܐܢ̄ܬ܀
,,,ܟܙ܀
,,ܒܪܝܐܫܬܪܪܬܒܟܡܠܬܐܗܝܕܐܡܝܪܐ܂,ܒܪܝܐܫܬܪܪܬܒܟܡܠܬܐܗܝܕܐܡܝܪܐ܂
,,ܕܝܠܕܬܝܗܝ,ܕܝܠܕܬܟ
,,ܩܪܝܘܗܝܒܪܟ܂ܘܗܘ,ܩܪܝܘܗܝܒܪܟ܂ܘܗܘ
,,ܕܪܒܝܬܝܗܝ,ܕܪܒܝܬܗܝ
,,ܩܪܝܘܗܝܥܒܕܟ܀,ܩܪܝܘܗܝܥܒܕܟ܀
,,,ܟܙ܀
,,ܒܪܝܘܕܫܪܝܪܐܗܕܐ,ܒܪܝܘܕܫܪܝܪܐܗܕܐ
,,ܗ̄ܝ̣܂,ܗ̄ܝ̣܇
,,ܐܢܕܝܢܒܪܚܬܟܗ̄ܘܒܐܣܬܐ,ܐܢܕܝܢܒܪܚܬܟܗ̄ܘܒܐܣܬܐ
,,ܫܩܦܝܗܝ,ܫܩܘܦܝܗܝ
,,ܘܥܠܐܪܥܐ,ܘܥܠܐܪܥܐ
,,ܫܕܝܘܗܝ܂,ܫܕܝܘܗܝ܆
,,ܘܕܝܕܥ,ܘܕܝܕܥ
,,ܟܣ̈ܝܬܐܐܠܗܐ܂ܗ̄ܘ̣܂ܘܦܪܥܠܟܠܢܫܐܝܟܥܒܕܘ̈ܗܝ܂ܐܢ,ܟܣܝ̈ܬܐܐܠܗܐܗ̄ܘ܂ܘܦܪܥܠܟܠܐ̄ܢܫܐܝܟܥܒܕܘܗ̈ܝ܂ܐܢ
,,ܛܒ̈ܐܘܐܢܒܝܫ̈ܐ܂ܗܘܢܦܪܥܟܐܟܡܐ,ܛܒ̈ܐܘܐܢܒܝܫ̈ܐ܂ܗܘܢܦܪܥܟܐܟܡܐ
,,ܕܫ̇ܘܐ,ܕܫܘܐ
,,ܐܢ̄ܬ܂ܐܢܐܗܟܝܠܡܟܝܠܡܕܡܠܐ,ܐܢ̄ܬ܂ܐܢܐܗܟܝܠܡܟܝܠܡܕܡܠܐ
,,ܐܡܪܐ̄ܢܐ,ܐܡܪܢܐ
,,ܠܟ܀,ܠܟ܀
