t_Borg_ar_201,t_Camb_Add_2886,t_Cambrigde_Add_3497,t_GCAA_00486,t_Mingana_ar_christ_93_84,t_Mingana_syr_133,t_Ms_orient_A_2652,t_Or_1292b,t_Paris_Arabe_3637,t_Paris_Arabe_3656,t_Salhani,t_Vat_ar_2054
omisit,,,,كلمافعلته,,,,بحكمة,,,omisit
,يا,يا,يا,,يا,يا,يا,يا,يا,يا,
,ولدينادانعملة,بني,بني,,ابني,بنيّ,بني,بني,بني,بني,
,,عملت,عملت,,عملت,عملت,عملت,عملت,عملت,عملت,
,معك,معك,معك,معك,معك,معك,معك,معك,معك,معك,
,كل,كل,كل,منالاحسانوالجميل,كل,كل,كل,كل,كل,كل,
,خيرًا,خير,خير,,خير,خير,خير,خير,خير,خير,
,واحسان,واحسان,واحسان,,واحسان,واحسان,واحسان,واحسان,ورحمت,واحسان,
,وانت,وانت,وانت,,وانت,وانت,وانت,وانت,وانت,وانت,
,باديتني,باديتني,باديتني,باديتني,باديتني,باديتني,باديتني,باديتني,باديتني,باديتني,
,,,,,عوضه,,,,,,
,,,,بالقتل,بالقتل,,,,,,
,عوضه,عوضه,عوضه,عوضه,,عوضه,عوضه,عوضه,عوضه,عوضه,
,بالقبيح,بالقبيح,بالقبيح,,,بالقبيح,بالقبيح,بالقبيح,بالقبيح,بالقبيح,
,والردي,والردا,والردا,,,والردا,والردا,والردا,والردي,والردي,
,والقتل,والقتل,والقتل,,,والقتل,والقتل,والقتل,والقتل,والقتل,
,يا,يا,يا,يا,يا,يا,يا,يا,يا,يا,
,بني,بني,بني,بني,بني,بنيّ,بني,بني,بني,بني,
,,,,قد,قد,,,,قد,,
,قيل,قيل,قيل,قيل,قيل,قيل,قيل,قيل,قيل,قيل,
,بالامثال,بالامثال,في,فى,في,بالامتال,بالامثال,بالامثال,في,في,
,,,الامتال,الامثال,الامثال,,,,امثال,الامثال,
,من,من,من,من,من,من,من,من,من,من,
,لا,لا,لم,لم,لم,لا,لا,لا,لا,لا,
,يسمعمن,يسمعمن,يسمعمن,يسمعمن,يسمعمن,يسمعمن,يسمعمن,يسمعمن,يسمعمن,يسمعمن,
,اذنيه,ادنيه,ادانيه,اذنيه,اذنيه,اذنيه,ادنيه,اذنيه,اذناهفمن,ادنيه,
,من,من,من,من,من,من,من,من,,من,
,ققا,قفا,قفا,قفا,قفا,قفا,قفا,قفا,قفا,قفا,
,رقبته,رقبته,رقبته,رقبته,رقبته,رقبته,رقبته,رقبته,رقبته,رقبته,
,يسمعوه,يسمعوه,يسمعوه,,يسمعوه,يسمّعوه,يسمعوه,يسمعوه,يسمعونه,يسمعوه,
,يسمع,,,يسمع,,,,,,,
,قرميهفيرجليهفقال,فقال,فقال,فقال,فقال,فقال,فقال,فقال,فقال,فقال,
,,له,له,له,له,له,,له,له,له,
,نادان,نادان,نادان,نادان,نادان,نادان,نادان,نادان,نادان,نادان,
,,يا,يا,يا,يا,يا,يا,يا,يا,يا,
,,خالي,خالي,خالهِعلىايشي,خالي,خالي,خالي,خالي,خالي,خالي,
,لايسبب,لايسبب,لايسبب,,لايسبب,لايسبب,لايسبب,لايسبب,لايسبب,لايسبب,
,انتغضبان,انتغضبان,انتغضبان,انتغضبان,انتغضبان,انتغضبان,انتغضبان,انتغضبان,انتغضبان,انتغضبان,
,عليّ,عليّ,عليّ,عليّ,عليّ,عليّ,عليّ,عليّ,عليفاجابه,عليَّ,
,فقالله,قالله,قالله,فقالله,فقال,قالله,قالله,قالله,,قالله,
,حيقار,حيقار,حيقار,حيقار,حيقار,حيقار,حيقار,حيقار,حيقار,حيقار,
,لاجل,لاجل,لاجل,لاجل,لاجل,لاجل,لاجل,,لاجل,لاجل,
,اني,اني,اني,الذيقويتكوعلمتكوحكمتك,انَّيوقّرتكوكرَّمتك,اني,اني,اني,اني,اني,
,ربيتكوعلمتكووقرتك,وقرتك,وقرتك,,,وقرّتك,وقرتك,وقرتك,وقرتك,وقرتك,
,واكرمتك,واكرمتك,وكرمتكوعضمتك,,,واكرمتك,واكرمتك,واكرمتك,واكرمتك,واكرمتك,
,وعظمتك,وعظمتك,,,وعظمتك,وعظّمتكوربّيتك,وعظمتك,وعظمتك,وعظمتك,وعظمتك,
,وربيتك,وربيتك,وربيتك,وربيتك,وربيتك,,وربيتك,وربيتك,وربيتك,وربيتك,
,باحسنالتربيهواجلستكموضعي,احسن,احسن,اجمل,احسن,احسن,احسن,احسن,احسن,احسن,
,,تربيه,تربيه,تربيه,تربيه,تربيه,تربيه,تربيه,تربية,تربيه,
,,وعلمتك,وعلمتك,,وعلمتك,وعلّمتك,وعلمتك,وعلمتك,وعلمتك,وعلمتك,
,حتى,حتى,حتى,حتى,حتى,حتى,حتى,حتى,حت,حتى,
,انك,,,,,,,,,,
,تكون,تكون,تكون,تكون,تكون,تكون,تكون,تكون,تكون,تكون,
,وريثي,وريتي,وريتي,وريتهِوجالسمكاني,وريثي,وريثي,وريتي,وريتي,وريثي,وريثي,
,في,في,في,,في,في,في,في,في,في,
,العالم,العلم,العلم,,العلم,العالم,العلم,العلم,العلم,العالم,
,,والحكمه,والحكمه,,والحكمه,والحكمه,والحكمة,والحكمة,والحكمة,والحكمة,
,,والمال,والمال,,والادب,والمال,والمال,والمال,والمال,والمال,
,فباديتني,فباديتني,فباديتني,فباديتني,فباديتني,فباديتني,فباديتني,فباديتني,فباديتني,فباديتني,
,فيالقتل,بالقتل,بالقتل,بالقتل,بالقتل,بالقتل,بالقتل,بالقتل,بالقتل,بالقتل,
,وردت,ورمت,ورمت,والشتيموالسبورميتنيللهلاكبالسيف,وردت,ورمت,ورمت,ورمت,ورمت,ورمت,
,هلاكي,هلاكي,هلاكي,,هلاكي,هلاكي,هلاكي,هلاكي,هلاكي,هلاكي,
,ولكن,لكن,لكن,لكن,لكن,لكن,لكن,لكن,لكن,لكن,
,الرب,الرب,الرب,الرب,الرب,الرب,الرب,الرب,الرب,الرب,
,علم,علم,علم,نجاني,نجاني,علم,علم,علم,علم,علم,
,,انني,,وخلصني,وخلَّصني,,انني,انني,,,
,,,,وعلم,وعلم,,,,,,
,اني,,اني,اني,اني,اني,,,اني,اني,
,مظلوم,مظلوم,مضلوم,مظلوم,مظلوم,مظلوم,مظلوم,مظلوم,مظلوم,مظلوم,
,فخلصنيمنشرك,فخلصنيمنشرك,فخلصنيمنشرك,,,فخلّصنيمنشرّك,فخلصنيمنشرك,فخلصنيمنشرك,فخلصنيمنشرك,فخلصنيمنشرك,
,الذينصبتهلي,,,,,,,,,,
,لانالربيجبر,لانالربيجبر,لانالربيجبر,لانالربيجبر,لانالربيجبر,لانالربيجبر,لانالربيجبر,لانالربيجبر,لانالربيجبر,لانالربيجبر,
,خواطر,قلوب,خاطر,قلوب,خواطر,قلوب,قلوب,قلوب,الخواطرالمنكسرة,قلوب,
,المنكسره,المنكسره,المنكسره,المنكسرا,المنكسرين,المنكسره,المنكسره,المنكسره,,المنكسره,
,ويردع,ويدل,ويردل,ويرذل,ويرذل,ويرذل,ويدل,ويذل,ويرذل,ويرذل,
,,,,المتجبرن,,,,,,,
,,,الحسودين,,,,,,,,
,,,المتجبرين,,المتجبرين,,,,,,
,,الحسودين,ياولديصرتليمتل,,الحسودين,الحسودين,الحسودين,الحسودين,,الحسودين,
,,المتكبرين,,,ياولدي,المتكبرين,المتكبرين,المتكبرين,المتكبرين,المتكبرين,
,الحسودين,,,الحسودين,,,,,الحسودين,,
,والمستكبرين,,,يابني,,,,,يابني,,
,يا,يا,,,,يا,يا,يا,,يا,
,ولدي,بني,,,,بنيّ,بني,,,,
,انت,,,,,,انت,,,,
,صرتليمثل,,,صرتليمثل,صرتليمثل,,,,صرتليمثل,,
,,,,العقربالذيزنابتةفيالصخرافيثقبهاويبخشهايا,,,,,,,
,,,,بني,,,,بني,,بني,
,,صرت,,صرت,,صرت,صرت,صرت,,صرت,
,,,,لي,,,,,,,
,,مثل,,مثل,,مثل,مثل,مثل,,مثل,
,عقرب,عقرب,عقرب,عرق,عقرب,عقرب,عقرب,عقرب,عقرب,عقرب,
,الذي,,الديادا,,الذي,الذي,,,الذي,الذي,
,اذا,اذا,,,اذا,اذا,اذا,اذا,اذا,اذا,
,ضرب,ضربت,ضرب,,ضرب,ضربت,ضربت,ضربت,ضرب,ضرب,
,,زنابتها,زنافته,,زنابتهفيالصخرهيثقبهاياابنيقدصرتمثلعنزةالتى,زنّابتها,زُنابتها,زُنابتها,زنافته,ذنابته,
,,في,في,,,في,في,في,في,في,
,النحاس,النحاس,الصفايتقبهايابنيصرتليمتلي,,,النحاس,النحاس,النحاس,النحاس,النحاس,
,يثقبهياولديانتمثل,ثقبتهيا,,,,ثقبتهيا,تقبتهيابني,تقبتهيابني,تقبها,تقبه,
,العنزه,بنيصرت,العنزه,,,بنيّانتصرتليمثلالحجالة,,,,,
,الذي,,الدي,,,,,,,,
,اكلت,,اكلت,,اكلت,,,,,,
,عروق,,عرق,,عرق,,,,,,
,الفوه,,الفوّه,الفوه,الفوَّه,,,,,,
,,,,التياكلتهاالعنزي,,,,,,,
,فقالتلها,,فقالتلها,فقالتلها,فقالتلها,,,,,,
,,,الفوه,لابدليدبغ,الفوه,,,,,,
,اليومكلي,,اليومكلي,,اليومكلي,,,,,,
,مني,,مني,,منىواتنعمي,,,,,,
,واشبعي,,واتنعمي,,,,,,,,
,وغدا,,وغدا,,وغدا,,,,,,
,يدبغون,,يدبغون,,يدبجونجلدكي,,,,,,
,جلدك,,جلدكي,جلدك,,,,,,,
,في,,في,في,في,,,,,,
,عروقي,,عروقي,عرقٍيابني,عروقي,,,,,,
,ياولدي,,ياولدي,,يابني,,,,,,
,انتصرتليمثلانساننظررفيقهعريانوكانزمانشتاوبردفاخدماباردوسَكَبَعليهياولديانت,,صرتلي,,صرتلي,,,,,,
,صرتليمثل,,متل,صرتليمثل,مثي,,,,,,
,انسان,,انسان,انسان,انسان,,,,,,
,اخد,,اخد,اخد,اخذ,,,,,,
,حجرًا,,حجرًا,حجروارماهانحو,حجرًا,,,,,,
,ورماها,,ورماها,,ورماه,,,,,,
,الى,,الي,,الى,,,,,,
,السماليرجم,,السماليرجم,السماليرجم,السماليرجم,,,,,,
,,,,,ربه,,,,,,
,بها,,بها,,بها,,,,,,
,ربه,,ربه,ربه,,,,,,,
,فلا,,فلا,فلا,فلا,,,,,,
,,,صابة,,وصل,,,,,,
,صابت,,,وصلت,,,,,,,
,الحجرولا,,الحجرولا,الحجرولا,الحجرولا,,,,,,
,وصلت,,وصلت,,صابت,,,,,,
,,,,اصاب,,,,,,,
,الى,,الي,شي,شي,,,,,,
,العلو,,العلو,,,,,,,,
,بل,,بل,بل,بل,,,,,,
,اكتسب,,اكتسب,اخدالسخطوالخطا,اكتسب,,,,,,
,الاثم,,الاتم,,الاثم,,,,,,
,والخطيه,,والخطيه,,والخطيَّه,,,,,,
,ياولديانت,,يابني,يابني,يابني,,,,,,
,,,صرتلي,صرتلي,صرتليمثلانساننظر,,,,,,
,,,متل,مثل,,,,,,,
,,,انسان,انسان,,,,,,,
,,,نضر,نظررفيقهعريانفييوم,,,,,,,
,,,رفيقهعريانوكانزمان,,رفيقهعريانوكانزمان,,,,,,
,,,برد,برد,الشتافاخذماء,,,,,,
,,,وشتا,وتلج,,,,,,,
,,,,,باردوسكب,,,,,,
,,,فاخدما,فاخدما,,,,,,,
,,,باردوسكب,,,,,,,,
,,,,باردوسكبه,,,,,,,
,,,عليهيا,عليهيا,عليهيا,,,,,,
,,,ولدي,بني,بني,,,,,,
,لووقرتني,,لووقرتني,لووقرتني,لووقرتني,,,,,,
,واكرمتني,,وكرمتني,كنتورثني,وكرمتني,,,,,,
,وسمعتكلاميكنت,,وسمعتكلاميكنت,,وسمعتكلاميكنت,,,,,,
,ورثتني,,ورتتني,,ورثتني,,,,,,
,وملكت,,وملكت,,وملكت,,,,,,
,مالي,,مكاني,,مكاني,,,,,,
,يابني,,يابني,,,,,,,,
,اعلم,,اعلم,اعلم,اعلم,,,,,,
,انه,,انه,ياولدي,ان,,,,,,
,لوطال,,لوطال,لوطال,لوطال,,,,,,
,ذَنَبالكلبوالخنزير,,دنب,دنب,ذنب,,,,,,
,,,الخنزير,الخنزير,الخنزير,,,,,,
,عشرة,,عشرتادرع,عشر,عشرة,,,,,,
,اذرع,,,أذرع,أذرع,,,,,,
,لم,,لم,ما,لم,,,,,,
,يقدم,,يقوم,يقوم,يقوم,,,,,,
,مقامالفرسولوكان,,مقامالفرسولوكان,مقامالفرسولوكان,مقامالفرسولوكان,,,,,,
,مثل,,شعره,شعر,شعره,,,,,,
,,,الين,الين,الين,,,,,,
,,,,من,من,,,,,,
,الحرير,,,الحرير,الحرير,,,,,,
,ياولدياناكنت,,,وانعممنالكتانيابنيكنت,وانعممنالكتانيابنيكنت,,,,,,
,اظنانك,,,اضمربانك,اظنانك,,,,,,
,تصير,,,تصير,تصير,,,,,,
,وريثي,,,وريتهِ,وارثي,,,,,,
,عندمماتي,,,عندمماتي,عندمماتي,,,,,,
,وانت,,,فغرت,فانت,,,,,,
,منحسدك,,,منحسدك,منحسدك,,,,,,
,وشقاوتكاردت,,,وردت,وشقاوتكاردت,,,,,,
,تقتلنيولكن,,,قتلي,قتلي,,,,,,
,,,,عاجلاوالرب,لكن,,,,,,
,الرب,,,,الرب,,,,,,
,نجاني,,,نجاني,نجاني,,,,,,
,من,,,من,ياولديانتصرتليمثل,,,,,,
,مكركياولديانت,,,شركياولدي,,,,,,,
,صرتلي,,,صرتلي,,,,,,,
,اسدصاحب,,,مثل,اسدصاحب,,,,,,
,,,,,حمارفبداالحماريخدم,,,,,,
,,,,الاسد,الاسد,,,,,,
,,,,الذيصاحبه,مدةمنالزمانالىان,,,,,,
,حمار,,,حمار,,,,,,,
,فبقا,,,فلما,,,,,,,
,,,,سمن,سمن,,,,,,
,الحمار,,,الحمار,الحمار,,,,,,
,يقدم,,,وثب,فوثب,,,,,,
,,,,عليه,عليه,,,,,,
,الاسد,,,وافترسهيابنيصرتمثلالفخالمطمورفيالارضفاتىعصفوروسلمعليهفردعليهالسلاموقاللهكلممارزقكاللهبماعنديمنهذهالحنطهفلمابدايلقطمنالقمحقلبعليهالفخومسكهفقاللهالعصفورانكانهذهصدقتكاللهلايقبلهامنكياولدي,الاسد,,,,,,
,مدهزمانفوثبالاسدعلىالحمارذاتيوم,,,,,,,,,,
,واكله,,,,واكله,,,,,,
,ياولديانت,,,,يابنيانتصرت,,,,,,
,صرتلي,,,صرتلي,,,,,,,
,مثل,,,مثل,مثل,,,,,,
,قملة,,,قملهتبدافي,قملة,,,,,,
,الحنطه,,,الحنطه,الحنطه,,,,,,
,لانها,,,وتفسدها,فانها,,,,,,
,لاتصلح,,,لاتصلح,لاتصلح,,,,,,
,لشيبلتفسدالحنطه,,,ياولديصرتلي,لشيبلتفسدالحنطه,,,,,,
,وتنخرهاياولديانتصرت,,,,وتخبّلهاياولدىانتصرت,,,,,,
,مثلانسان,,,مثلانسان,مثلانسان,,,,,,
,زرع,,,عشر,يزرع,,,,,,
,عشرة,,,,عشرة,,,,,,
,اكيالحنطهفلما,,,اكيالحنطهفلما,اكيالحنطهفلما,,,,,,
,صارالحصادفقام,,,تعبعليهاوحصدها,صارت,,,,,,
,حصدها,,,,حصدها,,,,,,
,ورجدها,,,,ودقها,,,,,,
,ودرسها,,,ودرسها,ودرسها,,,,,,
,وتعبعليها,,,ودراهاطلعتتمانيت,وتعبعليها,,,,,,
,غايت,,,,غاية,,,,,,
,التعب,,,,التعب,,,,,,
,فصارت,,,,فطلعت,,,,,,
,عشرةاكيال,,,,عشرةاكيال,,,,,,
,,,,,ايضًا,,,,,,
,فقال,,,فقال,فقال,,,,,,
,لها,,,ياليت,لها,,,,,,
,صاحبهاياريتك,,,,ياليتىلانبتتى,,,,,,
,لا,,,لا,,,,,,,
,تنبتي,,,نبتي,,,,,,,
,ولا,,,ولا,ولا,,,,,,
,ضرتي,,,صرتهِيابني,صرتي,,,,,,
,ياولدي,,,,يابني,,,,ياولدي,يابني,
,انت,,,,انت,,انت,انت,انت,انت,
,صرت,,,صرت,صرت,,صرت,صرت,صرت,صرت,
,لي,ليّ,,لي,لي,,لي,لي,لي,ليّ,
,مثل,مثل,,مثل,مثل,,مثل,مثل,مثل,مثلالحجلةالمربوطة,
,الحجله,السجالمة,,الحجلالمربوط,الحجله,,السجالمة,السجالمة,الحجلالمربوط,,
,المرميه,المربوطه,,,المربوطه,المربوطه,المربوطه,المربوطه,,,
,في,في,,في,في,في,في,في,في,في,
,الشبكه,الشبكه,,شبكتالصيادفيرمهرفاقه,شبكه,الشبكه,الشبكة,الشبكه,الشبكة,الشبكه,
,فلا,فلا,,,فلا,فلا,فلا,فلا,فلا,فلا,
,تقدر,تقدر,,,تقدر,تقدر,تقدر,تقدر,يقدريخلص,تقدر,
,تخلص,تخلص,,,تخلّص,تخلّص,تخلص,تخلص,,تخلّص,
,نفسها,روحهاونفسها,,,نفسها,روحهاونفسها,روحهاونفسها,روحهاونفسها,,روحهاونفسها,
,بل,بل,,,بل,بل,بل,بل,بل,بل,
,تدعيالحجل,تدعيالحجل,,,تدعيالحجل,تدعيالحجل,تدعيالحجل,تدعيالحجل,يدعيالحجالليرميهممعه,تدعيالحجل,
,لترميهممعها,لترميهممعها,,,اليهاياولدي,لترميهممعها,لترميهممعها,لترميهممعها,,لترميهممعها,
,في,,,في,,,,,,,
,,,,,,يا,,,,يا,
,الشبكه,,,الهوانومايقدرينجينفسهياولدي,,بنيّ,,,,بني,
,يابني,يابني,,,,,يابني,يابني,يابني,,
,,,,,انتصرت,انتصرت,,,,انتصرت,
,انت,انت,,,,,انت,انت,انت,,
,صرت,صرت,,صرت,,,صرت,صرت,صرت,,
,لي,ليّ,,لي,,,لي,لي,لي,,
,مثلالكلب,مثلالكلب,,مثلالكلب,مثلالكلب,مثلالكلب,مثلالكلب,مثلالكلب,مثلالكلب,مثلالكلب,
,الذي,الذي,,الذي,الذي,الذى,الذي,الذي,الذي,الذي,
,بردفدخلالىبيت,بردفدخلالىبيت,,بردفدخلالىبيت,بردفدخلالىبيت,بردفدخلالىبيت,بردفدخلالىبيت,بردفدخلالىبيت,بردفدخلالىبيت,بردفدخلالىبيت,
,الفاخرليدفى,الفخار,,الفخار,الفخار,الفخّار,الفخار,الفخار,الفخار,الفخار,
,,ليدفا,,ليدفا,ليدفا,ليدفا,ليدفا,ليدفا,ليدفا,ليدفا,
,فلما,فلما,فلما,فلما,فلما,فلما,فلما,فلما,فلما,فلما,
,دفى,دفى,دفي,سخنت,دفى,دفى,دفي,دفي,دفي,دفى,
,بدا,بدا,بدا,بدا,بدا,بدا,بدا,بدا,بدا,بدي,
,ينبح,ينبح,ينبح,ينبح,ينبح,ينبح,ينبح,ينبح,ينبح,ينبح,
,عليهم,عليهم,عليهم,عليهم,عليهم,عليهم,عليهم,عليهم,عليالحاضرين,عليهم,
,فطردوه,فضربوه,فطردوه,فطردوه,فضربوه,فطردوه,فضربوه,فضربوه,فطردوه,فطردوه,
,وضربوه,وطردوه,وضربوه,وشحتوه,وطردوه,وضربوه,وطردوه,وطردوه,لبره,وطردوه,
,ليلا,ليلا,ليلا,ليلا,ليلا,ليلا,ليلا,ليلا,ليلا,ليلا,
,يعضهم,يعضهم,يعضهم,يعضهم,يعضهم,يعضّهم,يعضهم,يعضهم,يعضهم,يعضهم,
,يا,يا,يا,يا,يا,يا,يا,يا,يا,يا,
,بني,بني,بني,بني,بني,بنيّ,بني,بني,بني,بني,
,انت,انت,انت,,انت,انت,انت,انت,انت,انت,
,صرت,صرت,صرت,صرت,صرت,صرت,صرت,صرت,صرت,صرت,
,لي,ليّ,متل,لي,مثل,,لي,لي,,,
,مثل,مثل,,مثل,,مثل,مثل,مثل,مثل,مثل,
,الخنزير,الخنزير,الخنزير,الخنزير,,الخنزير,الخنزير,الخنزير,الخنزير,الخنزير,
,الذي,الذي,الدي,الذي,الذي,الذى,الذي,الذي,الذي,الذي,
,دخل,دخل,دخل,دخل,دخل,دخل,دخل,دخل,دخل,دخل,
,,,,معالاكابر,,,,,,,
,الى,الى,,الى,الى,الى,الى,الى,الى,الى,
,الحمام,الحمام,الحمام,الحمام,الحمام,الحمام,الحمام,الحمام,الحمام,الحمام,
,معالاكابر,معالاكابر,معالاكابر,,معالاكابر,معالاكابر,معالاكابر,معالاكابر,معالاكابر,معالاكابر,
,فلما,فلما,فلما,فلما,فلما,فلما,فلما,فلما,فاذ,فلما,
,خرج,خرج,خرج,خرج,خرج,خرج,خرج,خرج,خرج,خرج,
,منالحمام,,نضر,خارج,,,,,ونظر,,
,نظر,نظر,,نظر,نظر,نظر,نظر,نظر,,نظر,
,جورة,جورة,,الىجورهفيهاحماه,جورة,جورة,جورة,جورة,جورة,جورة,
,,,جورت,,,,,,جورت,,
,سيان,سيان,سيان,,سيان,سيان,سيان,سيان,صيانمنتنة,سيان,
,,منتنه,نتنه,منتنه,نتنه,نتنه,منتنه,منتنه,,نتنه,
,فنزل,نزل,فنزل,فنزل,فنزل,فنزل,نزل,نزل,نزل,فنزل,
,تمرمغ,تمرغ,تمرغ,تمرغ,تمرّغ,تمرّغ,تمرمغ,تمرغ,,تمرغ,
,فيها,فيها,فيهايا,فيها,فيهايا,فيهايا,فيها,فيها,فيها,فيها,
,,,ولديانتصرت,وكلشييرجعالىاصله,ولديانتصرت,بنيّ,,,وتمرغ,,
,يابني,يابني,متل,,,,يابني,يابني,يابني,يابني,
,,,,,,انت,,,,,
,انت,انت,,,,,انت,انت,,انت,
,صرت,صرت,,,,صرت,صرت,صرت,صرت,صرت,
,لي,,,,,,,,,,
,مثل,مثل,,,مثل,مثل,مثل,مثل,مثل,مثل,
,التيس,التيس,التيس,,التيس,التيس,التيس,التيس,التيس,التيس,
,الذي,الذي,الدي,,الذي,الذي,الذي,الذي,الذي,الذي,
,يدخل,يدخل,يدخل,,يدخل,يدخل,يدخل,يدخل,يدخل,يدخل,
,,ويدخّل,,,,ويدخّل,ويدخّل,ويدّخل,فراقه,ويدخل,
,ارفاقه,ارفاقه,ارفاقه,,ارفاقه,ارفاقه,ارفاقه,ارفاقه,ارفاقه,ارفاقه,
,للدبح,للدبح,للدبح,,للدبح,الىالذبح,للدبح,للدبح,للذبح,الىالدبح,
,ولايقدر,ولايقدر,ولايقدر,,ولايقدر,ولايقدر,ولايقدر,ولايقدر,ولايقدر,ولايقدر,
,يخلص,يخلص,يخلص,,يخلص,يخلّص,يخلص,يخلص,يخلص,يخلص,
,نفسه,روحه,نفسه,,روحه,روحه,روحه,روحه,نفسه,روحه,
,يا,ونفسه,يا,,يا,ونفسه,ونفسه,ونفسه,يا,ونفسه,
,ولدي,,بني,,بني,,,,بني,,
,الكلب,,الكلب,,الكلب,,,,الكلب,,
,الذي,,الدي,,الذي,,,,الذي,,
,لميقتاتمنصيدهيصيرماكلًا,,لميقتاتمنصيدهيصيرماكلًا,,لميقتاتمنصيدهيصيرماكلًا,,,,لميقتاتمنصيدهيصيرماكلًا,,
,للذئب,,للكلاب,,للكلاب,,,,للكلاب,,
,,,ارفاقه,,,,,,,,
,يا,يا,يا,يا,يا,يا,يا,يا,يا,يا,
,بني,بني,ولدي,بني,ولدي,بنيّ,بني,بني,بني,بني,
,يد,يدًا,يدًا,,يدًا,يدًا,يدًا,يدًا,يد,يدًا,
,الذي,لا,لم,,لم,,لا,لا,,,
,لم,,,,تفلحوتتعب,لم,,,لم,لم,
,تتعب,تتعب,تتعب,,,تتعب,تتعب,تتعب,تتعب,تتعب,
,وتفلح,وتفلح,وتتعلج,,,وتفلح,وتفلح,وتفلح,وتفلح,وتفلح,
,وتكون,وتكون,وتكون,,وتكون,وتكون,وتكون,وتكون,وتكون,وتكون,
,حريصه,حريصه,حريصه,,حريصه,حريصه,حريصه,حريصه,حريصه,حريصه,
,شاطره,وشاطره,شاطره,,شاطره,شاطره,وشاطره,وشاطره,,شاطره,
,تقطعمن,تقطعمن,تقطعمن,,تقطعمن,تقطعمن,تقطعمن,تقطعمن,تقطعمن,تقطعمن,
,اباطها,اباطها,اباطها,,اباطها,اباطها,اباطها,اباطها,اصلها,اباطها,
,يا,يا,يا,,يا,يا,يا,يا,يا,يا,
,ولديانت,بني,بني,,بني,بنيّ,بني,بني,بني,بني,
,صرتليمثل,انتصرت,انتصرت,صرتليمثل,انتصرت,انتصرت,انتصرت,انتصرت,انتصرت,انتصرت,
,شجرهالذي,مثل,لي,,لي,مثل,مثل,مثل,مثل,مثل,
,,الشجرة,متلالشجرتالدي,,مثلشجرة,الشجرة,الشجره,الشجرة,الشجرة,الشجره,
,قطعوا,الذي,قطعوا,,التي,الذي,التي,التي,التي,الذي,
,فرعوها,قطعوهاوفروعها,فروعها,,قصدواقطعها,قطعوهاوفروعها,قطعوهاوفروعها,قطعوهاوفروعها,قطعتفروعها,قطعوهاوفروعها,
,,معها,,,,معهم,معها,معها,,معهم,
,فقالت,فقالت,فقالتلهم,,فقالتلهم,فقالتلهم,فقالت,فقالت,فقالت,فقالتلهم,
,لهملو,,,,اه,,,,لقاطعيها,,
,,لولا,لولا,,لولا,لولا,لولا,لولا,لولا,لولا,
,مافييدكممنيلماقدرتم,مافييدكممنيلماقدرتم,مافييدكممنيلماقدرتم,,مافييدكممنيلماقدرتم,مافييدكممنيلماقدرتم,مافييدكممنيلماقدرتم,مافييدكممنيلماقدرتم,مافييدكممنيلماقدرتم,مافييدكممنيلماقدرتم,
,على,على,على,,على,على,على,على,علي,على,
,قطعييا,قطعييا,قطعييا,,قطعييا,قطعييا,قطعييا,قطعييا,قطعييا,قطعييا,
,ولدي,بني,بني,,ولدي,بنيّ,بني,بني,بني,بني,
,انت,انت,انت,,انت,انت,انت,انت,انت,انت,
,,صرت,متل,,,صرت,صرت,صرت,,صرت,
,مثل,مثل,,,مثل,مثل,مثل,مثل,مثل,مثل,
,القطه,السنوره,القطه,القطه,السنوره,السنوره,السنوره,السنوره,القطه,السنوره,
,الذي,التي,الدي,التى,الذي,التى,التي,التي,التي,التي,
,قالوالها,قالوالها,قالوالها,قالوالها,قالوالها,قالوالها,قالوالها,قالوالها,قالوالها,قالوالها,
,بطلي,بطلي,بطلي,بطلهالسرقا,بطلي,بطّلي,بطلي,بطلي,ابطليالسرقيحتينطعمكونصنع,بطلي,
,السرقه,السرقه,السرقه,,السرقه,السرقه,السرقه,السرقه,,السرقه,
,حتى,حت,,حتى,حتى,حتى,حتى,حتى,,حتى,
,نصنع,نصنع,,نعمل,نصنع,نصنع,نصنع,نصنع,,نصنع,
,لكيقلاده,لك,,لك,لكىحلقوقلايد,لك,لكِ,لكِ,لك,لكِ,
,,قلايد,,مرود,,قلايد,قلايد,قلايد,قلايد,قلايد,
,من,من,,,من,من,من,من,من,من,
,دهب,ذهب,,ذهب,دهب,ذهب,ذهب,ذهب,ذهب,ذهب,
,ونطعمك,ونطعمكي,ونطعمك,فيادنيكوطوقواساوروخلاخيل,ونطعمكي,ونطعمكي,ونطعمك,ونطعمكِ,ونسقيكسكرًافاجابتهم,ونطعمكي,
,سكرولوز,سكرولوز,سكرولوز,,سكرولوز,سكرولوز,سكرولوز,سكرولوز,,سكرولوز,
,,,ونسقيكي,,,,,,,,
,فقالت,فقالت,فقالت,فقالت,فقالت,فقالت,فقالت,فقالت,,فقالت,
,,لهم,,,,لهم,لهم,لهم,,لهم,
,انا,انا,انا,انا,انا,انا,انا,انا,انا,انا,
,صنعة,صنعت,صنعت,صنعت,صنعت,صنعة,صنعت,صنعت,صنعت,صنعة,
,ابي,ابي,اميوابي,ابي,ابي,ابي,ابي,ابي,ابي,ابي,
,وامي,وامي,,,واجدادي,وامي,وامي,وامي,وامي,وجدي,
,ما,لست,ما,ما,ما,ليس,لست,لست,لا,ما,
,بنساها,بنساها,اتركها,اتركها,اتركها,بنساها,بنساها,انساها,اتركها,بعدّيعنها,
,يا,,,يابنيصرت,ابدًا,يا,,,يابنيصرت,,
,,,,,,,,يابني,,يابني,
,,يابني,يابني,,يابني,,يابني,,,,
,ولدي,,,ليمثلالشجراالتىارادوقطعهافقالتلهملولافييدكممنيماقدرتم,,بنيّ,,,مثلالتعبانالراكبعليافعي,,
,انتصرت,انتصرت,انتصرت,,انتصرت,انتصرت,انتصرت,انتصرت,,انتصرت,
,,,,على,,,,,,,
,مثل,مثل,متلتعبان,قطعيياولدييدلمتفلحوتعملوتحرصوالاتقطعمناباطهايابني,مثل,مثل,مثل,مثل,,مثل,
,الثعبان,تعبانًاراكبًا,,,ثعبان,ثعبانًا,ثعبان,ثعبانًا,,ثعبانًا,
,راكب,,راكب,,راكب,راكبا,راكبًا,راكبًا,,راكبًا,
,على,على,على,,على,على,على,على,,على,
,عوسجه,عوسجه,عوسجه,,عوسج,عوسجه,عوسجة,عوسجة,,عوسجة,
,وهو,وهم,وهو,,وهو,وهم,وهم,وهم,وهو,وهم,
,في,في,في,,فى,في,في,في,في,في,
,وسطالنهر,وسطالنهر,وسطالنهر,,وسطالنهر,وسطالنهر,وسطالنهر,وسطالنهر,وسطالنهر,وسطالنهر,
,نظرهم,فنظرهم,فنضرهم,,فنظرالديب,فنظرهم,فنظرهم,فنظرهم,فنظرهم,فنظرهم,
,ديب,ديب,ديب,,,ديب,ديب,ديب,ذيب,ديب,
,وقال,وقال,فقال,,فقال,وقال,وقال,وقال,فقال,وقال,
,,,,,,شرًّ,,,لهما,شرٌ,
,,,,,,على,,,,على,
,شر,شر,شر,,شر,,شر,شر,شر,,
,على,على,على,,على,شرّ,على,على,علي,شرٍ,
,شر,شر,شر,,شر,,شر,شر,شر,,
,والذي,والذي,والدي,,والذي,والذي,والذي,والذي,والذي,والذي,
,اشر,اشر,اشر,,اشر,اشرّ,اشر,اشر,اشر,اشرّ,
,منهم,منهم,منهم,,منهم,منهم,منهم,منهم,منكمايدبركما,منهم,
,يدبرهم,يدبرهم,يدبر,,يدبّر,يدبّرهم,يدبرهم,يدبرهم,,يدبرهم,
,اثنينهم,اتنينهم,اتنينهم,,اثنينهم,اثنينهم,اتنينهم,اتنينهم,,اتنينتهم,
,يا,يا,ياولدياناماكولان,,يا,يا,يا,يا,يا,يا,
,ولدي,بني,,,ولدي,بنيّ,بني,بني,بني,بني,
,,,جيد,,,,,,,,
,انا,انا,اطعمك,,انا,انا,انا,انا,,انا,
,اطعمتك,,,,,,,,,,
,ماكولًا,ماكولًا,,ماكولًا,ماكولًا,ماكولًا,ماكولًا,ماكولًا,ماكولًا,ماكولًا,
,,جيد,,,,جيد,,,,جيد,
,جيدًا,,,لديدا,جيّد,,جيدًا,جيدًا,جيدًا,,
,,اطعمتك,,اطعمتك,اطعمتك,اطعمتك,اطعمتك,اطعمتك,اطعمتك,اطعمتك,
,وانتخبزحاف,وانتخبزحاف,وانتخبزحاف,وانتخبزحاف,وانتخبزحاف,وانتخبزحاف,وانتخبزحاف,وانتخبزحاف,وانتخبزحاف,وانتخبزحاف,
,مااطعمتني,مااطعمتني,مااطعمتني,مااطعمتني,مااطعمتني,مااطعمتني,مااطعمتني,مااطعمتني,لمتطعمني,مااطعمتني,
,ياولدي,,,,,,,,,,
,انا,انا,انا,انا,انا,انا,انا,انا,انا,انا,
,اسقيتك,,,مشروبجيد,السكّر,,,,,,
,ما,,,ما,,,,,,,
,السكر,السكر,السكر,السكر,,السكر,السكر,السكر,السكر,السكر,
,والشراب,والشراب,والشراب,,والشراب,والشراب,والشراب,والشراب,والشراب,والشراب,
,الجيد,الجيد,الجيد,,الطيب,الجيد,الجيد,الجيد,الجيد,الجيد,
,,اسقيتك,اسقيتك,اسقيتك,اسقيتك,اسقيتك,اسقيتك,اسقيتك,اسقيتك,اسقيتك,
,,,الجيدوانتخبزحافمااطعمتني,,,,,,,,
,وانت,وانت,وانت,وانت,وانت,وانت,وانت,وانت,وانت,وانت,
,ما,ماء,ما,ما,ماء,مآ,ماء,ماء,ما,منما,
,منالبير,من,منالبير,مالح,منالجب,من,من,,منالبير,,
,,البحر,,,,البحر,البحر,,,البحر,
,ما,ما,ما,,ما,ما,ما,ما,ما,ما,
,اسقيتني,اسقيتني,اسقيتني,اسقيتني,اسقيتني,اسقيتني,اسقيتني,اسقيتني,اسقيتني,اسقيتني,
,يا,,,,,,,يا,,,
,ولدي,,,,,,,بني,,,
,انا,انا,انا,انا,انا,انا,انا,انا,انا,انا,
,علمتكوربيتك,علمتكوربيتك,علمتكوربيتك,رفعتكونصبتكوعليتكوفيمجلسالملكاجلستكوانتاحنيتنيوكببتنيوتحتالارضطمرتنه,علمتكوربيتك,علّمتكوربّيتك,علمتكوربيتك,علمتكوربيتك,علمتكوربيتك,علمتكوربيتك,
,,,واجبتك,,وجبتك,,,,واجبتك,,
,,,,اناربيتك,,,,,,,
,,احسنتربيهوانشيتك,,,,احسنتربيهوانشيتك,احسنتربيهوانشيتك,احسنتربيهوانشيتك,,احسنتربيهوانشيتك,
,,,للوجود,وعلمتكومثل,,,,,الى,,
,,,,,الوجود,,,,الوجود,,
,,,,الارز,,,,,,,
,وانتحفرتلي,,وانتحفرتلي,,وانتحفرتلي,,,,وانتحفرتلي,,
,,,,الطايل,,,,,,,
,مطموره,,مطموره,انشيتكوانتعكفتنيوحدبتنيوفيالمطمورااخفيتنيياولدي,مطموره,,,,مطمورة,,
,واخفيتني,,واخفيتني,,واخفيتني,,,,واخفيتني,,
,,,اناربيتك,,اناربيتك,,,,,,
,ياولديربيتكاحسنالتربيةوانشيتك,,,,,,,,اناانشيتك,,
,,,احسنتربيهوانشيتك,,احسنتربيهوانشيتك,,,,,,
,مثل,مثل,متل,,مثل,مثل,مثل,مثل,مثل,مثل,
,الارز,,الارز,,,الارز,الارز,الارز,الارز,,
,,الأرز,,,ارز,,,,,ارز,
,الطايل,,الطايل,,الطايل,,,,,,
,,الطويل,,,,الطويل,الطويل,الطويل,الطويل,لبنان,
,وانت,وانت,وانت,,وانت,وانت,وانت,وانت,وانت,وانت,
,احدبتني,جدبتني,جدبتني,,اعكفتنيواحدبتنيمنكثره,جدبتني,جدبتني,جدبتني,احنيتنيوأعقفتنيباسايك,جدبتني,
,واعكفتني,واعكفتني,واعكفتني,,,واعكفتنى,واعكفتني,واعكفتني,,واعكفتني,
,,,,,شرورك,,,,,,
,,من,من,,,من,من,من,,من,
,,,شرورك,,,,,,,,
,,اساياك,,,,اساياك,اساياك,اساياك,,اسائك,
,,,واساياك,,,,,,,,
,يا,يا,يا,,يا,يا,يا,يا,يا,يا,
,ولدي,بني,بني,,بني,بنيّ,بني,بني,بني,بني,
,انا,انا,انا,,انا,انا,انا,انا,انا,انا,
,,,,,كنتاظن,,,,,,
,كان,كان,كان,كان,,كان,كان,كان,,كان,
,املي,املي,املي,أمليان,,املي,املي,املي,املي,املي,
,,,,,,,,,كان,,
,منك,,,,,,,,,,
,انك,انك,انك,,,انك,انك,انك,انك,انك,
,تبني,تبني,تبني,تبني,تبني,تبني,تبني,تبني,تبني,تبتني,
,لي,لي,لي,لي,لي,لي,لي,لي,لي,لي,
,برجًا,برجًا,برجًا,برجًا,برج,برجًا,برجًا,برجًا,برجًا,برجًا,
,حصينًا,حصين,حصين,حصين,حصين,حصين,حصين,حصين,حصينًا,حصين,
,حتىانستر,لاستتر,لاستتر,لكياستقر,لاستتر,لاستتر,لاستتر,لاستتر,لاستتر,لاستتر,
,فيه,فيه,فيه,فيه,فيه,فيه,فيه,فيه,فيه,فيه,
,من,من,من,,من,من,من,من,من,من,
,اعداي,اعداي,اعداي,,اعداي,اعداي,اعداي,اعداي,اعداي,اعدايي,
,وانت,وانت,وانت,فانت,فانت,وانت,وانت,وانت,وانت,وانت,
,صرت,صرت,صرت,,صرت,صرت,صرت,صرت,صرت,صرت,
,لي,لي,,,لي,لي,لي,لي,لي,ليّ,
,كالدافن,كالدافن,كالدافن,,كالدافن,كالدافن,كالدافن,كالدافن,كالدافن,كالدافن,
,في,في,في,في,وفي,في,في,في,في,في,
,بطن,بطن,بطن,بطن,بطن,بطن,بطن,بطن,بطن,بطن,
,الارض,الأرض,الارض,الارض,الارض,الارض,الارض,الارض,الارض,الارض,
,,ولكن,,دفنتني,طمرتني,,ولكن,ولكن,,,
,لكن,,لكن,لكن,لكن,لكن,,,لكن,لكن,
,الرب,الرب,الرب,الرب,الرب,الرب,الرب,الرب,الرب,الرب,
,نجانيورحمنيمنمكرك,رحمني,رحمني,رحمني,رحمني,رحمني,رحمني,رحمني,رحمني,رحمني,
,,,,وخلصنيمنشركك,,,,,,,
,يا,يا,يا,يا,يا,يا,يا,يا,يا,يا,
,ولدي,بني,ولدي,بني,ولدي,بنيّ,بني,بني,بني,بني,
,انا,انا,انا,انا,انا,انا,انا,انا,انا,انا,
,اردت,اردت,ردت,اردت,ردت,اردت,اردت,اردت,ردت,اردت,
,لك,لك,لك,لك,لك,لك,لك,لك,,لك,
,الخيروانتجازيتني,الخيروانتجازيتني,الخيروانتجازيتني,الخيروانتجازيتني,الخيروانتجازيتني,الخيروانتجازيتني,الخيروانتجازيتني,الخيروانتجازيتني,الخيروانتجازيتني,الخيروانتجازيتني,
,شرًا,شرًا,شرًا,بالقبيحوكلسو,شرًا,شرًا,شرًا,شرًا,شرًا,شرًا,
,وقبيح,وقبيح,وقبيح,,وقبيح,وقبيح,وقبيح,وقبيح,,وقبيح,
,,,,الان,,,,,,,
,,,الان,,الان,,,,,,
,والان,والان,,,,والان,والان,والان,والان,والان,
,اريد,اريد,اريد,اريد,اريد,اريد,اريد,اريد,اريد,اريد,
,اقلع,اقلع,اقلع,اقلع,اقلَّع,اقلع,اقلع,اقلع,اقلع,اقلّع,
,عينيك,عينيك,عينيك,عينيك,عينيك,عينيك,عينيك,عينيك,عينيك,عينيك,
,واجعلكماكلًا,واجعلكماكلًا,واجعلكماكلًا,,واجعلكماكلًا,واجعلكماكلًا,واجعلكماكلًا,واجعلكماكلًا,واجعلكماكلًا,واجعلكماكلًا,
,للكلاب,للدياب,للدياب,,للدياب,للدياب,للدود,للدياب,للدياب,للدياب,
,واقطع,واقطع,واقطع,واقطع,واقطع,واقطع,واقطع,واقطع,واقطع,واقطع,
,لسانك,لسانك,لسانك,لسانك,لسانك,لسانك,لسانك,لسانك,لسانك,لسانك,
,وفي,وفي,وفي,واقطعبالسيف,وفي,وفي,وفي,وفي,وفي,وفي,
,حد,حد,حد,,,حدّ,حد,حد,,حدّ,
,السيف,السيف,السيف,,السيف,السيف,السيف,السيف,السيف,السيف,
,اخد,اخد,اخد,,اخذ,اخذ,اخد,اخد,اخذ,اخذ,
,راسك,راسك,راسك,راسك,راسك,راسك,راسك,راسك,راسك,راسك,
,وجازيك,واجازيك,واجازيك,واجازيك,واجازيك,واجازيك,واجازيك,واجازيك,واجازيك,واجازيك,
,عوضافعالك,عوضافعالك,عوضافعالك,عوضافعالك,عوضافعالك,عوضافعالك,عوضافعالك,عوضافعالك,عوضافعالك,عوضافعالك,
,الشنيعه,الشنيعه,الشنيعه,القبيحه,القبيحه,الشنيعه,الشنيعه,الشنيعه,الشنيعة,الشنيعه,
,فلماسمع,,,السمجه,,,,,,,
,,,,مثلها,مثلها,,,,,,
,,فاجاب,فاجاب,فاجاب,فاجاب,فاجاب,فاجاب,فاجاب,فاجاب,فاجاب,
,نادان,نادان,نادان,نادان,نادان,نادان,نادان,نادان,نادان,نادان,
,من,وقاللحيقار,وقاللحيقار,وقاللحيقار,وقاللحيقار,وقاللحيقار,وقاللحيقار,وقاللحيقار,وقاللحيقار,وقاللحيقار,
,خاله,خاله,,,,خاله,خاله,خاله,,خاله,
,حيقارهذاالكلامفقال,,,,,,,,,,
,ياخالي,,,ياخالي,,,,,,,
,اصنعمعي,اصنعمعي,اصنعمعي,اصنعمعي,اصنعمعي,اصنعمعي,اصنعمعي,اصنعمعي,اصنعمعي,اصنعمعي,
,مثل,مثل,متل,مثل,مثل,مثل,مثل,مثل,مثل,مثل,
,معرفتك,معروفك,معرفتك,معروفك,معروفك,معروفك,معروفك,معروفك,معرفتك,معروفك,
,واغفر,واغفر,واغفر,واغفر,واغفر,واغفر,واغفر,واغفر,واغفر,واغفر,
,لي,لي,لي,لي,لي,لي,لي,لي,لي,ليّ,
,اثامي,اثامي,اتامي,ذنبيوماصنعتمعكمنالاسافمتليمنيخطئ,اثامي,اثامي,اتامي,اتامي,اثامي,اثامي,
,لان,لان,لان,,لان,لان,لان,لان,لان,لان,
,,,,ومتلك,,,,,,,
,مثلي,مثلي,متلي,,مثلي,مثلي,مثلي,مثلي,مثلي,مثلي,
,من,من,من,,من,من,من,من,من,من,
,يخطي,يخطى,يخطي,,يخطي,يخطي,يخطي,يخطي,يخطي,يخطي,
,,,ومتلك,,,,,,,,
,ومثلك,ومثلك,,,ومثلك,ومثلك,ومثلك,ومثلك,ومثلك,ومثلك,
,من,من,من,من,من,من,من,من,من,من,
,يعفي,يغفر,يعفي,يعفي,يعفي,يغفر,يغفر,يغفر,يغفر,يغفر,
,اقبلني,واقبلني,اقبلني,اقبلني,اقبلني,واقبلني,واقبلني,واقبلني,اقبلني,واقبلني,
,ياخالي,,,,,,,,,,
,الان,الان,الان,الان,الان,الان,الان,الان,الان,الان,
,,ان,,حتى,,ان,ان,,,ان,
,اخدم,اخدم,اخدم,اخدم,اخدم,اخدم,اخدم,اخدم,اخدم,اخدم,
,في,في,في,,في,في,في,في,في,في,
,بيتك,بيتك,بيتك,بيتك,بيتك,بيتك,بيتك,بيتك,بيتك,بيتك,
,واسيس,واسوس,واسوس,,واسوس,واسوس,واسوس,واسوس,واسوس,واسوس,
,خيلك,خيلك,خيلك,,خيلك,خيلك,خيلك,خيلك,خيلك,خيلك,
,وكنّس,واكنس,واكنس,,واكنس,واكنس,واكنس,واكنس,واكنس,واكنس,
,زبل,ذبلهم,زبل,,زبل,زبلهم,زبلهم,زبلهم,ذبل,زبلهم,
,دوابك,,دوابك,,بيتك,واربا,,,دوابك,وارعى,
,وارعا,وارعا,وارعا,,وارعا,,وارعا,وارعا,اوارعي,,
,اغنامك,خنازيرك,خنازيرك,,خنازيرك,خنازيرك,خنازيرك,خنازيرك,خنازيرك,خنازيرك,
,لانني,لاني,لاني,,لاني,لانني,لاني,لاني,لاني,لاني,
,اناالشريروانت,اناالشريروانت,اناالشريروانت,اناالشريروانت,اناالشريروانت,اناالشريروانت,اناالشريروانت,اناالشريروانت,اناالشريروانت,اناالشريروانت,
,الصالح,الصالح,الصالح,الصالح,الصالح,الصالح,الصالح,الخيّر,الصالح,الصالح,
,انا,انا,,انا,,انا,انا,,,انا,
,,,وانا,,وانا,,,وانا,,,
,المدنب,المدنب,المدنب,,,,المدنب,,,,
,,,,المذنب,المذنب,المذنب,,المذنب,,المذنب,
,وانت,وانت,وانت,وانت,وانت,وانت,وانت,وانت,وانت,وانت,
,المسامح,المسامح,المسامح,المسامح,المسامح,المسامح,المسامح,المسامح,المسامح,المسامح,
,,,,,,,,,واناالمذنب,,
,فقال,فقال,فقال,فقال,فقال,فقال,فقال,فقال,فقال,فقال,
,له,لهُ,له,له,له,له,لهُ,لهُ,له,له,
,حيقاريا,حيقاريا,حيقاريا,حيقاريا,حيقاريا,حيقاريا,حيقاريا,حيقاريا,حيقاريا,حيقاريا,
,ولدي,بني,ولدي,ولدي,بني,بنيّ,بني,بني,بني,بني,
,انت,انت,انت,انت,انت,انت,انت,انت,انت,انت,
,مثل,مثل,متل,تشبهالشجرا,مثل,مثل,مثل,مثل,مثل,مثل,
,الشجره,الشجرة,الشجرة,,الشجرة,الشجره,الشجره,الشجرة,السجرة,الشجره,
,الذي,التي,الدي,التي,التي,الذي,التي,التي,التي,التي,
,كانت,كانت,كانت,كانت,كانت,كانت,كانت,كانت,كانت,كانت,
,على,على,,مغروسه,,على,على,على,علي,على,
,جانب,جانب,بجانب,بجانب,بجانب,جانب,جانب,جانب,جانب,جانب,
,الما,المآء,الما,الماولمتتمر,الماء,المآ,الماء,الماء,الما,الماء,
,عديمت,عديمت,عديمة,,عديمة,عديمة,عديمة,عديمة,عديمت,عديمة,
,التمر,التمر,التمر,,الثمر,الثمر,التمر,التمر,الثمر,الثمر,
,فراد,فاراد,فارد,فاراد,فاراد,فاراد,فاراد,فاراد,فاراد,فاراد,
,صاحبها,صاحبها,صاحبها,صاحبها,صاحبها,صاحبها,صاحبها,صاحبها,صاحبها,صاحبها,
,ان,,,,,,,,,,
,يقطعهافقالت,يقطعهافقالت,يقطعهافقالت,يقطعهافقالت,يقطعهافقالت,يقطعهافقالت,يقطعهافقالت,يقطعهافقالت,يقطعهافقالت,يقطعهافقالت,
,له,له,له,له,له,له,لهُ,لهُ,له,له,
,حولني,حولني,حولني,حولني,حولني,حوّلني,حولني,حولني,حولني,حولني,
,الى,الى,الي,,الى,الى,الى,الى,الى,الى,
,مكان,موضع,مكان,مكان,مكان,مكان,موضع,موضع,مكان,مكانٍ,
,اخر,اخر,اخر,اخر,اخر,اخر,اخر,اخر,اخر,اخر,
,فانلم,فانلم,فانلم,حتى,فانلم,فانلم,فانلم,فانلم,فانلم,فانلم,
,اتمر,اتمر,اتمر,اثمر,اثمر,اثمر,اتمر,اتمر,اثمر,اثمر,
,الّا,فاقطعني,,,,,فاقطعني,فاقطعني,,,
,اقطعني,,اقطعني,,اقطعني,اقطعني,,,اقطعني,اقطعني,
,فقال,فقال,فقال,فقال,فقال,فقال,فقال,فقال,فقال,فقال,
,لها,لها,لها,لها,لها,لها,لها,لها,,لها,
,صاحبها,صاحبها,صاحبها,,صاحبها,صاحبها,صاحبها,صاحبها,,صاحبها,
,انت,وانتي,انتي,انتي,انتي,انتي,وانتي,وانتي,انتي,انتي,
,على,على,على,علي,على,على,على,على,علي,على,
,جانب,جانب,جانب,جانب,جانب,جانب,جانب,جانب,جانب,جانب,
,الما,المآء,الما,الما,الما,الما,الماء,الماء,الما,[الماء],
,لم,لم,,طولعمرك,,لم,لم,لم,,,
,,,ولم,ولم,ولم,,,,ولم,ولم,
,,,تتمري,تثمري,تثمري,تثمري,تتمري,تتمري,تثمري,تثمري,
,,,فكيف,فكيف,فكيف,فكيف,فكيف,فكيف,فكيف,فكيف,
,تثمري,تثمري,,انحولتكعنالماتعطيتمر,تثمري,تثمري,,,تثمري,تثمري,
,,فكيف,,,,,,,,,
,كيفتتمرى,,,,,,,,,,
,,تتمري,تتمري,,,,تتمري,تتمري,,,
,وانت,وانت,,,,وانتي,وانتي,وانت,وانت,وانتي,
,فيغيرمكان,فيغيرمكان,فيغيرمكان,,فيغيرمكان,فيغيرمكان,فيغيرمكان,فيغيرمكان,فيغيرمكان,فيغيرمكان,
,يا,يا,يا,يا,يا,يا,يا,يا,يا,يا,
,ولدي,بني,بني,ولدي,ولدي,بنيّ,بني,بني,بني,بني,
,شيخوخة,شيخوخة,شيخوخة,شيخوخة,شيخوخة,شيخوخة,شيخوخة,شيخوخة,شيخوخت,شيخوخة,
,النسر,النسر,النسر,النسر,النسر,النسر,النسر,النسر,النسر,النسر,
,اخير,اخير,اخير,افضل,اخير,اخير,اخير,اخير,اخير,اخير,
,من,من,من,من,من,من,من,من,من,من,
,شبوبية,شبوبية,شبوبية,شبوبيت,شبوبيت,شبوبية,شبوبية,شبوبية,شبوبيت,شبوبية,
,الغرابيا,الغرابيا,الغرابيا,الغرابيا,الغرابيا,الغرابيا,الغرابيا,الغرابيا,الغرابيا,الغرابيا,
,ولدي,بني,بني,بني,بني,بنيّ,بني,بني,بني,بني,
,قالوا,قالوا,قالوا,ادخلو,قالوا,قالوا,قالوا,قالوا,قالوا,قالوا,
,للديب,للديب,للديب,,للديب,للديب,للديب,للديب,للذيب,للديب,
,ابعدعنالغنمليلا,ابعدعنالغنمليلا,ابعدعنالغنمليلا,,ابعدعنالغنمليلا,ابعدعنالغنمليلا,ابعدعنالغنمليلا,ابعدعنالغنمليلا,ابعدعنالغنمليلا,ابعدعنالغنمليلا,
,يوذيك,يوديك,يوديك,,يوذيك,يوذيك,يوديك,يوديك,يوذوكبغبارهم,يؤذيك,
,غبارهم,غبارهم,غبارهم,,غبارهم,غبارهم,غبارهم,غبارهم,,غبارهم,
,فقال,فقال,فقال,,فقال,فقال,فقال,فقال,فقال,فقال,
,الديب,لهم,لهم,الديب,لهم,لهم,لهم,لهم,,لهم,
,غبارالغنم,انغبارهم,انغبارهم,الى,انغبارهم,انغبارهم,انغبارهم,انغبارهم,انغبارهم,انغبارهم,
,نافع,نافع,نافع,,نافع,نافع,نافع,نافع,نافع,نافع,
,لعيناي,لعيناي,لعيناي,,لعيناي,لعيناي,لعيناي,لعيناي,لعيني,لعيناي,
,ياولديادخلوا,ياولديادخلوا,ياولديادخلوا,,ياولديادخلوا,ياولديادخلوا,ياولديادخلوا,ياولديادخلوا,ياولديادخلوا,ياولديادخلوا,
,الديب,الديب,الديب,,الديب,الديب,الديب,الديب,الذيب,الديب,
,للكتاب,للكتاب,للكتاب,الكتاب,الكتاب,للكتّاب,للكتاب,للكتاب,الكتاب,للكتاب,
,حتى,حتى,حتى,حتايعلموهالقراه,حتى,حتى,حتى,حتى,ليتعلمالقراءة,حتى,
,يتعلم,يتعلم,يتعلم,,يتعلم,يتعلّم,يتعلم,يتعلم,,يتعلم,
,القرايه,القراءه,القراية,,القرااه,القرايه,القراءه,القراءه,,القراة,
,فقالوا,فقالوا,فقال,فقال,فقال,فقالوا,فقالوا,فقالوا,فقالوا,فقالوا,
,له,له,له,له,له,له,لهُ,لهُ,له,لهُ,
,,,المعلم,المعلم,المعلم,,,,قل,قل,
,قول,قول,قول,قول,قول,قول,قول,قول,,,
,الف,الف,الف,اليف,الف,الف,الف,الف,الف,الف,
,بَا,با,با,,با,با,با,با,با,با,
,,تا,نا,,تا,تا,,تا,تا,تا,
,,سا,ثا,,,سا,سا,سا,ثا,ثا,
,قال,فقال,قال,قال,قال,فقال,فقال,فقال,فقال,فقال,
,خروف,,خروف,,خروف,,,,,,
,,خاروف,,,,خاروف,خاروف,خاروف,خاروف,خاروف,
,وجدي,عنز,وعنز,عنز,عنزي,عنز,عنز,عنز,عنز,عنز,
,,جدي,جدي,جدي,جدي,جدي,جدي,جدي,جدي,جدي,
,,,,خاروف,,,,,,,
,,غنم,,,,,غنم,غنم,,,
,,كما,كما,ياولديصدق,كما,كما,كما,كما,كما,كما,
,في,في,في,,في,في,في,في,في,في,
,بطني,بطني,بطني,,قلبي,بطني,بطني,بطني,بطني,بطني,
,يا,يا,يا,,يا,يا,يا,يا,يا,يا,
,ولديوضعوا,بني,بني,,بني,بنيّ,بني,بني,بني,بني,
,,وضعواراس,وضعواراس,,وضعواراس,وضعواراس,وضعواراس,وضعواراس,وضعواراس,وضعواراس,
,الحمار,الحمار,الحمار,,الحمار,الحمار,الحمار,الحمار,الحمار,الحمار,
,علىالمايده,علىالمايده,علىالمايده,,علىالمايده,علىالمايده,علىالمايده,علىالمايده,عليالمايدة,علىالمايده,
,فوقعوبدا,فوقعوبدا,فوقعوبدا,,فوقعوبدا,فوقعوبدا,فوقعوبدا,فوقعوبدا,فوقعوبدا,فوقعوبدا,
,يتمرمغ,يتمرغ,يتمرغ,,يتمرَّغ,يتمرّغ,يتمرغ,يتمرغ,يتمرغ,يتمرغ,
,في,في,في,,في,في,في,,في,في,
,التراب,التراب,التراب,,التراب,التراب,التراب,,التراب,الثراب,
,فقال,فقال,فقال,,فقالوا,فقال,فقال,,فقال,فقال,
,ادعوهيتمرمغ,دعوه,دعوه,,دعوه,دعوه,دعوه,,دعوه,دعوه,
,,يتمرغ,يتمرغ,,يتمرّغ,يتمرّغ,يتمرغ,,يتمرغ,يتمرّغ,
,لانطبعه,لانطبعه,لانطبعه,,لانطبعه,لانطبعه,لانطبعه,لانطبعه,لانطبعه,لانطبعه,
,ما,ما,ما,,ما,ما,ما,ما,لا,لا,
,يتغير,يتغير,يتغير,,يتغيّر,يتغيّر,يتغير,يتغير,يتغير,يتغير,
,يا,يا,يا,,يا,يا,يا,يا,يا,يا,
,ولدي,بني,ولدي,,ولدي,بنيّ,بني,بني,بني,بني,
,قد,قد,قد,,قد,قد,قد,قد,قد,قد,
,ثبت,تبت,تبت,,ثبت,ثبت,تبت,تبت,ثبت,ثبت,
,القول,القول,القول,,قول,القول,القول,القول,قول,القول,
,الذي,لمن,لمن,الذي,من,لمن,لمن,لمن,القايل,لمن,
,قال,قال,قال,قال,قال,قال,قال,قال,,قال,
,اذا,اذا,ادا,انالذيتولده,اذا,اذا,اذا,اذا,اذا,اذا,
,ولدت,ولدت,ولدت,,ولدت,ولدت,ولدت,ولدت,ولدت,ولدت,
,ولدًا,ولدًا,ولدًا,,ولدًا,ولدًا,ولدًا,ولدًا,ولدًادعوه,ولدًا,
,ادعيه,ادعيه,ادعيه,ادعيه,ادعيه,ادعيه,ادعيه,ادعيه,,ادعيه,
,ابنك,ابنك,ابنك,ابنك,ابنك,ابنك,ابنك,ابنك,ابنك,ابنك,
,واذا,واذا,وادا,والذيتربيه,واذا,واذا,واذا,واذا,واذا,واذا,
,ربيت,ربيت,ربيت,,ربيت,ربيّت,ربيت,ربيت,ربيت,ربيت,
,ولدًا,ولدًا,ولدًا,,ولدًا,ولدًا,ولدًا,ولدًا,ولدًا,ولدًا,
,ادعيه,ادعيه,ادعيه,ادعيه,ادعيه,ادعيه,ادعيه,ادعيه,ادعوه,ادعيه,
,عبدك,عبدًا,عبدك,عبدك,عبدك,عبدًا,عبدًا,عبدًا,عبدك,عبدًا,
,يا,يا,يا,يا,يا,يا,يا,يا,يا,يا,
,ولدي,بني,بني,بني,بني,بنيّالذى,بني,بني,بني,بني,
,الذي,الذي,الدي,الذي,الذي,,الذي,الذي,الذي,الذي,
,يعملالخير,يعملالخير,يعملالخير,يعملالخير,يعملالخير,يعملالخير,يعملالخير,يعملالخير,يعملالخير,يعملالخير,
,خير,,,يلقيالخير,,,,,فيلقي,,
,,خيرًا,خيرًا,,خيرًا,خيرًا,خيرًا,خيرًا,خيرًا,خيرًا,
,يلقا,يلقا,يلقا,,يلقا,يلقا,يلقا,يلقا,,يُلقى,
,والذي,والذي,والدي,والذي,والذي,والذى,والذي,والذي,والذي,والذي,
,يصنع,يصنع,يصنع,يصنع,يصنع,يصنع,يصنع,يصنع,يصنع,يصنع,
,الشر,الشر,الشر,الشر,الشر,الشرّ,الشر,الشر,الشر,الشر,
,,شرا,,يلقاهايضًا,,,,,فيلقي,,
,شرًا,,شرًا,,شرًا,شرًا,شرًا,شرًا,شرًا,شرًا,
,يلقا,يلقا,يلقا,,يلقا,يلقا,يلقا,يلقا,,يلقا,
,لانالربيجازيالانسان,لانالربيجازيالانسان,لانالربيجازيالانسان,لانالربيجازيالانسان,لانالربيجازيالانسان,لانالربيجازيالانسان,لانالربيجازيالانسان,لانالربيجازيالانسان,لانالربيجازيالانسان,لانالربيجازيالانسان,
,على,على,على,علي,على,على,على,على,كعمله,على,
,قدر,قدر,قدر,قدر,قدر,قدر,قدر,قدر,,قدر,
,عمله,عمله,عمله,افعالهواعماله,عمله,عمله,عمله,عمله,,عمله,
,يا,يا,يا,يا,يا,يا,يا,يا,يا,يا,
,ولدي,بني,بني,ولدي,ولدى,بنيّ,بني,بني,بني,بني,
,ايش,ايش,ايش,ايش,ايش,ايش,ايش,ايش,ماذا,ايش,
,اقوللك,اقوللك,اقوللك,اكلمك,اكلمك,اقوللك,اقوللك,اقوللك,اقوللك,اقوللك,
,اكترمن,اكثرمنهذا,اكترمن,اكثرمنهذا,اكثرمنهذا,اكثرمنهذا,اكثرمنهذا,اكثرمنهذا,اكثرمنهذا,اكثرمنهذا,
,هذاالقولالان,,هدا,,,,,,,,
,,الكلاملان,الكلاملان,الكلاملان,الكلاملان,الكلاملان,الكلاملان,الكلاملان,الكلاملان,الكلاملان,
,الله,الله,الرب,الرب,الله,الله,الله,الله,الله,الله,
,عالم,عالم,عالم,عالم,عالم,عالم,عالم,عالم,عالم,عالم,
,الخفايا,بالخفايا,الخفيا,الضمايروالسروالخفايا,الخفايا,الخفايا,بالخفايا,بالخفايا,الخفايا,الخفايا,
,ويعرفالسرايروالضماير,ويعرفالسرايروالضماير,ويعرفالسرايروالضماير,,ويعرفالسرايروالضماير,ويعرفالسرايروالضماير,ويعرفالسرايروالضماير,ويعرفالسرايروالضماير,ويعرفالسرايروالضماير,ويعرفالسرايروالضماير,
,فهو,فهو,فهو,وهو,فهو,فهو,فهو,فهو,وهو,فهو,
,يجازيكويحكم,يجازيكويحكم,يجازيكويحكم,يجازيكويحكم,يجازيكويحكم,يجازيكويحكم,يجازيكويحكم,يجازيكويحكم,يجازيكويحكم,يحكم,
,بينيوبينك,بينيوبينك,بينيوبينك,بينيوبينك,بينيوبينك,بينيوبينك,بينيوبينك,بينيوبينك,بينيوبينك,بينيوبينك,
,,,,,,,,,,ويجازيك,
,ويكافيك,ويكافيك,ويكافيك,ويكافيك,ويكافيك,ويكافيك,ويكافيك,ويكافيك,ويكافيك,ويكافيك,
,بما,بما,بما,بما,بما,بما,بما,بما,ما,بما,
,تستحق,تستحق,تستحق,تستحق,تستحق,تستحق,تستحق,تستحق,تستحق,تستحق,
