t_430,t_ms_syr_434,t_syr_422,t_syr_611,t_syr_612,t_unknown
omisit,ܐܡܪܡܪܝܐܘܕܥܕܟܠܕܥܒܕܕܒܝܫܒܝܫܡܬܦܪܥܘܕܥܒܕܕܛܒ,,,ܟܚ,
,,ܘܟܕܫܡܥܕܝܢܢܕܢܣܟܠܐܡܠܐܗܠܝܢ,ܘܟܕܫܡܥܕܝܢܢܕܢܣܟܠܐܡܠܐܗܠܝܢ,ܘܟܕܫܡܥܕܝܢܢܕܢܣܟܠܐܡܠܐܗܠܝܢ,ܘܟܕܫܡܥܕܝܢܢܕܢܣܟܠܐܡܠܐܗܠܝܢ
,,,,unclear,
,,,ܐܬܢܦܚ,ܐܬܢܦܚ,ܐܬܢܦܚ
,,ܒܪܫܥܬܗ,ܒܪܫܥܬܗ,ܒܪܫܥܬܗ,ܒܪܫܥܬܗ
,,ܐܬܢܦܚ,,,
,,ܘܗܘܐܐܝܟ,ܘܗܘܐܐܝܟ,ܘܗܘܐܐܝܟ,ܘܗܘܐܐܝܟ
,,ܓܪܒܐ,ܙܩܐ,ܙܩܐ,ܙܩܐ
,,ܕܢܦܝܚ,ܕܢܦܝܚ,ܕܢܦܝܚ,ܕܢܦܝܚ
,,ܘܗܘܬܚܪܬܗܠܐܒܕܢܐܘܐܙܠܠܓܗܢܐܒܕܐܡܝܪܗܟܝܠܒܟܬܒܐܕܡܬܠܐ,ܘܐܒܕ,ܘܐܒܕ,ܘܐܒܕ
,,,ܘܐܬܦܪܬܘ,ܘܐܬܦܪܬ,ܘܐܬܦܪܬܘ
,,,ܕܦܢܬܗܘܡܝܬܐܟܡܐܕܐܡܝܪܒܡܬܠܐ,ܕܦܢܬܗܘܡܝܬܐܟܡܐܕܐܡܝܪܒܡܬܠܐ,ܕܦܢܬܗܘܡܝܬܐܟܡܐܕܐܡܝܪܒܡܬܠܐ
,,ܕܢܥܒܕ,ܕܢܥܒܕ,ܕܢܥܒܕ,ܕܢܥܒܕ
,,,ܓܝܪ,ܓܝܪ,ܓܝܪ
,,ܛܒܬܐ,ܛܒܬܐ,ܛܒܬܐ,ܛܒܬܐ
,ܒܛܒܬܐ,ܒܛܒܬܐ,ܛܒܬܐ,,ܛܒܬܐ
,ܡܬܦܪܥ♰,ܢܐܪܥܝܘܗܝ,ܢܦܪܥܝܘܗܝ,ܢܦܪܥܝܘܗܝ,ܢܦܪܥܝܘܗܝ
,,ܡܪܝܐ,ܡܪܝܐ,ܡܪܝܐ,ܡܪܝܐ
,,ܘܕܢܥܒܕܒܝܫܬܐ,ܘܒܝܫܬܐܬܘܒ,ܘܒܝܫܬܐܬܘܒ,ܘܒܝܫܬܐܬܘܒ
,,ܒܒܝܫܬܐ,ܒܒܝܫܬܐ,ܒܒܝܫܬܐ,ܒܒܝܫܬܐ
,,ܢܐܪܥܝܘܗܝܡܪܝܐܘܕܚܦܪܠܡܒܪܐܠܚܒܪܗܗܘܢܦܠܒܗܘܕܨܠܐܦܚܐܗܘܡܬܬܚܕܒܗܘܡܑܚܓܪܒܗܘܬܐܫܝܘܠܝܬܐ,ܢܬܦܪܥ,ܢܬܦܪܥ,ܢܬܦܪܥ
,,,,ܫܠܡ,
