{
    "annotationCollection": {
    "total": 3,
    "creator": "Michelle Weidling",
    "first": "https://subugoe.pages.gwdg.de/emo/backend/sampledata/document1/1/annotationPage.json",
    "label": "Annotations for Document 1, page 1",
    "type": "AnnotationCollection",
    "id": "http://tido.sub.uni-goettingen.de/ns/annotations/annotationCollection/document1/1"
    }
}
