{
	"textapi": "0.2.0",
	"type": "page",
	"title":
		{
		  "title": "An Example Item For Document 2.",
		  "type": "main"
		},
	"lang": [
		"ger"
	],
	"content": 
		[
			{
				"url": "https://subugoe.pages.gwdg.de/emo/backend/sampledata/document2/4/latest/content.html",
				"type": "application/xhtml+xml"
			}
		],
	"image": {
     "id": "https://subugoe.pages.gwdg.de/emo/backend/test-handwriting.png"
   }
}
