{
    "textapi": "0.2.0",
    "title":
       {
          "title": "A from Goethe to someone else.",
          "type": "main"
       },
    "type": "page",
    "lang": [
       "ger"
    ],
    "content": 
       [
          {
             "url": "https://subugoe.pages.gwdg.de/emo/backend/sampledata/document5/1/latest/content.html",
             "type": "application/xhtml+xml;type=transcription"
          }
       ],
    "image": {
      "id": "https://subugoe.pages.gwdg.de/emo/backend/test-text.png"
    },
    "annotationCollection": "https://subugoe.pages.gwdg.de/emo/backend/sampledata/document5/1/annotationCollection.json"
 }
 