{
  "annotationPage": {
    "items": [
      {
        "body": {
          "type": "TextualBody",
          "value": "Fancy Lorem Ipsum Annotation 1",
          "format": "text/plain",
          "x-content-type": "Person"
        },
        "target": {
          "source": "https://subugoe.pages.gwdg.de/emo/backend/sampledata/document1/1/latest/content.html",
          "selector": {
            "type": "RangeSelector",
            "startSelector": {
              "type": "CssSelector",
              "value": "span[data-target='anno0_start']"
            },
            "endSelector": {
              "type": "CssSelector",
              "value": "span[data-target='anno0_end']"
            }
          }
        },
        "type": "Annotation",
        "id": "http://tido.sub.uni-goettingen.de/ns/annotations/document1/1/annotation-annotation0"
      },
      {
        "body": {
          "type": "TextualBody",
          "value": "An Annotation with OverŁÄÞ",
          "format": "text/plain",
          "x-content-type": "Person"
        },
        "target": {
          "source": "https://subugoe.pages.gwdg.de/emo/backend/sampledata/document1/1/latest/content.html",
          "selector": {
            "type": "RangeSelector",
            "startSelector": {
              "type": "CssSelector",
              "value": "span[data-target='annoOverlap_start']"
            },
            "endSelector": {
              "type": "CssSelector",
              "value": "span[data-target='annoOverlap_end']"
            }
          }
        },
        "type": "Annotation",
        "id": "http://tido.sub.uni-goettingen.de/ns/annotations/document1/1/annotation-annotation345"
      },
      {
        "body": {
          "type": "TextualBody",
          "value": "Fancy Lorem Ipsum Annotation 345",
          "format": "text/plain",
          "x-content-type": "Person"
        },
        "target": {
          "source": "https://subugoe.pages.gwdg.de/emo/backend/sampledata/document1/1/latest/content.html",
          "selector": {
            "type": "RangeSelector",
            "startSelector": {
              "type": "CssSelector",
              "value": "span[data-target='anno345_start']"
            },
            "endSelector": {
              "type": "CssSelector",
              "value": "span[data-target='anno345_end']"
            }
          }
        },
        "type": "Annotation",
        "id": "http://tido.sub.uni-goettingen.de/ns/annotations/document1/1/annotation-annotation345"
      },
      {
        "body": {
          "type": "TextualBody",
          "value": "A person's name. See also http://d-nb.info/gnd/118829211",
          "format": "text/plain",
          "x-content-type": "Person"
        },
        "target": {
          "format": "text/html",
          "language": "ger",
          "id": "http://tido.sub.uni-goettingen.de/ns/annotations/document1/1/annotation1"
        },
        "type": "Annotation",
        "id": "http://tido.sub.uni-goettingen.de/ns/annotations/document1/1/annotation-annotation1"
      },
      {
        "body": {
          "type": "TextualBody",
          "value": "A person's name. See also http://d-nb.info/gnd/118829211",
          "format": "text/plain",
          "x-content-type": "Person"
        },
        "target": {
          "format": "text/html",
          "language": "ger",
          "id": "http://tido.sub.uni-goettingen.de/ns/annotations/document1/1/annotation2"
        },
        "type": "Annotation",
        "id": "http://tido.sub.uni-goettingen.de/ns/annotations/document1/1/annotation-annotation2"
      },
      {
        "body": {
          "type": "TextualBody",
          "value": "A person's name. See also http://d-nb.info/gnd/118829211",
          "format": "text/plain",
          "x-content-type": "Person"
        },
        "target": {
          "format": "text/html",
          "language": "ger",
          "id": "http://tido.sub.uni-goettingen.de/ns/annotations/document1/1/annotation3"
        },
        "type": "Annotation",
        "id": "http://tido.sub.uni-goettingen.de/ns/annotations/document1/1/annotation-annotation3"
      }
    ],
    "partOf": {
      "total": 3,
      "label": "Annotations for Document 1, page 1",
      "id": "http://tido.sub.uni-goettingen.de/ns/annotations/annotationCollection/document1/1"
    },
    "@context": "http://www.w3.org/ns/anno.jsonld",
    "startIndex": 0,
    "prev": null,
    "next": null,
    "type": "AnnotationPage",
    "id": "http://tido.sub.uni-goettingen.de/ns/annotations/annotationPage/document1/1"
  }
}
