{
    "annotationCollection": {
		"total": 5,
		"@context": "http://www.w3.org/ns/anno.jsonld",
		"first": "https://subugoe.pages.gwdg.de/emo/backend/sampledata/document1/annotationPage.json",
		"label": "Annotations For the Sample Collection.",
		"last": "https://subugoe.pages.gwdg.de/emo/backend/sampledata/document1/annotationPage.json",
		"type": "AnnotationCollection",
		"id": "http://tido.sub.uni-goettingen.de/ns/annotations/annotationCollection/collection"
	}
}
  