{
  "$schema": "https://json-schema.org/draft/2020-12/schema",
  "$id": "license.json",
  "title": "TextAPI: License",
  "description": "The license or any other appropriate rights statement the resources is served under. It is REQUIRED to use one of SPDX.",
  "type": "object",
  "properties": {
    "@context": {
      "enum": ["https://gitlab.gwdg.de/subugoe/emo/text-api/-/raw/main/jsonld/license.jsonld"]
    },
    "id": {
      "description": "an SPDX identifier",
      "type": "string",
      "minLength": 2
    },
    "notes": {
      "description": "further notes concerning the license. can be used e.g. for the attribution statement of CC BY",
      "type": "string"
    }
  },
  "required": [ "@context", "id" ],
  "patternProperties": {
    "^x-": {}
  },
  "additionalProperties": false
}
