{
  "$schema": "https://json-schema.org/draft/2020-12/schema",
  "$id": "title.json",
  "title": "TextAPI: Title",
  "type": "object",
  "properties": {
    "@context": {
      "enum": ["https://gitlab.gwdg.de/subugoe/emo/text-api/-/raw/main/jsonld/title.jsonld"]
    },
    "title": {
      "description": "a single title",
      "type": "string",
      "minLength": 1
    },
    "type": {
      "description": "sub",
      "type": "string",
      "enum": [ "sub" ]
    }
  },
  "required": [ "@context", "title", "type" ],
  "patternProperties": {
    "^x-": {}
  },
  "additionalProperties": false

}
