{
    "textapi": "1.0.0",
    "@context": "https://gitlab.gwdg.de/subugoe/emo/text-api/-/raw/main/jsonld/item.jsonld",
    "id": "https://subugoe.pages.gwdg.de/emo/text-api/sample_server/ShakespearesWorks/12a34b/page90/fb406b265a779b43afa635bc8da79d81/item.json",
    "title": [
      {
        "@context": "https://gitlab.gwdg.de/subugoe/emo/text-api/-/raw/main/jsonld/title.jsonld",
        "title": "A Sample Item",
        "type": "main"
      },
      {
        "@context": "https://gitlab.gwdg.de/subugoe/emo/text-api/-/raw/main/jsonld/title.jsonld",
        "title": "A Subtitle",
        "type": "sub"
      }
    ],
    "type": "section",
    "n": "one",
    "lang": [
      "fre", "aci"
    ],
    "langAlt": ["karshuni"],
    "content": [
      {
        "@context": "https://gitlab.gwdg.de/subugoe/emo/text-api/-/raw/main/jsonld/content.jsonld",
        "type": "text/html",
        "url": "https://example.com/html-serialization-one.html"
      },
      {
        "@context": "https://gitlab.gwdg.de/subugoe/emo/text-api/-/raw/main/jsonld/content.jsonld",
        "type": "text/xml",
        "url": "https://example.com/xml-serialization-two.xml"
      }
    ],
    "description": "This is Section one of the Sample Manifest",
    "image": {
      "@context": "https://gitlab.gwdg.de/subugoe/emo/text-api/-/raw/main/jsonld/image.jsonld",
      "id": "https://example.com/image.png",
      "license": {
        "@context": "https://gitlab.gwdg.de/subugoe/emo/text-api/-/raw/main/jsonld/license.jsonld",
        "id": "CC-BY-4.0"
      }
    },
    "annotationCollection": "https://example.com/one/annotationCollection.json"
  }
  