{
   "textapi": "0.0.2",
   "title": {
      "title": "Full Text made available via Text-API.",
      "type": "main"
   },
   "type": "full",
   "language": [
      "ger"
   ],
   "content": "http://dev.gfl.sub.uni-goettingen.de/emo/gfl/Z_1822-07-31_k/content",
   "content_type": "text/html"
}
