<svg xmlns="http://www.w3.org/2000/svg" width="512" height="512" viewBox="0 0 512 512">
  <path d="M227.338241,213.244518 L43.7848156,393.993222 C36.4613767,401.316661 24.6192201,401.316661 17.2957812,393.993222 L6.23271396,382.930155 C-1.09072494,375.606716 -1.09072494,363.764559 6.23271396,356.441121 L165.634374,200 L6.38853181,43.5588797 C-0.934907093,36.2354408 -0.934907093,24.3932842 6.38853181,17.0698453 L17.4515991,6.00677808 C24.775038,-1.31666082 36.6171945,-1.31666082 43.9406334,6.00677808 L227.494059,186.755482 C234.66168,194.078922 234.66168,205.921078 227.338241,213.244518 Z" transform="translate(139 56)"/>
</svg>
