<?xml version="1.0" encoding="UTF-8" standalone="no"?>
<!-- Created with Inkscape (http://www.inkscape.org/) -->

<svg
   width="192.58099mm"
   height="40.972416mm"
   viewBox="0 0 192.58099 40.972416"
   version="1.1"
   id="svg1"
   inkscape:version="1.4 (86a8ad7, 2024-10-11)"
   sodipodi:docname="eupt_logo_dark_pathonly.svg"
   inkscape:export-filename="eupt_logo_dark_big.png"
   inkscape:export-xdpi="96"
   inkscape:export-ydpi="96"
   xmlns:inkscape="http://www.inkscape.org/namespaces/inkscape"
   xmlns:sodipodi="http://sodipodi.sourceforge.net/DTD/sodipodi-0.dtd"
   xmlns="http://www.w3.org/2000/svg"
   xmlns:svg="http://www.w3.org/2000/svg">
  <sodipodi:namedview
     id="namedview1"
     pagecolor="#ffffff"
     bordercolor="#000000"
     borderopacity="0.25"
     inkscape:showpageshadow="2"
     inkscape:pageopacity="0.0"
     inkscape:pagecheckerboard="0"
     inkscape:deskcolor="#d1d1d1"
     inkscape:document-units="mm"
     showguides="true"
     inkscape:zoom="1"
     inkscape:cx="239"
     inkscape:cy="22.5"
     inkscape:window-width="1920"
     inkscape:window-height="991"
     inkscape:window-x="-9"
     inkscape:window-y="-9"
     inkscape:window-maximized="1"
     inkscape:current-layer="layer1">
    <sodipodi:guide
       position="58.827342,266.8707"
       orientation="0,-1"
       id="guide1"
       inkscape:locked="false" />
    <sodipodi:guide
       position="68.352342,284.86237"
       orientation="0,-1"
       id="guide2"
       inkscape:locked="false" />
    <sodipodi:guide
       position="14.906514,293.19671"
       orientation="0,-1"
       id="guide6"
       inkscape:locked="false" />
    <sodipodi:guide
       position="7.2335963,259.99153"
       orientation="0,-1"
       id="guide7"
       inkscape:locked="false" />
    <sodipodi:guide
       position="41.627226,214.4939"
       orientation="1,0"
       id="guide8"
       inkscape:locked="false" />
    <sodipodi:guide
       position="173.43119,348.44935"
       orientation="1,0"
       id="guide9"
       inkscape:locked="false" />
    <sodipodi:guide
       position="1.9015758e-06,276.79439"
       orientation="1,0"
       id="guide10"
       inkscape:locked="false" />
    <sodipodi:guide
       position="18.33469,296.99997"
       orientation="0,-1"
       id="guide11"
       inkscape:locked="false" />
    <sodipodi:guide
       position="5.0513945,256.02758"
       orientation="0,-1"
       id="guide12"
       inkscape:locked="false" />
    <sodipodi:guide
       position="4.3030406,274.45579"
       orientation="1,0"
       id="guide13"
       inkscape:locked="false" />
    <sodipodi:guide
       position="37.417731,271.46237"
       orientation="1,0"
       id="guide14"
       inkscape:locked="false" />
  </sodipodi:namedview>
  <defs
     id="defs1" />
  <g
     inkscape:label="Ebene 1"
     inkscape:groupmode="layer"
     id="layer1"
     transform="translate(-20.018486,-127.0332)">
    <path
       style="font-weight:900;font-size:11.2889px;line-height:1;font-family:Roboto;-inkscape-font-specification:'Roboto Heavy';letter-spacing:-0.132292px;fill:#adbac7;fill-rule:nonzero;stroke-width:0.529;stroke-linecap:square"
       d="m 67.265464,144.79715 v 1.48828 H 62.98803 v -1.48828 z m -3.588415,-6.53742 v 8.0257 h -1.934767 v -8.0257 z m 3.0372,3.18603 v 1.43867 H 62.98803 v -1.43867 z m 0.567752,-3.18603 v 1.49379 H 62.98803 v -1.49379 z m 3.252173,8.0257 h -1.780427 l 0.01102,-1.48828 h 1.769402 q 0.551216,0 0.931555,-0.26459 0.385851,-0.26458 0.584289,-0.78823 0.20395,-0.52917 0.20395,-1.30087 v -0.34727 q 0,-0.57878 -0.115755,-1.01424 -0.110244,-0.44097 -0.33073,-0.73311 -0.220486,-0.29766 -0.551216,-0.44649 -0.325217,-0.14883 -0.749653,-0.14883 h -1.78594 v -1.49379 h 1.78594 q 0.815799,0 1.493795,0.28112 0.683507,0.27561 1.179601,0.79375 0.501607,0.51263 0.771703,1.21819 0.275608,0.70004 0.275608,1.55442 v 0.33625 q 0,0.84887 -0.275608,1.55443 -0.270096,0.70555 -0.76619,1.21818 -0.496095,0.51263 -1.17409,0.79375 -0.672483,0.27561 -1.477259,0.27561 z m -0.672483,-8.0257 v 8.0257 h -1.934767 v -8.0257 z m 7.292586,0 v 8.0257 h -1.929256 v -8.0257 z m 4.949918,0 v 8.0257 h -1.934768 v -8.0257 z m 2.414325,0 v 1.49379 h -6.708296 v -1.49379 z m 2.745054,0 v 8.0257 h -1.929255 v -8.0257 z m 8.014678,3.853 v 0.32521 q 0,0.92053 -0.259071,1.65365 -0.25356,0.72761 -0.722093,1.24575 -0.468534,0.51263 -1.107944,0.78824 -0.63941,0.27009 -1.411112,0.27009 -0.777215,0 -1.422137,-0.27009 -0.639411,-0.27561 -1.113456,-0.78824 -0.468534,-0.51814 -0.727605,-1.24575 -0.253559,-0.73312 -0.253559,-1.65365 v -0.32521 q 0,-0.92053 0.253559,-1.65365 0.259071,-0.73312 0.722093,-1.24575 0.468533,-0.51814 1.107943,-0.78824 0.644923,-0.2756 1.422137,-0.2756 0.771702,0 1.411113,0.2756 0.644922,0.2701 1.113456,0.78824 0.468533,0.51263 0.727605,1.24575 0.259071,0.73312 0.259071,1.65365 z m -1.962328,0.32521 v -0.33624 q 0,-0.59531 -0.104731,-1.04731 -0.09922,-0.45751 -0.297657,-0.76619 -0.198438,-0.30868 -0.490582,-0.46302 -0.286632,-0.15985 -0.655947,-0.15985 -0.385851,0 -0.672483,0.15985 -0.286632,0.15434 -0.479558,0.46302 -0.192925,0.30868 -0.292144,0.76619 -0.09371,0.452 -0.09371,1.04731 v 0.33624 q 0,0.58981 0.09371,1.04731 0.09922,0.452 0.292144,0.76619 0.198438,0.3142 0.48507,0.47405 0.292144,0.15985 0.677996,0.15985 0.369314,0 0.655946,-0.15985 0.286633,-0.15985 0.479558,-0.47405 0.198438,-0.31419 0.297657,-0.76619 0.104731,-0.4575 0.104731,-1.04731 z m 9.536036,-4.17821 v 8.0257 h -1.92926 l -2.83876,-4.99401 v 4.99401 h -1.934767 v -8.0257 h 1.934767 l 2.83876,4.99401 v -4.99401 z m 6.37757,8.0257 h -1.78043 l 0.011,-1.48828 h 1.76941 q 0.55121,0 0.93155,-0.26459 0.38585,-0.26458 0.58429,-0.78823 0.20395,-0.52917 0.20395,-1.30087 v -0.34727 q 0,-0.57878 -0.11576,-1.01424 -0.11024,-0.44097 -0.33073,-0.73311 -0.22048,-0.29766 -0.55121,-0.44649 -0.32522,-0.14883 -0.74965,-0.14883 h -1.78594 v -1.49379 h 1.78594 q 0.81579,0 1.49379,0.28112 0.68351,0.27561 1.1796,0.79375 0.50161,0.51263 0.7717,1.21819 0.27561,0.70004 0.27561,1.55442 v 0.33625 q 0,0.84887 -0.27561,1.55443 -0.27009,0.70555 -0.76619,1.21818 -0.49609,0.51263 -1.17409,0.79375 -0.67248,0.27561 -1.47725,0.27561 z m -0.67249,-8.0257 v 8.0257 h -1.93476 v -8.0257 z m 10.75974,6.53742 v 1.48828 h -4.27744 v -1.48828 z m -3.58842,-6.53742 v 8.0257 h -1.93477 v -8.0257 z m 3.0372,3.18603 v 1.43867 h -3.72622 v -1.43867 z m 0.56775,-3.18603 v 1.49379 h -4.29397 v -1.49379 z m 4.77904,5.8925 q 0,-0.18742 -0.0551,-0.33625 -0.0551,-0.15434 -0.20395,-0.28663 -0.14883,-0.13229 -0.42995,-0.26458 -0.27561,-0.13781 -0.7276,-0.28663 -0.52917,-0.17639 -1.01975,-0.39688 -0.49059,-0.226 -0.87644,-0.52365 -0.38585,-0.30317 -0.61185,-0.70556 -0.22599,-0.4079 -0.22599,-0.94809 0,-0.51814 0.23151,-0.93156 0.23151,-0.41892 0.64492,-0.71107 0.41892,-0.29765 0.98116,-0.45199 0.56224,-0.15985 1.22921,-0.15985 0.88195,0 1.55443,0.30868 0.678,0.30316 1.05834,0.8654 0.38585,0.55673 0.38585,1.31741 h -1.92374 q 0,-0.30317 -0.12678,-0.53468 -0.12127,-0.23151 -0.36932,-0.3638 -0.24805,-0.13229 -0.62287,-0.13229 -0.36381,0 -0.61185,0.11024 -0.24805,0.11024 -0.37483,0.29766 -0.12678,0.1819 -0.12678,0.40238 0,0.18191 0.0992,0.33073 0.10473,0.14332 0.29214,0.2701 0.19293,0.12678 0.46303,0.24253 0.2756,0.11576 0.61736,0.226 0.63941,0.20395 1.1355,0.45751 0.50161,0.24805 0.84336,0.56775 0.34727,0.3142 0.52366,0.71659 0.1819,0.40238 0.1819,0.9095 0,0.54019 -0.20946,0.95912 -0.20947,0.41892 -0.60083,0.71107 -0.39136,0.28663 -0.93707,0.43546 -0.5457,0.14882 -1.21818,0.14882 -0.61736,0 -1.21819,-0.15434 -0.59531,-0.15985 -1.08038,-0.48507 -0.48507,-0.33073 -0.77722,-0.84336 -0.28663,-0.51814 -0.28663,-1.22921 h 1.94028 q 0,0.35278 0.0937,0.59532 0.0937,0.24253 0.27561,0.39136 0.1819,0.14331 0.44648,0.20946 0.26458,0.0606 0.60634,0.0606 0.36931,0 0.59531,-0.10473 0.226,-0.11024 0.33073,-0.28663 0.10473,-0.1819 0.10473,-0.39687 z m 9.83369,-5.8925 h 1.93477 v 5.24206 q 0,0.93707 -0.39137,1.5875 -0.39136,0.64493 -1.09692,0.97565 -0.70555,0.33073 -1.65916,0.33073 -0.94258,0 -1.65916,-0.33073 -0.71106,-0.33072 -1.11345,-0.97565 -0.39688,-0.65043 -0.39688,-1.5875 v -5.24206 h 1.94028 v 5.24206 q 0,0.4961 0.14332,0.81029 0.14331,0.30868 0.41892,0.452 0.27561,0.14331 0.66697,0.14331 0.39688,0 0.66697,-0.14331 0.2701,-0.14332 0.4079,-0.452 0.13781,-0.31419 0.13781,-0.81029 z m 9.58013,3.73724 v 3.29627 q -0.20395,0.226 -0.62838,0.48507 -0.41893,0.25356 -1.05834,0.43546 -0.63941,0.1819 -1.50482,0.1819 -0.79926,0 -1.44969,-0.25356 -0.65044,-0.25907 -1.11897,-0.75516 -0.46302,-0.50161 -0.71658,-1.2237 -0.24805,-0.7276 -0.24805,-1.66467 v -0.44649 q 0,-0.93706 0.25356,-1.66467 0.25356,-0.7276 0.71107,-1.2237 0.46302,-0.5016 1.08589,-0.76068 0.62839,-0.25907 1.37804,-0.25907 1.10795,0 1.80248,0.35278 0.69453,0.34727 1.05282,0.96463 0.35829,0.61185 0.43546,1.41662 h -1.8576 q -0.0551,-0.39687 -0.20946,-0.67248 -0.14883,-0.28112 -0.42995,-0.42444 -0.28112,-0.14882 -0.7276,-0.14882 -0.34727,0 -0.6339,0.14882 -0.28112,0.14883 -0.47956,0.452 -0.19844,0.29766 -0.30868,0.74965 -0.10473,0.452 -0.10473,1.05834 v 0.45751 q 0,0.60082 0.0992,1.05282 0.10473,0.452 0.30868,0.75517 0.20946,0.29765 0.52917,0.45199 0.32521,0.14883 0.76619,0.14883 0.30868,0 0.52916,-0.0496 0.22049,-0.0551 0.36381,-0.13229 0.14882,-0.0827 0.22599,-0.15434 v -1.24575 h -1.34496 v -1.32843 z m 4.39871,-2.05052 -1.95682,6.33898 h -2.07808 l 2.949,-8.0257 h 1.31741 z m 1.62057,6.33898 -1.96233,-6.33898 -0.25356,-1.68672 h 1.33395 l 2.96554,8.0257 z m -0.0772,-2.9931 v 1.49379 h -4.11758 v -1.49379 z m 2.61276,-5.0326 h 3.15847 q 0.92604,0 1.60955,0.27561 0.68351,0.2756 1.05282,0.8158 0.37483,0.54019 0.37483,1.33394 0,0.68902 -0.21498,1.15204 -0.21497,0.46302 -0.60082,0.76619 -0.38034,0.29766 -0.88746,0.49058 l -0.6339,0.35829 h -2.65135 l -0.011,-1.49379 h 1.96233 q 0.36931,0 0.61185,-0.1323 0.24253,-0.13229 0.3638,-0.37482 0.12678,-0.24805 0.12678,-0.5898 0,-0.34727 -0.12678,-0.59532 -0.12678,-0.24804 -0.37483,-0.38033 -0.24253,-0.1323 -0.60082,-0.1323 h -1.2237 v 6.53191 h -1.93477 z m 4.39319,8.0257 -1.77491,-3.54983 2.05052,-0.011 1.79696,3.47817 v 0.0827 z m 4.8948,-8.0257 v 8.0257 h -1.92926 v -8.0257 z m 4.94991,0 v 8.0257 h -1.93476 v -8.0257 z m 2.41433,0 v 1.49379 h -6.7083 v -1.49379 z m 2.74505,0 v 8.0257 h -1.92925 v -8.0257 z m 5.35783,5.8925 q 0,-0.18742 -0.0551,-0.33625 -0.0551,-0.15434 -0.20395,-0.28663 -0.14883,-0.13229 -0.42995,-0.26458 -0.27561,-0.13781 -0.72761,-0.28663 -0.52916,-0.17639 -1.01975,-0.39688 -0.49058,-0.226 -0.87643,-0.52365 -0.38585,-0.30317 -0.61185,-0.70556 -0.226,-0.4079 -0.226,-0.94809 0,-0.51814 0.23151,-0.93156 0.23151,-0.41892 0.64493,-0.71107 0.41892,-0.29765 0.98116,-0.45199 0.56224,-0.15985 1.22921,-0.15985 0.88195,0 1.55443,0.30868 0.678,0.30316 1.05833,0.8654 0.38586,0.55673 0.38586,1.31741 h -1.92375 q 0,-0.30317 -0.12678,-0.53468 -0.12126,-0.23151 -0.36931,-0.3638 -0.24805,-0.13229 -0.62288,-0.13229 -0.3638,0 -0.61185,0.11024 -0.24804,0.11024 -0.37482,0.29766 -0.12678,0.1819 -0.12678,0.40238 0,0.18191 0.0992,0.33073 0.10473,0.14332 0.29214,0.2701 0.19293,0.12678 0.46302,0.24253 0.27561,0.11576 0.61736,0.226 0.63941,0.20395 1.13551,0.45751 0.50161,0.24805 0.84336,0.56775 0.34727,0.3142 0.52365,0.71659 0.18191,0.40238 0.18191,0.9095 0,0.54019 -0.20947,0.95912 -0.20946,0.41892 -0.60082,0.71107 -0.39137,0.28663 -0.93707,0.43546 -0.5457,0.14882 -1.21819,0.14882 -0.61736,0 -1.21818,-0.15434 -0.59532,-0.15985 -1.08039,-0.48507 -0.48507,-0.33073 -0.77721,-0.84336 -0.28663,-0.51814 -0.28663,-1.22921 h 1.94028 q 0,0.35278 0.0937,0.59532 0.0937,0.24253 0.27561,0.39136 0.1819,0.14331 0.44649,0.20946 0.26458,0.0606 0.60633,0.0606 0.36932,0 0.59532,-0.10473 0.226,-0.11024 0.33073,-0.28663 0.10473,-0.1819 0.10473,-0.39687 z m 7.36424,-0.58429 h 1.92926 q -0.0386,0.83784 -0.452,1.47726 -0.41341,0.63941 -1.14653,0.9977 -0.7276,0.35277 -1.71979,0.35277 -0.80478,0 -1.43868,-0.27009 -0.62838,-0.2701 -1.06935,-0.77722 -0.43546,-0.50711 -0.66698,-1.22921 -0.22599,-0.72209 -0.22599,-1.62608 v -0.43546 q 0,-0.904 0.23702,-1.62609 0.24253,-0.72761 0.68351,-1.23472 0.44648,-0.51264 1.06936,-0.78273 0.62287,-0.2701 1.38355,-0.2701 1.04731,0 1.7694,0.37483 0.72209,0.37483 1.11897,1.03077 0.39687,0.65044 0.46853,1.48277 h -1.92925 q -0.011,-0.45199 -0.15434,-0.75516 -0.14332,-0.30868 -0.452,-0.46302 -0.30868,-0.15434 -0.82131,-0.15434 -0.35829,0 -0.62288,0.13229 -0.26458,0.13229 -0.44097,0.41892 -0.17639,0.28663 -0.26458,0.74414 -0.0827,0.452 -0.0827,1.09141 v 0.44649 q 0,0.63941 0.0772,1.0914 0.0772,0.452 0.24805,0.73863 0.17088,0.28663 0.44097,0.42444 0.27561,0.13229 0.67249,0.13229 0.44097,0 0.74414,-0.1378 0.30317,-0.14332 0.46853,-0.42995 0.16537,-0.29215 0.17639,-0.74414 z m 8.11941,-2.12218 v 1.48828 h -4.11758 v -1.48828 z m -3.47266,-3.18603 v 8.0257 h -1.93477 v -8.0257 z m 4.77353,0 v 8.0257 h -1.92926 v -8.0257 z m 6.61458,6.53742 v 1.48828 h -4.27743 v -1.48828 z m -3.58841,-6.53742 v 8.0257 h -1.93477 v -8.0257 z m 3.0372,3.18603 v 1.43867 h -3.72622 v -1.43867 z m 0.56775,-3.18603 v 1.49379 h -4.29397 v -1.49379 z m 7.34771,0 v 8.0257 h -1.92925 l -2.83877,-4.99401 v 4.99401 h -1.93476 v -8.0257 h 1.93476 l 2.83877,4.99401 v -4.99401 z"
       id="path1" />
    <path
       style="font-weight:900;font-size:11.2889px;line-height:1;font-family:Roboto;-inkscape-font-specification:'Roboto Heavy';letter-spacing:-0.132292px;fill:#adbac7;fill-rule:nonzero;stroke-width:0.529;stroke-linecap:square"
       d="m 64.944846,154.85133 h -1.995402 v -1.4938 h 1.995402 q 0.407899,0 0.661459,-0.1378 0.253559,-0.13781 0.369314,-0.38034 0.121268,-0.24805 0.121268,-0.55673 0,-0.33073 -0.121268,-0.61185 -0.115755,-0.28112 -0.369314,-0.452 -0.25356,-0.17639 -0.661459,-0.17639 h -1.267797 v 6.53191 h -1.934767 v -8.0257 h 3.202564 q 0.964627,0 1.659159,0.35278 0.700045,0.35277 1.074871,0.97014 0.374827,0.61185 0.374827,1.40008 0,0.77722 -0.374827,1.356 -0.374826,0.57877 -1.074871,0.90399 -0.694532,0.31971 -1.659159,0.31971 z m 10.809343,-1.4497 v 0.32521 q 0,0.92054 -0.259072,1.65365 -0.253559,0.72761 -0.722093,1.24575 -0.468533,0.51263 -1.107943,0.78824 -0.639411,0.27009 -1.411113,0.27009 -0.777214,0 -1.422137,-0.27009 -0.63941,-0.27561 -1.113456,-0.78824 -0.468533,-0.51814 -0.727605,-1.24575 -0.253559,-0.73311 -0.253559,-1.65365 v -0.32521 q 0,-0.92053 0.253559,-1.65365 0.259072,-0.73312 0.722093,-1.24575 0.468533,-0.51814 1.107944,-0.78824 0.644922,-0.2756 1.422137,-0.2756 0.771702,0 1.411112,0.2756 0.644923,0.2701 1.113456,0.78824 0.468534,0.51263 0.727605,1.24575 0.259072,0.73312 0.259072,1.65365 z m -1.962329,0.32521 v -0.33624 q 0,-0.59531 -0.104731,-1.04731 -0.09922,-0.45751 -0.297656,-0.76619 -0.198438,-0.30868 -0.490582,-0.46302 -0.286633,-0.15985 -0.655947,-0.15985 -0.385851,0 -0.672484,0.15985 -0.286632,0.15434 -0.479557,0.46302 -0.192926,0.30868 -0.292145,0.76619 -0.09371,0.452 -0.09371,1.04731 v 0.33624 q 0,0.58981 0.09371,1.04731 0.09922,0.452 0.292145,0.76619 0.198437,0.3142 0.48507,0.47405 0.292144,0.15985 0.677995,0.15985 0.369315,0 0.655947,-0.15985 0.286632,-0.15985 0.479558,-0.47405 0.198437,-0.31419 0.297656,-0.76619 0.104731,-0.4575 0.104731,-1.04731 z m 8.356432,2.35921 v 1.48828 h -4.277435 v -1.48828 z m -3.588415,-6.53742 v 8.0257 h -1.934768 v -8.0257 z m 3.037199,3.18603 v 1.43867 h -3.726219 v -1.43867 z m 0.567753,-3.18603 v 1.49379 h -4.293972 v -1.49379 z m 4.641236,0 v 8.0257 h -1.934768 v -8.0257 z m 2.414325,0 v 1.49379 h -6.708297 v -1.49379 z m 2.745056,0 v 8.0257 h -1.929255 v -8.0257 z m 5.357818,5.8925 q 0,-0.18742 -0.05512,-0.33625 -0.05512,-0.15434 -0.20395,-0.28663 -0.148828,-0.13229 -0.429948,-0.26458 -0.275608,-0.13781 -0.727605,-0.28663 -0.529167,-0.17639 -1.019749,-0.39688 -0.490582,-0.226 -0.876434,-0.52365 -0.385851,-0.30317 -0.611849,-0.70556 -0.225999,-0.4079 -0.225999,-0.94809 0,-0.51814 0.231511,-0.93156 0.231511,-0.41892 0.644923,-0.71106 0.418924,-0.29766 0.981164,-0.452 0.56224,-0.15985 1.229211,-0.15985 0.881945,0 1.554429,0.30868 0.677995,0.30317 1.058334,0.86541 0.385851,0.55672 0.385851,1.3174 H 97.33429 q 0,-0.30317 -0.12678,-0.53468 -0.121267,-0.23151 -0.369314,-0.3638 -0.248047,-0.13229 -0.622874,-0.13229 -0.363803,0 -0.61185,0.11024 -0.248047,0.11024 -0.374827,0.29766 -0.126779,0.1819 -0.126779,0.40238 0,0.18191 0.09922,0.33073 0.104731,0.14332 0.292144,0.2701 0.192926,0.12678 0.463021,0.24253 0.275608,0.11576 0.617362,0.226 0.639411,0.20395 1.135505,0.45751 0.501606,0.24805 0.84336,0.56775 0.347266,0.3142 0.523655,0.71659 0.181901,0.40238 0.181901,0.9095 0,0.54019 -0.209462,0.95912 -0.209462,0.41892 -0.600825,0.71107 -0.391363,0.28663 -0.937067,0.43546 -0.545704,0.14882 -1.218187,0.14882 -0.617362,0 -1.218187,-0.15434 -0.595313,-0.15985 -1.080383,-0.48507 -0.48507,-0.33073 -0.777214,-0.84336 -0.286633,-0.51814 -0.286633,-1.22921 h 1.94028 q 0,0.35278 0.09371,0.59532 0.09371,0.24253 0.275608,0.39136 0.181901,0.14331 0.446485,0.20946 0.264583,0.0606 0.606337,0.0606 0.369315,0 0.595313,-0.10473 0.225999,-0.11024 0.33073,-0.28663 0.104731,-0.1819 0.104731,-0.39687 z m 7.364246,-0.58429 h 1.92925 q -0.0386,0.83785 -0.452,1.47726 -0.41341,0.63941 -1.14652,0.9977 -0.72761,0.35277 -1.7198,0.35277 -0.80477,0 -1.43867,-0.27009 -0.62839,-0.2701 -1.06936,-0.77722 -0.43546,-0.50711 -0.66697,-1.22921 -0.226,-0.72209 -0.226,-1.62608 v -0.43546 q 0,-0.904 0.23702,-1.62609 0.24254,-0.72761 0.68351,-1.23472 0.44649,-0.51264 1.06936,-0.78273 0.62287,-0.2701 1.38355,-0.2701 1.04731,0 1.7694,0.37483 0.7221,0.37483 1.11897,1.03077 0.39688,0.65044 0.46854,1.48277 h -1.92926 q -0.011,-0.45199 -0.15434,-0.75516 -0.14332,-0.30868 -0.452,-0.46302 -0.30868,-0.15434 -0.82131,-0.15434 -0.35829,0 -0.62287,0.13229 -0.26459,0.13229 -0.44098,0.41892 -0.17638,0.28663 -0.26458,0.74414 -0.0827,0.452 -0.0827,1.09141 v 0.44649 q 0,0.63941 0.0772,1.0914 0.0772,0.452 0.24805,0.73863 0.17087,0.28664 0.44097,0.42444 0.27561,0.13229 0.67248,0.13229 0.44097,0 0.74414,-0.1378 0.30317,-0.14332 0.46854,-0.42995 0.16536,-0.29215 0.17639,-0.74414 z m 8.11941,-2.12218 v 1.48828 h -4.11759 v -1.48828 z m -3.47266,-3.18603 v 8.0257 h -1.93477 v -8.0257 z m 4.77353,0 v 8.0257 h -1.92926 v -8.0257 z m 6.61458,6.53742 v 1.48828 h -4.27743 v -1.48828 z m -3.58841,-6.53742 v 8.0257 h -1.93477 v -8.0257 z m 3.0372,3.18603 v 1.43867 h -3.72622 v -1.43867 z m 0.56775,-3.18603 v 1.49379 h -4.29397 v -1.49379 z m 7.34771,0 v 8.0257 h -1.92926 l -2.83876,-4.99401 v 4.99401 h -1.93477 v -8.0257 h 1.93477 l 2.83876,4.99401 v -4.99401 z m 7.32565,0 v 8.0257 h -1.93476 v -8.0257 z m 2.41433,0 v 1.49379 h -6.7083 v -1.49379 z m 6.2122,6.53742 v 1.48828 h -4.27743 v -1.48828 z m -3.58841,-6.53742 v 8.0257 h -1.93477 v -8.0257 z m 3.0372,3.18603 v 1.43867 h -3.72622 v -1.43867 z m 0.56775,-3.18603 v 1.49379 h -4.29397 v -1.49379 z m 2.32613,0 1.3119,2.66788 1.31189,-2.66788 h 2.20487 l -2.23794,3.97978 2.29857,4.04592 h -2.22691 l -1.35048,-2.71749 -1.35048,2.71749 h -2.23242 l 2.30408,-4.04592 -2.24345,-3.97978 z m 9.28247,0 v 8.0257 h -1.93476 v -8.0257 z m 2.41433,0 v 1.49379 h -6.7083 v -1.49379 z m 2.62379,0 v 8.0257 h -1.93477 v -8.0257 z m 4.79006,0 -3.10885,4.06797 -1.81902,1.98989 -0.35277,-1.77491 1.16306,-1.76389 1.73082,-2.51906 z m -2.28754,8.0257 -2.07257,-3.61597 1.50482,-1.10795 2.85529,4.72392 z m 9.27145,-4.1727 v 0.32521 q 0,0.92054 -0.25907,1.65365 -0.25356,0.72761 -0.72209,1.24575 -0.46853,0.51263 -1.10795,0.78824 -0.63941,0.27009 -1.41111,0.27009 -0.77721,0 -1.42213,-0.27009 -0.63942,-0.27561 -1.11346,-0.78824 -0.46853,-0.51814 -0.72761,-1.24575 -0.25355,-0.73311 -0.25355,-1.65365 v -0.32521 q 0,-0.92053 0.25355,-1.65365 0.25908,-0.73312 0.7221,-1.24575 0.46853,-0.51814 1.10794,-0.78824 0.64492,-0.2756 1.42214,-0.2756 0.7717,0 1.41111,0.2756 0.64492,0.2701 1.11346,0.78824 0.46853,0.51263 0.7276,1.24575 0.25907,0.73312 0.25907,1.65365 z m -1.96233,0.32521 v -0.33624 q 0,-0.59531 -0.10473,-1.04731 -0.0992,-0.45751 -0.29765,-0.76619 -0.19844,-0.30868 -0.49059,-0.46302 -0.28663,-0.15985 -0.65594,-0.15985 -0.38585,0 -0.67249,0.15985 -0.28663,0.15434 -0.47955,0.46302 -0.19293,0.30868 -0.29215,0.76619 -0.0937,0.452 -0.0937,1.04731 v 0.33624 q 0,0.58981 0.0937,1.04731 0.0992,0.452 0.29215,0.76619 0.19843,0.3142 0.48507,0.47405 0.29214,0.15985 0.67799,0.15985 0.36932,0 0.65595,-0.15985 0.28663,-0.15985 0.47956,-0.47405 0.19843,-0.31419 0.29765,-0.76619 0.10473,-0.4575 0.10473,-1.04731 z m 2.83325,-4.17821 h 3.15847 q 0.92604,0 1.60955,0.27561 0.6835,0.2756 1.05282,0.8158 0.37483,0.54019 0.37483,1.33394 0,0.68902 -0.21498,1.15204 -0.21497,0.46302 -0.60082,0.76619 -0.38034,0.29766 -0.88746,0.49058 l -0.6339,0.35829 h -2.65135 l -0.011,-1.49379 h 1.96233 q 0.36931,0 0.61185,-0.13229 0.24253,-0.1323 0.3638,-0.37483 0.12678,-0.24805 0.12678,-0.5898 0,-0.34727 -0.12678,-0.59532 -0.12678,-0.24804 -0.37483,-0.38033 -0.24253,-0.1323 -0.60082,-0.1323 h -1.2237 v 6.53191 h -1.93477 z m 4.39319,8.0257 -1.77492,-3.54983 2.05053,-0.011 1.79696,3.47817 v 0.0827 z m 6.04132,-2.723 h -1.9954 v -1.4938 h 1.9954 q 0.4079,0 0.66146,-0.1378 0.25356,-0.13781 0.36932,-0.38034 0.12126,-0.24805 0.12126,-0.55673 0,-0.33073 -0.12126,-0.61185 -0.11576,-0.28112 -0.36932,-0.452 -0.25356,-0.17639 -0.66146,-0.17639 h -1.26779 v 6.53191 h -1.93477 v -8.0257 h 3.20256 q 0.96463,0 1.65916,0.35278 0.70005,0.35277 1.07487,0.97014 0.37483,0.61185 0.37483,1.40008 0,0.77722 -0.37483,1.356 -0.37482,0.57877 -1.07487,0.90399 -0.69453,0.31971 -1.65916,0.31971 z m 8.37298,-5.3027 h 1.93476 v 5.24206 q 0,0.93707 -0.39136,1.5875 -0.39136,0.64493 -1.09692,0.97565 -0.70556,0.33073 -1.65916,0.33073 -0.94258,0 -1.65916,-0.33073 -0.71107,-0.33072 -1.11346,-0.97565 -0.39687,-0.65043 -0.39687,-1.5875 v -5.24206 h 1.94028 v 5.24206 q 0,0.4961 0.14332,0.81029 0.14331,0.30868 0.41892,0.452 0.27561,0.14331 0.66697,0.14331 0.39688,0 0.66697,-0.14331 0.2701,-0.14332 0.4079,-0.452 0.13781,-0.31419 0.13781,-0.81029 z m 7.14927,5.8925 q 0,-0.18742 -0.0551,-0.33625 -0.0551,-0.15434 -0.20395,-0.28663 -0.14883,-0.13229 -0.42995,-0.26458 -0.27561,-0.13781 -0.72761,-0.28663 -0.52916,-0.17639 -1.01975,-0.39688 -0.49058,-0.226 -0.87643,-0.52365 -0.38585,-0.30317 -0.61185,-0.70556 -0.226,-0.4079 -0.226,-0.94809 0,-0.51814 0.23151,-0.93156 0.23151,-0.41892 0.64493,-0.71106 0.41892,-0.29766 0.98116,-0.452 0.56224,-0.15985 1.22921,-0.15985 0.88195,0 1.55443,0.30868 0.678,0.30317 1.05833,0.86541 0.38586,0.55672 0.38586,1.3174 h -1.92375 q 0,-0.30317 -0.12678,-0.53468 -0.12127,-0.23151 -0.36931,-0.3638 -0.24805,-0.13229 -0.62288,-0.13229 -0.3638,0 -0.61185,0.11024 -0.24804,0.11024 -0.37482,0.29766 -0.12678,0.1819 -0.12678,0.40238 0,0.18191 0.0992,0.33073 0.10473,0.14332 0.29214,0.2701 0.19293,0.12678 0.46302,0.24253 0.27561,0.11576 0.61736,0.226 0.63941,0.20395 1.13551,0.45751 0.50161,0.24805 0.84336,0.56775 0.34726,0.3142 0.52365,0.71659 0.18191,0.40238 0.18191,0.9095 0,0.54019 -0.20947,0.95912 -0.20946,0.41892 -0.60082,0.71107 -0.39137,0.28663 -0.93707,0.43546 -0.5457,0.14882 -1.21819,0.14882 -0.61736,0 -1.21818,-0.15434 -0.59532,-0.15985 -1.08039,-0.48507 -0.48507,-0.33073 -0.77721,-0.84336 -0.28663,-0.51814 -0.28663,-1.22921 h 1.94028 q 0,0.35278 0.0937,0.59532 0.0937,0.24253 0.27561,0.39136 0.1819,0.14331 0.44649,0.20946 0.26458,0.0606 0.60633,0.0606 0.36932,0 0.59532,-0.10473 0.226,-0.11024 0.33073,-0.28663 0.10473,-0.1819 0.10473,-0.39687 z"
       id="path2" />
    <path
       id="path6-1-8"
       style="display:inline;fill:#3c705c;fill-opacity:1;fill-rule:evenodd;stroke-width:3.40929;stroke-linecap:round;stroke-linejoin:round"
       d="m 37.421758,130.90178 c 0.210817,0 0.383642,0.25417 0.383642,0.56506 0,0.31083 0.110467,0.64288 0.244853,0.73743 0.13443,0.0945 0.175059,0.37769 0.0904,0.62902 -0.08459,0.25131 -0.05099,0.54298 0.07484,0.6468 0.382628,0.31618 0.887158,1.49795 0.639423,1.49795 -0.264177,0 -0.506885,1.74092 -0.700249,5.02157 l -0.13257,2.25671 h -0.747023 c -0.4109,0 -0.74703,-0.12288 -0.74703,-0.27196 0,-0.14896 -0.259289,-0.3642 -0.575478,-0.47802 -0.669637,-0.24131 -1.469097,-1.20252 -1.469097,-1.76804 0,-0.21562 -0.115218,-0.39267 -0.255761,-0.39267 -0.150323,0 -0.255763,-1.01966 -0.255763,-2.47528 0,-1.36103 0.103919,-2.47345 0.229276,-2.47345 0.125286,0 0.298606,-0.32828 0.386774,-0.72855 0.0882,-0.40016 0.273833,-0.72854 0.411719,-0.72854 0.137876,0 0.251086,-0.13944 0.251086,-0.31083 0,-0.51377 0.692864,-1.14438 1.258563,-1.14438 0.291121,0 0.530249,-0.13128 0.530249,-0.29158 0,-0.16007 0.171274,-0.29124 0.382088,-0.29124 z m 1.968093,-9e-5 c 0.415448,0 0.4879,0.0859 0.276041,0.32686 -0.157942,0.17957 -0.22714,0.50774 -0.152817,0.72849 0.2039,0.60542 -0.118988,0.48149 -0.421073,-0.16189 -0.372072,-0.79204 -0.338314,-0.89382 0.29786,-0.89382 z m 4.921952,3.2e-4 c 0.496821,0 0.902991,0.13082 0.902991,0.29124 0,0.1603 0.403307,0.29157 0.895184,0.29157 0.491868,0 0.89362,0.13105 0.89362,0.29158 0,0.16007 0.201655,0.29122 0.447596,0.29122 0.346228,0 0.461452,0.2791 0.508412,1.23673 0.03315,0.68054 0.128537,2.2622 0.212131,3.51478 l 0.151276,2.27798 -1.478459,1.57968 c -0.813048,0.869 -1.616834,1.57972 -1.787248,1.57972 -0.170412,0 -0.376287,0.16438 -0.456959,0.36422 -0.08074,0.20043 -0.09502,0.10158 -0.03276,-0.2188 0.374262,-1.92398 0.499769,-2.35312 0.751708,-2.56942 0.198595,-0.1705 0.185943,-0.2841 -0.04059,-0.38914 -0.175672,-0.0814 -0.318144,-0.50319 -0.318144,-0.93819 0,-1.34115 0.924008,-1.93249 1.678084,-1.07328 0.449918,0.51266 0.480959,1.81696 0.04677,1.99367 -0.175649,0.0712 -0.239082,0.22887 -0.140369,0.35006 0.296683,0.36376 0.970039,-0.62667 0.970039,-1.42688 0,-0.41054 -0.242818,-1.06464 -0.539602,-1.45353 -0.51551,-0.67564 -0.872235,-0.74062 -1.79037,-0.32509 -0.480241,0.21744 -0.727257,-0.54082 -0.732991,-2.24782 -0.0018,-0.60048 -0.118356,-1.09101 -0.258855,-1.09101 -0.140551,0 -0.255761,-0.27163 -0.255761,-0.60236 0,-0.33081 -0.118055,-0.85408 -0.263569,-1.16391 -0.238326,-0.50725 -0.176059,-0.56327 0.637855,-0.56327 z m -2.598225,0.12765 c 0.225915,0.0286 0.446005,0.15644 0.614464,0.39981 0.528061,0.76273 1.099495,2.38514 1.099495,3.12383 0,0.3674 0.117405,0.71262 0.261993,0.76767 0.168281,0.0642 0.237471,1.59857 0.191815,4.26991 -0.07118,4.16405 -0.07145,4.17103 -0.586388,3.63737 -0.283673,-0.29407 -0.744608,-1.09112 -1.023073,-1.76984 -0.278463,-0.67868 -0.591699,-1.23492 -0.697116,-1.23674 -0.105408,-0.002 -0.191815,-0.33007 -0.191815,-0.73033 0,-0.40011 -0.115207,-0.72851 -0.255762,-0.72851 -0.140551,0 -0.255762,-0.3976 -0.255762,-0.88314 0,-0.48546 -0.172839,-1.35307 -0.383651,-1.92795 -0.397976,-1.08523 -0.52825,-3.59291 -0.187144,-3.59291 0.107181,0 0.307296,-0.28623 0.446032,-0.6344 0.197233,-0.49466 0.590317,-0.73876 0.966925,-0.69477 z m -8.105046,1.98277 c 0.09593,-0.0136 0.06425,0.1832 -0.04205,0.67702 -0.100857,0.46832 -0.282028,0.89557 -0.400812,0.9489 -0.286768,0.12856 -0.27943,4.70702 0.0084,4.70702 0.122962,0 0.293975,0.39547 0.378964,0.87961 0.08498,0.48412 0.334686,0.95917 0.555206,1.05549 0.220498,0.0961 0.731613,0.55281 1.135361,1.01283 0.424046,0.48326 0.893951,0.76692 1.111959,0.67167 0.207574,-0.0905 0.453074,-0.0249 0.545854,0.14579 0.09277,0.17073 0.420391,0.32545 0.728305,0.34257 0.32652,0.0204 0.132889,0.15146 -0.463184,0.31475 -2.890753,0.7903 -4.096614,0.48378 -5.37268,-1.36468 -0.418007,-0.60551 -0.903533,-1.26997 -1.079203,-1.47661 -0.384213,-0.45161 -0.44127,-4.20246 -0.06398,-4.20246 0.140553,0 0.255764,-0.21177 0.255764,-0.47088 0,-0.42945 1.23018,-1.98118 2.379876,-3.00298 0.161229,-0.14329 0.26528,-0.22743 0.322846,-0.23811 z m 16.615553,0.71996 c 0.115324,0.007 0.307628,0.0966 0.612909,0.2702 0.421599,0.23991 0.765756,0.54835 0.765756,0.68591 0,0.13785 0.201769,0.32758 0.447569,0.42111 0.547557,0.20814 2.364291,2.04449 2.364291,2.38996 0,0.13763 0.286593,0.60424 0.637849,1.03594 0.351467,0.4317 0.639412,0.92037 0.639412,1.08748 0,0.16687 0.115136,0.3037 0.255589,0.3037 0.140437,0 0.255934,0.20973 0.255934,0.46555 0,0.41656 0.32723,1.40162 1.065165,3.19491 0.136176,0.33114 0.20177,1.11702 0.145087,1.74672 -0.05671,0.62982 -0.122976,0.98019 -0.146492,0.78007 -0.02494,-0.20043 -0.272693,-0.36422 -0.55365,-0.36422 -0.281247,0 -0.509987,-0.12334 -0.509987,-0.27555 0,-0.15214 -0.718622,-0.37834 -1.596968,-0.50112 -0.878356,-0.12289 -1.3451,-0.2677 -1.035548,-0.3233 0.309406,-0.0555 0.634101,-0.35434 0.720509,-0.6646 0.08627,-0.31012 0.265206,-0.56327 0.396135,-0.56327 0.386828,0 0.271973,-0.82206 -0.202835,-1.45353 -0.440259,-0.58592 -1.467503,-0.76701 -2.030535,-0.35894 -0.54242,0.39308 -0.666901,1.68874 -0.212086,2.20696 0.389683,0.44363 0.318317,0.47798 -0.995023,0.47798 -1.153303,0 -1.389298,-0.0816 -1.269464,-0.43712 0.08092,-0.24024 0.250377,-0.43535 0.375854,-0.43535 0.125518,0 0.227712,-0.1968 0.227712,-0.43711 0,-0.24027 0.08699,-0.43714 0.193379,-0.43714 0.404145,0 0.797041,-2.29753 0.725178,-4.23797 -0.08203,-2.21775 -0.444576,-3.54516 -1.041762,-3.80617 -0.212924,-0.093 -0.388338,-0.34148 -0.388338,-0.55262 0,-0.15259 0.03912,-0.22537 0.154382,-0.21879 z m -1.23345,0.47966 c 0.08469,0.007 0.221767,0.12946 0.470978,0.37671 0.297364,0.2948 0.626074,0.99456 0.731438,1.55484 0.105361,0.56028 0.307124,1.18014 0.447588,1.3789 0.437405,0.61879 -0.364191,4.31689 -1.091688,5.03581 -0.275001,0.2716 -0.500623,0.58728 -0.500623,0.70008 0,0.48865 -0.699169,0.97248 -1.0449,0.72318 -0.198437,-0.14329 -0.992476,-0.27804 -1.765412,-0.29872 -0.772957,-0.0204 -1.205058,-0.0973 -0.95913,-0.1705 0.24592,-0.073 0.447597,-0.25523 0.447597,-0.40338 0,-0.14828 0.155198,-0.26983 0.344655,-0.26983 0.618782,0 2.721428,-2.38887 2.721428,-3.09186 0,-0.362 0.115206,-0.73971 0.255754,-0.83875 0.345621,-0.24346 0.32648,-3.15144 -0.02346,-3.55024 -0.153702,-0.17504 -0.24015,-0.54039 -0.191816,-0.81206 0.04052,-0.22778 0.07282,-0.34112 0.157534,-0.33436 z m -18.866002,0.84607 c 0.0314,0.005 0.05956,0.007 0.0858,0.0204 0.240857,0.11087 0.240187,0.14965 -0.0063,0.16688 -0.175651,0.0136 -0.319708,0.34293 -0.319708,0.73388 0,0.39087 -0.115218,0.79121 -0.255762,0.89022 -0.140551,0.0991 -0.255761,0.75813 -0.255761,1.46419 0,1.02168 -0.07716,1.24932 -0.382095,1.11593 -0.210816,-0.0921 -0.38365,-0.0388 -0.38365,0.11904 0,0.15781 0.172861,0.44914 0.38365,0.64859 0.210815,0.19953 0.382095,0.47508 0.382095,0.61125 0,0.13627 0.533977,0.85544 1.185265,1.59746 1.387551,1.58096 1.247443,1.8571 -0.941979,1.86397 -0.779961,0.002 -1.52741,0.11949 -1.660922,0.26165 -0.133522,0.14216 -0.904319,0.3486 -1.712394,0.45843 l -1.4691,0.1993 v -0.89376 c 0,-0.49192 0.08641,-0.89496 0.191816,-0.89561 0.105408,-5.7e-4 0.404614,-0.58989 0.664368,-1.30959 0.259751,-0.71964 0.575074,-1.23517 0.7018,-1.14608 0.126717,0.0887 0.244137,-0.14035 0.260464,-0.50999 0.02177,-0.4931 0.06087,-0.53715 0.146605,-0.1637 0.142728,0.62258 0.591071,0.6777 0.591071,0.0728 0,-0.24274 0.226097,-0.43531 0.509975,-0.43531 0.281068,0 0.511536,-0.14646 0.511536,-0.32508 0,-0.19137 -0.266559,-0.26734 -0.647215,-0.18502 -0.595361,0.12947 -0.616329,0.10227 -0.255758,-0.35182 0.215804,-0.2716 0.391449,-0.6477 0.391449,-0.8351 0,-0.18751 0.102417,-0.34114 0.227704,-0.34114 0.125272,0 0.303313,-0.33971 0.394568,-0.75343 0.192519,-0.87394 1.190939,-2.08755 1.662489,-2.07725 z m 5.842004,1.26111 c -0.663174,0.0113 -1.226087,0.33293 -1.227373,0.86181 6.07e-4,0.22956 0.115597,0.41759 0.25576,0.41759 0.140551,0 0.255763,-0.13127 0.255763,-0.29157 0,-0.42377 1.469464,-0.35727 1.607896,0.0728 0.09236,0.28625 0.190818,0.28375 0.467877,-0.0181 0.296497,-0.32224 0.272333,-0.4339 -0.155991,-0.70895 -0.370644,-0.23848 -0.80562,-0.34255 -1.203982,-0.33613 z m 3.627531,0.69679 c 0.140551,0 0.255762,0.19681 0.255762,0.43714 0,0.24025 0.115206,0.43535 0.255761,0.43535 0.140551,0 0.254187,0.26271 0.254187,0.58284 0,0.3201 0.115206,0.58286 0.255763,0.58286 0.140551,0 0.255761,0.38193 0.255761,0.84931 0,0.85812 0.731336,2.63899 1.085445,2.6423 0.105408,9.2e-4 0.191815,0.19861 0.191815,0.4389 0,0.24061 0.113257,0.43535 0.251096,0.43535 0.137877,0 0.323555,0.32795 0.411721,0.72854 0.0882,0.40016 0.261461,0.72851 0.386763,0.72851 0.125273,0 0.229278,0.45775 0.229278,1.01821 0,0.56041 0.101554,1.01993 0.226096,1.01993 0.124563,0 0.276578,0.39211 0.338423,0.87247 0.09607,0.74563 0.03029,0.87425 -0.452274,0.87425 -0.547574,0 -0.569512,0.12198 -0.728316,4.00165 -0.286122,6.99219 -0.391135,8.02695 -0.932606,9.16712 -0.132026,0.2784 -0.240147,0.67214 -0.240147,0.87604 0,0.20429 -0.201655,0.51147 -0.447597,0.6841 -0.711009,0.49888 -1.639189,-0.78316 -1.777895,-2.45748 -0.06167,-0.74455 -0.218978,-1.61674 -0.349325,-1.93686 -0.130393,-0.32047 -0.265924,-2.7438 -0.300997,-5.38584 l -0.06398,-4.80301 -5.492754,-0.14624 c -3.711943,-0.0984 -5.675525,-0.26378 -6.052641,-0.50994 -0.306946,-0.20043 -0.852757,-0.36432 -1.213334,-0.36432 -0.360553,0 -0.655014,-0.13082 -0.655014,-0.29121 0,-0.16053 -0.239148,-0.29124 -0.530248,-0.29124 -0.481329,0 -0.491664,-0.0403 -0.126331,-0.45666 0.220974,-0.25165 1.033146,-0.53293 1.805965,-0.62374 0.772815,-0.0907 1.405155,-0.27802 1.405155,-0.41576 0,-0.13762 0.403317,-0.25058 0.89519,-0.25058 0.491868,0 0.893619,-0.12902 0.893619,-0.28945 0,-0.18388 1.788683,-0.29158 4.854898,-0.29158 h 4.854904 v -3.93053 c 0,-2.42606 0.09806,-3.93059 0.255763,-3.93059 z m -2.317504,1.7467 c -0.287311,0 -1.004351,0.71289 -1.004351,0.99867 0,0.29906 0.657541,0.17503 0.971604,-0.1832 0.380347,-0.43333 0.395584,-0.8156 0.03276,-0.8156 z m -2.326869,0.0662 c -0.164154,-0.025 -0.2039,0.19544 -0.06085,0.62018 0.08865,0.26269 0.320461,0.47797 0.516218,0.47797 0.461453,0 0.450626,-0.22378 -0.03904,-0.78186 -0.174198,-0.19862 -0.317891,-0.30228 -0.416406,-0.31654 z m 10.776532,1.22776 c 0,0.24952 0.115206,0.45312 0.255751,0.45312 0.140552,0 0.255764,-0.12334 0.255764,-0.27376 0,-0.15032 -0.115206,-0.35395 -0.255764,-0.45312 -0.03526,-0.0249 -0.06923,-0.0372 -0.09976,-0.0356 -0.0916,0.005 -0.155991,0.12198 -0.155991,0.30904 z m -18.652288,1.32711 c -0.369673,0 -0.314538,1.08761 0.06393,1.2616 v 0.002 c 0.958996,0.44095 2.490612,0.0921 2.490612,-0.56678 0,-0.51695 -0.363383,-0.52205 -0.736116,-0.0113 -0.357347,0.49051 -1.562674,0.27126 -1.562674,-0.28412 0,-0.22174 -0.115207,-0.40154 -0.25576,-0.40154 z m 26.149072,0.6346 c 0.434054,-0.0581 1.191499,0.25274 1.191499,0.6219 0,0.20497 -0.13867,0.53099 -0.30727,0.72323 -0.37439,0.42671 -1.138102,0.45644 -1.356828,0.0531 -0.08838,-0.16302 -0.266984,-0.22038 -0.3977,-0.12788 -0.130824,0.0921 -0.238463,-0.0381 -0.238463,-0.28767 0,-0.24952 0.162907,-0.45308 0.361833,-0.45308 0.199251,0 0.407402,-0.15214 0.461617,-0.33792 0.03214,-0.11292 0.1408,-0.17119 0.285524,-0.19182 z m -5.963705,2.85905 c 2.044142,0 3.321854,0.11018 3.321854,0.28944 0,0.16008 0.626471,0.29122 1.39114,0.29122 0.764643,0 1.454286,0.11971 1.533023,0.2645 0.07881,0.14579 0.718226,0.35362 1.420776,0.46378 0.702511,0.10974 1.277262,0.31904 1.277262,0.46376 0,0.14466 0.122253,0.26272 0.273048,0.26272 0.150437,0 0.445758,0.1968 0.656567,0.43711 0.34077,0.38826 0.329721,0.4371 -0.10302,0.4371 -0.267701,0 -0.566631,0.0909 -0.664369,0.20292 -0.09768,0.11132 -0.375711,0.25734 -0.61757,0.3233 -0.242036,0.0667 -2.768583,0.18365 -5.614421,0.26308 -4.628677,0.12788 -5.173047,0.0959 -5.173047,-0.32153 0,-0.25666 -0.115207,-0.46736 -0.255752,-0.46736 -0.140552,0 -0.255763,-0.32795 -0.255763,-0.72854 0,-0.40043 -0.115207,-0.72679 -0.255761,-0.72679 -0.140552,0 -0.255763,-0.32792 -0.255763,-0.72849 v -0.72677 z m -22.409254,3.49321 c 0.379443,0 0.690885,0.13128 0.690885,0.2916 0,0.16008 0.280784,0.29122 0.623817,0.29122 0.343057,0 0.689425,0.1213 0.770426,0.27019 0.08101,0.14897 1.070086,0.36409 2.197415,0.47621 1.127314,0.112 2.011717,0.28446 1.966599,0.38379 -0.04512,0.0991 -0.250698,0.57161 -0.456949,1.05199 -0.206258,0.48036 -0.604708,1.11144 -0.885832,1.40198 -0.363684,0.37581 -0.419068,0.57116 -0.191814,0.67879 0.441622,0.20882 0.405312,0.70534 -0.03748,0.51176 -0.196577,-0.0862 -0.432804,-0.0181 -0.525571,0.15463 -0.266875,0.4918 -1.671844,0.38583 -1.671844,-0.12629 0,-0.24027 -0.115206,-0.43714 -0.255757,-0.43714 -0.140552,0 -0.255762,0.24632 -0.255762,0.54726 0,0.92981 1.863426,1.53187 2.359611,0.76234 0.103233,-0.16052 0.189435,0.37128 0.191815,1.17987 0.0018,0.8086 0.126835,1.61032 0.277606,1.78223 0.150754,0.17186 0.237157,0.6987 0.191816,1.171 l -0.08266,0.8583 -1.266351,-1.45177 c -1.473162,-1.68879 -2.366651,-3.11371 -2.590427,-4.12959 -0.08726,-0.39607 -0.261464,-0.71964 -0.386769,-0.71964 -0.125285,0 -0.227706,-0.3201 -0.227706,-0.71074 0,-0.39086 -0.115206,-0.79123 -0.255759,-0.89026 -0.140552,-0.0991 -0.25576,-0.73536 -0.25576,-1.41443 0,-0.67906 -0.13706,-1.39279 -0.305698,-1.58504 -0.238472,-0.2716 -0.154496,-0.34826 0.382088,-0.34826 z m 32.246918,0.58332 c 0.276614,0 0.38366,0.32259 0.38366,1.16388 0,0.64052 -0.115123,1.16389 -0.255945,1.16389 -0.140438,0 -0.255578,0.32828 -0.255578,0.72855 0,0.4001 -0.120845,0.72675 -0.269838,0.72675 -0.148645,0 -0.211382,0.10973 -0.13867,0.24346 0.163271,0.30086 -0.84281,2.66891 -1.133794,2.66891 -0.116566,0 -0.280527,0.24669 -0.364936,0.5491 -0.217437,0.78064 -3.00107,3.99654 -3.668075,4.23792 -0.306551,0.11087 -0.556761,0.3087 -0.556761,0.4407 0,0.13219 -0.165106,0.31369 -0.366492,0.40159 -0.249492,0.1086 -0.419269,-0.11269 -0.531814,-0.69657 -0.09088,-0.47122 -0.269875,-0.85646 -0.399246,-0.85646 -0.129351,0 -0.23551,-0.25414 -0.23551,-0.56506 0,-0.31082 -0.115218,-0.64732 -0.255761,-0.74633 -0.140551,-0.0991 -0.255763,-0.43367 -0.255763,-0.7445 0,-0.31049 -0.115206,-0.56508 -0.25576,-0.56508 -0.140551,0 -0.236004,-0.0986 -0.213649,-0.2188 0.04668,-0.25129 -0.226031,-1.15307 -0.570809,-1.88886 -0.130281,-0.2784 -0.237038,-0.70292 -0.237038,-0.94534 0,-0.2424 -0.08995,-0.44067 -0.19966,-0.44067 -0.109757,0 -0.335642,-0.36103 -0.502177,-0.80141 -0.166491,-0.44034 -0.537515,-1.25911 -0.825,-1.81957 l -0.522449,-1.01817 4.538299,-0.18818 c 5.909429,-0.24453 6.709212,-0.31618 6.709212,-0.59703 0,-0.12857 0.172883,-0.23277 0.383659,-0.23277 z m -19.555209,0.87233 c 0.33532,7.9e-4 0.396806,0.76898 0.427315,5.41252 0.02319,3.52768 0.134633,5.52336 0.319708,5.73413 0.156127,0.17798 0.283848,0.69065 0.283848,1.13899 0,0.44836 0.113682,0.81562 0.254188,0.81562 0.140551,0 0.255762,0.18524 0.255762,0.41224 0,0.22674 0.144043,0.47893 0.319706,0.55976 0.175672,0.0809 -0.0836,0.14828 -0.575468,0.15078 -0.491878,0.002 -1.124111,-0.0998 -1.405171,-0.22707 -0.281068,-0.12833 -0.711635,-0.19613 -0.957564,-0.15259 -0.245921,0.0435 -0.447587,-0.0322 -0.447587,-0.16552 0,-0.13355 -0.201657,-0.30298 -0.447597,-0.37669 -0.383579,-0.11405 -0.38681,-0.13967 -0.02632,-0.16688 0.485175,-0.0392 0.89266,-0.99127 0.489695,-1.14429 -0.148577,-0.0565 -0.271404,-0.32332 -0.271404,-0.59168 0,-0.26807 -0.202833,-0.6329 -0.452272,-0.81034 -0.249447,-0.17753 -0.681541,-0.86122 -0.959129,-1.52106 -0.277609,-0.65976 -0.590143,-1.20113 -0.695563,-1.20295 -0.105408,-0.002 -0.191815,-0.72388 -0.191815,-1.60456 0,-0.88069 0.115206,-1.60277 0.255759,-1.60277 0.140553,0 0.254227,-0.26128 0.254227,-0.58107 0,-0.3201 0.103931,-0.58286 0.229276,-0.58286 0.125247,0 0.297825,-0.31973 0.383652,-0.70894 0.0858,-0.38966 0.385197,-0.7906 0.665926,-0.89201 0.280747,-0.10158 0.509976,-0.30727 0.509976,-0.45669 0,-0.14941 0.14774,-0.27199 0.327514,-0.27199 0.179797,0 0.492992,-0.26128 0.695561,-0.58102 0.202586,-0.32046 0.543034,-0.58334 0.757941,-0.58284 z m 6.69821,-7e-5 c 0.307479,0 0.974723,0.74574 0.974723,1.08927 0,0.14193 0.288084,0.93644 0.639413,1.76624 0.351329,0.82982 0.639414,1.77026 0.639414,2.09142 0,0.32046 0.113681,0.58463 0.254198,0.58463 0.140551,0 0.255752,0.27555 0.255752,0.61127 0,0.59823 0.711921,2.59436 1.02775,2.88217 0.08783,0.0803 0.256159,0.40842 0.3743,0.72854 0.118126,0.3201 0.240285,0.64666 0.271399,0.72674 0.03101,0.0803 0.140417,0.44116 0.243326,0.80139 0.102902,0.36053 0.317922,0.65761 0.477224,0.66102 0.159301,0.004 -0.113256,0.21539 -0.605113,0.4691 -1.443072,0.74482 -1.832211,0.90067 -3.465331,1.38955 -0.852431,0.25558 -1.98306,0.46378 -2.510889,0.46378 -0.872427,0 -0.921798,-0.041 -0.55676,-0.45663 0.22086,-0.25168 0.400802,-0.77681 0.400802,-1.16568 0,-0.38914 0.115218,-0.7072 0.255762,-0.7072 0.140552,0 0.255764,-0.46675 0.255764,-1.03773 0,-0.57093 0.107476,-1.26675 0.238609,-1.54593 0.131075,-0.27947 0.262999,-2.09162 0.294759,-4.02826 0.06684,-4.07143 0.192767,-5.32369 0.534924,-5.32369 z m -10.29931,0.002 c 1.418517,-0.002 1.587126,0.0528 1.310026,0.43356 -0.174946,0.2406 -0.477011,0.43711 -0.670613,0.43711 -0.193605,0 -0.352435,0.13944 -0.352435,0.31083 0,0.17141 -0.171272,0.50774 -0.382087,0.7481 -0.210815,0.24061 -0.383651,0.68986 -0.383651,0.99862 0,0.3087 -0.115206,0.56153 -0.255763,0.56153 -0.14055,0 -0.255752,0.25416 -0.255752,0.56508 0,0.31083 -0.115218,0.64551 -0.255762,0.74452 -0.14055,0.0991 -0.255761,0.75541 -0.255761,1.45707 0,0.7016 0.115218,1.35625 0.255761,1.45526 0.140551,0.0991 0.255762,0.43372 0.255762,0.74459 0,0.31083 0.115207,0.56506 0.255752,0.56506 0.140551,0 0.255763,0.25664 0.255763,0.56858 0,0.31225 0.154428,0.67171 0.343089,0.79964 0.188688,0.12764 0.546314,0.59383 0.795382,1.03412 l 0.453829,0.80141 -0.732991,-0.025 c -0.402645,-0.0136 -0.890656,-0.0936 -1.083891,-0.18139 -0.677463,-0.3062 -2.331534,-2.4205 -2.331534,-2.97987 0,-0.31085 -0.113646,-0.64727 -0.254196,-0.74629 -0.140553,-0.0991 -0.255764,-1.21977 -0.255764,-2.49129 0,-1.34717 0.106886,-2.31178 0.255764,-2.31178 0.140551,0 0.254196,-0.1968 0.254196,-0.43709 0,-0.24027 0.09059,-0.43535 0.199615,-0.43535 0.109037,0 0.424358,-0.5888 0.701801,-1.30786 l 0.505291,-1.30779 1.628178,-0.002 z m 16.10399,1.45231 c -1.016041,0 -1.773281,0.65161 -1.21489,1.0448 0.177169,0.12516 0.36036,0.0723 0.416397,-0.11904 0.139734,-0.47758 1.296652,-0.42924 1.73735,0.0728 0.200748,0.22851 0.364955,0.81778 0.364955,1.30961 0,0.49181 0.113705,0.89378 0.25415,0.89378 0.426149,0 0.286243,-1.98983 -0.183925,-2.61563 -0.291939,-0.38869 -0.754424,-0.58637 -1.37399,-0.58637 z m -22.387445,0.0512 c -0.264849,-0.007 -0.839037,0.53815 -0.839037,0.85827 0,0.38019 0.243712,0.31047 0.687762,-0.19544 0.217346,-0.24773 0.326909,-0.52842 0.243321,-0.6237 -0.02245,-0.0249 -0.05419,-0.0381 -0.09203,-0.0392 z m 1.124437,0.0322 c -0.176761,0.002 -0.201157,0.25913 0.07493,0.63791 0.319034,0.43809 0.771988,0.60034 0.771988,0.27732 0,-0.0911 -0.177078,-0.36865 -0.39457,-0.61656 -0.184538,-0.2104 -0.34623,-0.30015 -0.452272,-0.29872 z m 7.067933,1.95545 c -0.09918,-0.0113 -0.189345,0.0181 -0.25266,0.0887 -0.07834,0.0891 0.01316,0.3632 0.202744,0.60769 0.445746,0.57499 0.728316,0.58207 0.728316,0.0204 0,-0.34434 -0.380926,-0.68856 -0.67841,-0.71609 z m 0.463171,2.33777 c -0.08699,-0.0181 -0.177485,0.0598 -0.224577,0.2095 -0.06279,0.20043 -0.334218,0.3625 -0.603548,0.3625 -0.269339,0 -0.489697,0.13082 -0.489697,0.29121 0,0.47224 1.278977,0.33223 1.44414,-0.15826 0.08313,-0.24702 0.06471,-0.5408 -0.04205,-0.65394 -0.02671,-0.0286 -0.05523,-0.0449 -0.08424,-0.0513 z"
       inkscape:label="Invers"
       sodipodi:nodetypes="sssssssssccssssssssscssssscsssssssssssscccsssscsssssssssssscssssssssssssssssssssssssssssssssssssssssssssssssssscsssssscssssssssssssssssssssscsscssssscssssssssssccsssccsssscssssssssssscsssssssssssssssssssssssssscccsssssssssccsssssssssssssccsscsssssssscssssssssssssssscscssssssssssssscccsssssssssscsssscsssssssssssssssssssssscsssssssssscscssssssssssssssssssssssssscccsssssssccssscssssssssssssssssssssccssssscssssssscssccssscsssscccscccsssscccs"
       inkscape:export-filename="C:\Users\noahk\eupt_logo_7.png"
       inkscape:export-xdpi="96"
       inkscape:export-ydpi="96" />
  </g>
</svg>
