{
 "cells": [
  {
   "cell_type": "code",
   "execution_count": 2,
   "metadata": {},
   "outputs": [
    {
     "name": "stdout",
     "output_type": "stream",
     "text": [
      "Using matplotlib backend: TkAgg\n"
     ]
    }
   ],
   "source": [
    "\n",
    "import os, sys\n",
    "sys.path.append(\"../\")\n",
    "os.environ[\"DJANGO_SETTINGS_MODULE\"]=\"exotom.settings\"\n",
    "from exotom import settings\n",
    "import django\n",
    "django.setup()\n",
    "\n",
    "from importlib import reload\n",
    "\n",
    "from exotom import photometry, tess_transit_fit\n",
    "from exotom.models import Transit, Target\n",
    "from tom_targets.models import TargetExtra\n",
    "\n",
    "\n",
    "import numpy as np\n",
    "from astropy.coordinates import SkyCoord, EarthLocation\n",
    "import astropy.units as u\n",
    "from datetime import datetime\n",
    "import matplotlib.pyplot as plt\n",
    "import pandas as pd\n",
    "%matplotlib"
   ]
  },
  {
   "cell_type": "code",
   "execution_count": 58,
   "metadata": {},
   "outputs": [
    {
     "data": {
      "text/plain": [
       "(276, 69)"
      ]
     },
     "execution_count": 58,
     "metadata": {},
     "output_type": "execute_result"
    }
   ],
   "source": [
    "#all_lc = pd.read_csv(\"/home/tilman/exotom/investigation/target_toi_1809_79_light_curve_all.csv\")\n",
    "all_lc = pd.read_csv(\"/home/tilman/exotom/investigation/Target_TOI_1302.01_transit_105_light_curve_all_4HI250I.csv\")\n",
    "\n",
    "all_lc = all_lc.drop(labels=list(all_lc.index)[::2])\n",
    "all_lc = all_lc.drop(labels=list(all_lc.index)[::2])\n",
    "all_lc.shape"
   ]
  },
  {
   "cell_type": "code",
   "execution_count": 23,
   "metadata": {
    "scrolled": true
   },
   "outputs": [
    {
     "data": {
      "text/plain": [
       "Unnamed: 0    0\n",
       "time          0\n",
       "1             0\n",
       "2             0\n",
       "4             0\n",
       "5             0\n",
       "6             0\n",
       "7             0\n",
       "8             0\n",
       "9             0\n",
       "10            0\n",
       "11            0\n",
       "12            0\n",
       "13            0\n",
       "14            0\n",
       "15            0\n",
       "16            0\n",
       "18            0\n",
       "19            0\n",
       "20            0\n",
       "21            0\n",
       "22            0\n",
       "23            0\n",
       "24            0\n",
       "25            0\n",
       "26            0\n",
       "27            0\n",
       "28            0\n",
       "29            0\n",
       "31            0\n",
       "32            0\n",
       "33            0\n",
       "34            0\n",
       "35            0\n",
       "36            0\n",
       "38            0\n",
       "39            0\n",
       "40            0\n",
       "41            0\n",
       "42            0\n",
       "43            0\n",
       "44            0\n",
       "46            0\n",
       "47            0\n",
       "48            0\n",
       "53            0\n",
       "54            0\n",
       "55            0\n",
       "56            0\n",
       "58            0\n",
       "target        0\n",
       "dtype: int64"
      ]
     },
     "execution_count": 23,
     "metadata": {},
     "output_type": "execute_result"
    }
   ],
   "source": [
    "(all_lc == -np.inf).sum()"
   ]
  },
  {
   "cell_type": "code",
   "execution_count": null,
   "metadata": {},
   "outputs": [],
   "source": []
  },
  {
   "cell_type": "code",
   "execution_count": 59,
   "metadata": {},
   "outputs": [],
   "source": [
    "goe = EarthLocation(lat=51.561 * u.deg, lon=9.944 * u.deg, height=200 * u.m)\n",
    "target1_dict = {\n",
    "    \"name\": \"test_TOI 1809.01\",\n",
    "    \"type\": \"SIDEREAL\",\n",
    "    \"ra\": 183.3660,\n",
    "    \"dec\": 23.0557,\n",
    "}\n",
    "target1_extra_fields = {\n",
    "    \"Mag (TESS)\": 11.5384,\n",
    "    \"Epoch (BJD)\": 2458902.718492,\n",
    "    \"Duration (hours)\": 3.588807,\n",
    "    \"Period (days)\": 4.617208,\n",
    "    \"Depth (mmag)\": 12.207647,\n",
    "    \"Planet Radius (R_Earth)\": 12.041519,\n",
    "    \"Stellar Radius (R_Sun)\": 1.1136,\n",
    "    \"Stellar Distance (pc)\": 321.084,\n",
    "}\n",
    "\n",
    "target = Target(**target1_dict)\n",
    "target_extras = [TargetExtra(target=target, key=key, value=value, float_value=value) \n",
    "                 for key, value in target1_extra_fields.items()]\n",
    "\n",
    "transit_dict = {\n",
    "    \"target\": target,\n",
    "    'number': 79,\n",
    "    'start': datetime(2021, 2, 21, 21, 32, 11, 554702),\n",
    "    'mid': datetime(2021, 2, 21, 23, 19, 51, 407302),\n",
    "    'end': datetime(2021, 2, 22, 1, 7, 31, 259902)\n",
    "}\n",
    "transit = Transit(**transit_dict)\n"
   ]
  },
  {
   "cell_type": "code",
   "execution_count": 60,
   "metadata": {},
   "outputs": [],
   "source": [
    "reload(photometry)\n",
    "reload(tess_transit_fit)\n",
    "\n",
    "tlce = photometry.TransitLightCurveExtractor(\n",
    "    all_light_curves_df=all_lc, \n",
    "    target_coord=SkyCoord(target.ra * u.deg, target.dec * u.deg),\n",
    "    target_extras=target_extras,\n",
    "    transit=transit,\n",
    "    earth_location=goe\n",
    ")"
   ]
  },
  {
   "cell_type": "code",
   "execution_count": 61,
   "metadata": {
    "scrolled": true
   },
   "outputs": [
    {
     "name": "stdout",
     "output_type": "stream",
     "text": [
      "starting drop bad ref sources\n",
      "Initial batman TransitParams:\n",
      "{'a': 16.301326571397812,\n",
      " 'ecc': 0,\n",
      " 'fp': None,\n",
      " 'inc': 90,\n",
      " 'limb_dark': 'linear',\n",
      " 'per': 4.617208,\n",
      " 'rp': 0.09902148034556439,\n",
      " 't0': 2459267.47212277,\n",
      " 't_secondary': None,\n",
      " 'u': [0.4],\n",
      " 'w': 90}\n",
      "\n",
      "Starting fit with airmass detrending...\n",
      "   Iteration     Total nfev        Cost      Cost reduction    Step norm     Optimality   \n",
      "       0              1         8.3682e+02                                    9.98e+02    \n",
      "       1              2         4.3315e-01      8.36e+02       1.39e+00       1.71e+00    \n",
      "       2              3         1.1312e-01      3.20e-01       3.11e-01       3.82e-01    \n",
      "       3              4         1.1300e-01      1.22e-04       5.31e-04       6.53e-04    \n",
      "`xtol` termination condition is satisfied.\n",
      "Function evaluations 4, initial cost 8.3682e+02, final cost 1.1300e-01, first-order optimality 6.53e-04.\n",
      "\n",
      "Fitted parameters and errors: [a, t0, inc, ecc, w, linear_limb_darkening_coeff, m_airmass, b_airmass]: \n",
      "[ 1.63013266e+01  2.45926747e+06  9.00000000e+01  1.00000000e-10\n",
      "  9.00000000e+01  4.00000000e-01 -2.44781067e-02  1.03543448e+00]\n",
      "[0.00000000e+00 6.26423570e-19 0.00000000e+00 0.00000000e+00\n",
      " 0.00000000e+00 0.00000000e+00 6.36085927e-03 9.37301636e-03]\n",
      "Covariance matrix: \n",
      "[[ 0.00000000e+00  0.00000000e+00  0.00000000e+00  0.00000000e+00\n",
      "   0.00000000e+00  0.00000000e+00  0.00000000e+00  0.00000000e+00]\n",
      " [ 0.00000000e+00  3.92406489e-37  0.00000000e+00  0.00000000e+00\n",
      "   0.00000000e+00  0.00000000e+00 -3.95159124e-21  5.86133255e-21]\n",
      " [ 0.00000000e+00  0.00000000e+00  0.00000000e+00  0.00000000e+00\n",
      "   0.00000000e+00  0.00000000e+00  0.00000000e+00  0.00000000e+00]\n",
      " [ 0.00000000e+00  0.00000000e+00  0.00000000e+00  0.00000000e+00\n",
      "   0.00000000e+00  0.00000000e+00  0.00000000e+00  0.00000000e+00]\n",
      " [ 0.00000000e+00  0.00000000e+00  0.00000000e+00  0.00000000e+00\n",
      "   0.00000000e+00  0.00000000e+00  0.00000000e+00  0.00000000e+00]\n",
      " [ 0.00000000e+00  0.00000000e+00  0.00000000e+00  0.00000000e+00\n",
      "   0.00000000e+00  0.00000000e+00  0.00000000e+00  0.00000000e+00]\n",
      " [ 0.00000000e+00 -3.95159124e-21  0.00000000e+00  0.00000000e+00\n",
      "   0.00000000e+00  0.00000000e+00  4.04605306e-05 -5.85745200e-05]\n",
      " [ 0.00000000e+00  5.86133255e-21  0.00000000e+00  0.00000000e+00\n",
      "   0.00000000e+00  0.00000000e+00 -5.85745200e-05  8.78534357e-05]]\n",
      "\n",
      "Final batman TransitParams:\n",
      "{'a': 16.301326571397812,\n",
      " 'ecc': 1e-10,\n",
      " 'fp': None,\n",
      " 'inc': 89.999999991,\n",
      " 'limb_dark': 'linear',\n",
      " 'per': 4.617208,\n",
      " 'rp': 0.09902148034556439,\n",
      " 't0': 2459267.47212277,\n",
      " 't_secondary': None,\n",
      " 'u': [0.4],\n",
      " 'w': 90.0}\n",
      "\n",
      "{'t0': 2459267.47212277, 'per': 4.617208, 'rp': 0.09902148034556439, 'a': 16.301326571397812, 'inc': 89.999999991, 'ecc': 1e-10, 'w': 90.0, 'u': [0.4], 'limb_dark': 'linear', 'fp': None, 't_secondary': None}\n",
      "0.0008188413835172078\n",
      "Initial batman TransitParams:\n",
      "{'a': 16.301326571397812,\n",
      " 'ecc': 1e-10,\n",
      " 'fp': None,\n",
      " 'inc': 89.999999991,\n",
      " 'limb_dark': 'linear',\n",
      " 'per': 4.617208,\n",
      " 'rp': 0.09902148034556439,\n",
      " 't0': 2459267.47212277,\n",
      " 't_secondary': None,\n",
      " 'u': [0.4],\n",
      " 'w': 90.0}\n",
      "\n",
      "Starting fit with airmass detrending...\n",
      "   Iteration     Total nfev        Cost      Cost reduction    Step norm     Optimality   \n",
      "       0              1         1.4814e+02                                    4.14e+02    \n",
      "       1              2         2.5914e+00      1.46e+02       5.79e-01       4.64e+00    \n",
      "       2              3         2.2507e-01      2.37e+00       8.38e-01       6.73e+00    \n",
      "       3              4         1.8660e-01      3.85e-02       9.41e-03       7.55e-02    \n",
      "`xtol` termination condition is satisfied.\n",
      "Function evaluations 4, initial cost 1.4814e+02, final cost 1.8660e-01, first-order optimality 7.55e-02.\n",
      "\n",
      "Fitted parameters and errors: [a, t0, inc, ecc, w, linear_limb_darkening_coeff, m_airmass, b_airmass]: \n",
      "[ 1.63013266e+01  2.45926747e+06  9.00000000e+01  1.00000000e-10\n",
      "  9.00000000e+01  4.00000000e-01 -1.69219812e-02  1.02422430e+00]\n",
      "[0.00000000e+00 1.60995060e-18 3.21990120e-18 0.00000000e+00\n",
      " 6.35020783e-49 6.15553477e-66 8.17391754e-03 1.20446404e-02]\n",
      "Covariance matrix: \n",
      "[[ 0.00000000e+000  0.00000000e+000  0.00000000e+000  0.00000000e+000\n",
      "   0.00000000e+000  0.00000000e+000  0.00000000e+000  0.00000000e+000]\n",
      " [ 0.00000000e+000  2.59194094e-036 -5.18388188e-036  0.00000000e+000\n",
      "  -1.02234044e-066  0.00000000e+000 -1.30506138e-020  1.93577683e-020]\n",
      " [ 0.00000000e+000 -5.18388188e-036  1.03677638e-035  0.00000000e+000\n",
      "   2.04468088e-066  0.00000000e+000  2.61012277e-020 -3.87155366e-020]\n",
      " [ 0.00000000e+000  0.00000000e+000  0.00000000e+000  0.00000000e+000\n",
      "   0.00000000e+000  0.00000000e+000  0.00000000e+000  0.00000000e+000]\n",
      " [ 0.00000000e+000 -1.02234044e-066  2.04468088e-066  0.00000000e+000\n",
      "   4.03251395e-097 -1.86642017e-116  5.14437636e-051 -7.63743935e-051]\n",
      " [ 0.00000000e+000  0.00000000e+000  0.00000000e+000  0.00000000e+000\n",
      "  -1.86642017e-116  3.78906083e-131  6.46221044e-069  4.35669089e-069]\n",
      " [ 0.00000000e+000 -1.30506138e-020  2.61012277e-020  0.00000000e+000\n",
      "   5.14437636e-051  6.46221044e-069  6.68129279e-005 -9.67247617e-005]\n",
      " [ 0.00000000e+000  1.93577683e-020 -3.87155366e-020  0.00000000e+000\n",
      "  -7.63743935e-051  4.35669089e-069 -9.67247617e-005  1.45073363e-004]]\n",
      "\n",
      "Final batman TransitParams:\n",
      "{'a': 16.301326571397812,\n",
      " 'ecc': 1e-10,\n",
      " 'fp': None,\n",
      " 'inc': 89.999999991,\n",
      " 'limb_dark': 'linear',\n",
      " 'per': 4.617208,\n",
      " 'rp': 0.09902148034556439,\n",
      " 't0': 2459267.47212277,\n",
      " 't_secondary': None,\n",
      " 'u': [0.4],\n",
      " 'w': 90.0}\n",
      "\n",
      "0.0013520871186057139\n",
      "NOT Dropping column 0\n",
      "Initial batman TransitParams:\n",
      "{'a': 16.301326571397812,\n",
      " 'ecc': 1e-10,\n",
      " 'fp': None,\n",
      " 'inc': 89.999999991,\n",
      " 'limb_dark': 'linear',\n",
      " 'per': 4.617208,\n",
      " 'rp': 0.09902148034556439,\n",
      " 't0': 2459267.47212277,\n",
      " 't_secondary': None,\n",
      " 'u': [0.4],\n",
      " 'w': 90.0}\n",
      "\n",
      "Starting fit with airmass detrending...\n",
      "   Iteration     Total nfev        Cost      Cost reduction    Step norm     Optimality   \n",
      "       0              1         1.4499e+02                                    4.09e+02    \n",
      "       1              2         2.5985e+00      1.42e+02       5.73e-01       4.69e+00    \n",
      "       2              3         1.8622e-01      2.41e+00       8.46e-01       6.93e+00    \n",
      "       3              4         1.4535e-01      4.09e-02       9.70e-03       7.95e-02    \n",
      "`xtol` termination condition is satisfied.\n",
      "Function evaluations 4, initial cost 1.4499e+02, final cost 1.4535e-01, first-order optimality 7.95e-02.\n",
      "\n",
      "Fitted parameters and errors: [a, t0, inc, ecc, w, linear_limb_darkening_coeff, m_airmass, b_airmass]: \n",
      "[ 1.63013266e+01  2.45926747e+06  9.00000000e+01  1.00000000e-10\n",
      "  9.00000000e+01  4.00000000e-01 -1.90072018e-02  1.02722875e+00]\n",
      "[0.00000000e+00 1.24063873e-19 1.42093026e-18 0.00000000e+00\n",
      " 1.00178243e-49 1.12123646e-63 7.21423798e-03 1.06305088e-02]\n",
      "Covariance matrix: \n",
      "[[ 0.00000000e+000  0.00000000e+000  0.00000000e+000  0.00000000e+000\n",
      "   0.00000000e+000  0.00000000e+000  0.00000000e+000  0.00000000e+000]\n",
      " [ 0.00000000e+000  1.53918445e-038  0.00000000e+000  0.00000000e+000\n",
      "  -2.37148914e-070  6.47688935e-084  1.14953144e-022  7.74990728e-023]\n",
      " [ 0.00000000e+000  0.00000000e+000  2.01904280e-036  0.00000000e+000\n",
      "   1.42320381e-067 -1.59147089e-081  1.01660295e-020 -1.50791101e-020]\n",
      " [ 0.00000000e+000  0.00000000e+000  0.00000000e+000  0.00000000e+000\n",
      "   0.00000000e+000  0.00000000e+000  0.00000000e+000  0.00000000e+000]\n",
      " [ 0.00000000e+000 -2.37148914e-070  1.42320381e-067  0.00000000e+000\n",
      "   1.00356803e-098 -1.12281041e-112  7.14822483e-052 -1.06410600e-051]\n",
      " [ 0.00000000e+000  6.47688935e-084 -1.59147089e-081  0.00000000e+000\n",
      "  -1.12281041e-112  1.25717119e-126 -7.96480104e-066  1.19184244e-065]\n",
      " [ 0.00000000e+000  1.14953144e-022  1.01660295e-020  0.00000000e+000\n",
      "   7.14822483e-052 -7.96480104e-066  5.20452296e-005 -7.53456342e-005]\n",
      " [ 0.00000000e+000  7.74990728e-023 -1.50791101e-020  0.00000000e+000\n",
      "  -1.06410600e-051  1.19184244e-065 -7.53456342e-005  1.13007718e-004]]\n",
      "\n",
      "Final batman TransitParams:\n",
      "{'a': 16.301326571397812,\n",
      " 'ecc': 1e-10,\n",
      " 'fp': None,\n",
      " 'inc': 89.999999991,\n",
      " 'limb_dark': 'linear',\n",
      " 'per': 4.617208,\n",
      " 'rp': 0.09902148034556439,\n",
      " 't0': 2459267.47212277,\n",
      " 't_secondary': None,\n",
      " 'u': [0.4],\n",
      " 'w': 90.0}\n",
      "\n",
      "0.0010532099823419168\n",
      "NOT Dropping column 1\n"
     ]
    },
    {
     "name": "stdout",
     "output_type": "stream",
     "text": [
      "Initial batman TransitParams:\n",
      "{'a': 16.301326571397812,\n",
      " 'ecc': 1e-10,\n",
      " 'fp': None,\n",
      " 'inc': 89.999999991,\n",
      " 'limb_dark': 'linear',\n",
      " 'per': 4.617208,\n",
      " 'rp': 0.09902148034556439,\n",
      " 't0': 2459267.47212277,\n",
      " 't_secondary': None,\n",
      " 'u': [0.4],\n",
      " 'w': 90.0}\n",
      "\n",
      "Starting fit with airmass detrending...\n",
      "   Iteration     Total nfev        Cost      Cost reduction    Step norm     Optimality   \n",
      "       0              1         1.4583e+02                                    4.10e+02    \n",
      "       1              2         2.5732e+00      1.43e+02       5.74e-01       4.68e+00    \n",
      "       2              3         1.7284e-01      2.40e+00       8.44e-01       6.88e+00    \n",
      "       3              4         1.3262e-01      4.02e-02       9.62e-03       7.84e-02    \n",
      "`xtol` termination condition is satisfied.\n",
      "Function evaluations 4, initial cost 1.4583e+02, final cost 1.3262e-01, first-order optimality 7.84e-02.\n",
      "\n",
      "Fitted parameters and errors: [a, t0, inc, ecc, w, linear_limb_darkening_coeff, m_airmass, b_airmass]: \n",
      "[ 1.63013266e+01  2.45926747e+06  9.00000000e+01  1.00000000e-10\n",
      "  9.00000000e+01  4.00000000e-01 -1.85147413e-02  1.02651969e+00]\n",
      "[0.00000000e+00 6.88892628e-19 2.71449429e-18 0.00000000e+00\n",
      " 8.36468133e-51 6.48667572e-67 6.89091095e-03 1.01540717e-02]\n",
      "Covariance matrix: \n",
      "[[ 0.00000000e+000  0.00000000e+000  0.00000000e+000  0.00000000e+000\n",
      "   0.00000000e+000  0.00000000e+000  0.00000000e+000  0.00000000e+000]\n",
      " [ 0.00000000e+000  4.74573053e-037  1.84211981e-036  0.00000000e+000\n",
      "   5.67646992e-069 -7.68694360e-086  4.53272444e-021 -6.94959327e-021]\n",
      " [ 0.00000000e+000  1.84211981e-036  7.36847923e-036  0.00000000e+000\n",
      "   2.27058797e-068  0.00000000e+000  1.85504183e-020 -2.75155409e-020]\n",
      " [ 0.00000000e+000  0.00000000e+000  0.00000000e+000  0.00000000e+000\n",
      "   0.00000000e+000  0.00000000e+000  0.00000000e+000  0.00000000e+000]\n",
      " [ 0.00000000e+000  5.67646992e-069  2.27058797e-068  0.00000000e+000\n",
      "   6.99678937e-101  0.00000000e+000  5.71628896e-053 -8.47888066e-053]\n",
      " [ 0.00000000e+000 -7.68694360e-086  0.00000000e+000  0.00000000e+000\n",
      "   0.00000000e+000  4.20769619e-133  5.74095154e-070  3.87043281e-070]\n",
      " [ 0.00000000e+000  4.53272444e-021  1.85504183e-020  0.00000000e+000\n",
      "   5.71628896e-053  5.74095154e-070  4.74846537e-005 -6.87433100e-005]\n",
      " [ 0.00000000e+000 -6.94959327e-021 -2.75155409e-020  0.00000000e+000\n",
      "  -8.47888066e-053  3.87043281e-070 -6.87433100e-005  1.03105172e-004]]\n",
      "\n",
      "Final batman TransitParams:\n",
      "{'a': 16.301326571397812,\n",
      " 'ecc': 1e-10,\n",
      " 'fp': None,\n",
      " 'inc': 89.999999991,\n",
      " 'limb_dark': 'linear',\n",
      " 'per': 4.617208,\n",
      " 'rp': 0.09902148034556439,\n",
      " 't0': 2459267.47212277,\n",
      " 't_secondary': None,\n",
      " 'u': [0.4],\n",
      " 'w': 90.0}\n",
      "\n",
      "0.0009609151279435506\n",
      "NOT Dropping column 2\n",
      "Initial batman TransitParams:\n",
      "{'a': 16.301326571397812,\n",
      " 'ecc': 1e-10,\n",
      " 'fp': None,\n",
      " 'inc': 89.999999991,\n",
      " 'limb_dark': 'linear',\n",
      " 'per': 4.617208,\n",
      " 'rp': 0.09902148034556439,\n",
      " 't0': 2459267.47212277,\n",
      " 't_secondary': None,\n",
      " 'u': [0.4],\n",
      " 'w': 90.0}\n",
      "\n",
      "Starting fit with airmass detrending...\n",
      "   Iteration     Total nfev        Cost      Cost reduction    Step norm     Optimality   \n",
      "       0              1         1.4562e+02                                    4.10e+02    \n",
      "       1              2         2.5604e+00      1.43e+02       5.74e-01       4.67e+00    \n",
      "       2              3         1.6686e-01      2.39e+00       8.43e-01       6.86e+00    \n",
      "       3              4         1.2682e-01      4.00e-02       9.60e-03       7.82e-02    \n",
      "`xtol` termination condition is satisfied.\n",
      "Function evaluations 4, initial cost 1.4562e+02, final cost 1.2682e-01, first-order optimality 7.82e-02.\n",
      "\n",
      "Fitted parameters and errors: [a, t0, inc, ecc, w, linear_limb_darkening_coeff, m_airmass, b_airmass]: \n",
      "[ 1.63013266e+01  2.45926747e+06  9.00000000e+01  1.00000000e-10\n",
      "  9.00000000e+01  4.00000000e-01 -1.76778204e-02  1.02530891e+00]\n",
      "[0.00000000e+00 1.15883020e-19 0.00000000e+00 0.00000000e+00\n",
      " 1.63594121e-50 3.63338447e-66 6.73852641e-03 9.92952612e-03]\n",
      "Covariance matrix: \n",
      "[[ 0.00000000e+000  0.00000000e+000  0.00000000e+000  0.00000000e+000\n",
      "   0.00000000e+000  0.00000000e+000  0.00000000e+000  0.00000000e+000]\n",
      " [ 0.00000000e+000  1.34288744e-038  0.00000000e+000  0.00000000e+000\n",
      "   0.00000000e+000  9.18840871e-087  1.00292809e-022  6.76153731e-023]\n",
      " [ 0.00000000e+000  0.00000000e+000  0.00000000e+000  0.00000000e+000\n",
      "   0.00000000e+000  0.00000000e+000  0.00000000e+000  0.00000000e+000]\n",
      " [ 0.00000000e+000  0.00000000e+000  0.00000000e+000  0.00000000e+000\n",
      "   0.00000000e+000  0.00000000e+000  0.00000000e+000  0.00000000e+000]\n",
      " [ 0.00000000e+000  0.00000000e+000  0.00000000e+000  0.00000000e+000\n",
      "   2.67630365e-100  5.94258787e-116 -1.09325322e-052  1.62160514e-052]\n",
      " [ 0.00000000e+000  9.18840871e-087  0.00000000e+000  0.00000000e+000\n",
      "   5.94258787e-116  1.32014827e-131 -2.42064748e-068  3.60531317e-068]\n",
      " [ 0.00000000e+000  1.00292809e-022  0.00000000e+000  0.00000000e+000\n",
      "  -1.09325322e-052 -2.42064748e-068  4.54077382e-005 -6.57365692e-005]\n",
      " [ 0.00000000e+000  6.76153731e-023  0.00000000e+000  0.00000000e+000\n",
      "   1.62160514e-052  3.60531317e-068 -6.57365692e-005  9.85954891e-005]]\n",
      "\n",
      "Final batman TransitParams:\n",
      "{'a': 16.301326571397812,\n",
      " 'ecc': 1e-10,\n",
      " 'fp': None,\n",
      " 'inc': 89.999999991,\n",
      " 'limb_dark': 'linear',\n",
      " 'per': 4.617208,\n",
      " 'rp': 0.09902148034556439,\n",
      " 't0': 2459267.47212277,\n",
      " 't_secondary': None,\n",
      " 'u': [0.4],\n",
      " 'w': 90.0}\n",
      "\n",
      "0.0009188829244409619\n",
      "NOT Dropping column 4\n",
      "Initial batman TransitParams:\n",
      "{'a': 16.301326571397812,\n",
      " 'ecc': 1e-10,\n",
      " 'fp': None,\n",
      " 'inc': 89.999999991,\n",
      " 'limb_dark': 'linear',\n",
      " 'per': 4.617208,\n",
      " 'rp': 0.09902148034556439,\n",
      " 't0': 2459267.47212277,\n",
      " 't_secondary': None,\n",
      " 'u': [0.4],\n",
      " 'w': 90.0}\n",
      "\n",
      "Starting fit with airmass detrending...\n",
      "   Iteration     Total nfev        Cost      Cost reduction    Step norm     Optimality   \n",
      "       0              1         1.4528e+02                                    4.10e+02    \n",
      "       1              2         2.5505e+00      1.43e+02       5.73e-01       4.67e+00    \n",
      "       2              3         1.6134e-01      2.39e+00       8.42e-01       6.86e+00    \n",
      "       3              4         1.2135e-01      4.00e-02       9.60e-03       7.81e-02    \n",
      "`xtol` termination condition is satisfied.\n",
      "Function evaluations 4, initial cost 1.4528e+02, final cost 1.2135e-01, first-order optimality 7.81e-02.\n",
      "\n",
      "Fitted parameters and errors: [a, t0, inc, ecc, w, linear_limb_darkening_coeff, m_airmass, b_airmass]: \n",
      "[ 1.63013266e+01  2.45926747e+06  9.00000000e+01  1.00000000e-10\n",
      "  9.00000000e+01  4.00000000e-01 -1.69631718e-02  1.02427443e+00]\n",
      "[0.00000000e+00 6.87603342e-19 2.59660979e-18 0.00000000e+00\n",
      " 2.79447173e-51 1.03166499e-64 6.59165389e-03 9.71310276e-03]\n",
      "Covariance matrix: \n",
      "[[ 0.00000000e+000  0.00000000e+000  0.00000000e+000  0.00000000e+000\n",
      "   0.00000000e+000  0.00000000e+000  0.00000000e+000  0.00000000e+000]\n",
      " [ 0.00000000e+000  4.72798355e-037  1.68559560e-036  0.00000000e+000\n",
      "  -6.33547209e-070  6.57678101e-083  4.05161209e-021 -6.42378902e-021]\n",
      " [ 0.00000000e+000  1.68559560e-036  6.74238239e-036  0.00000000e+000\n",
      "   0.00000000e+000  2.67572864e-082  1.69741964e-020 -2.51775560e-020]\n",
      " [ 0.00000000e+000  0.00000000e+000  0.00000000e+000  0.00000000e+000\n",
      "   0.00000000e+000  0.00000000e+000  0.00000000e+000  0.00000000e+000]\n",
      " [ 0.00000000e+000 -6.33547209e-070  0.00000000e+000  0.00000000e+000\n",
      "   7.80907226e-102  1.38716989e-116  2.36580624e-054  1.59497847e-054]\n",
      " [ 0.00000000e+000  6.57678101e-083  2.67572864e-082  0.00000000e+000\n",
      "   1.38716989e-116  1.06433265e-128  6.77827071e-067 -9.96343356e-067]\n",
      " [ 0.00000000e+000  4.05161209e-021  1.69741964e-020  0.00000000e+000\n",
      "   2.36580624e-054  6.77827071e-067  4.34499010e-005 -6.29022174e-005]\n",
      " [ 0.00000000e+000 -6.42378902e-021 -2.51775560e-020  0.00000000e+000\n",
      "   1.59497847e-054 -9.96343356e-067 -6.29022174e-005  9.43443652e-005]]\n",
      "\n",
      "Final batman TransitParams:\n",
      "{'a': 16.301326571397812,\n",
      " 'ecc': 1e-10,\n",
      " 'fp': None,\n",
      " 'inc': 89.999999991,\n",
      " 'limb_dark': 'linear',\n",
      " 'per': 4.617208,\n",
      " 'rp': 0.09902148034556439,\n",
      " 't0': 2459267.47212277,\n",
      " 't_secondary': None,\n",
      " 'u': [0.4],\n",
      " 'w': 90.0}\n",
      "\n",
      "0.0008792602200011222\n",
      "NOT Dropping column 5\n",
      "Initial batman TransitParams:\n",
      "{'a': 16.301326571397812,\n",
      " 'ecc': 1e-10,\n",
      " 'fp': None,\n",
      " 'inc': 89.999999991,\n",
      " 'limb_dark': 'linear',\n",
      " 'per': 4.617208,\n",
      " 'rp': 0.09902148034556439,\n",
      " 't0': 2459267.47212277,\n",
      " 't_secondary': None,\n",
      " 'u': [0.4],\n",
      " 'w': 90.0}\n",
      "\n",
      "Starting fit with airmass detrending...\n",
      "   Iteration     Total nfev        Cost      Cost reduction    Step norm     Optimality   \n",
      "       0              1         1.4498e+02                                    4.09e+02    \n",
      "       1              2         2.5528e+00      1.42e+02       5.73e-01       4.67e+00    \n",
      "       2              3         1.6133e-01      2.39e+00       8.43e-01       6.87e+00    \n",
      "       3              4         1.2118e-01      4.02e-02       9.62e-03       7.84e-02    \n",
      "`xtol` termination condition is satisfied.\n",
      "Function evaluations 4, initial cost 1.4498e+02, final cost 1.2118e-01, first-order optimality 7.84e-02.\n",
      "\n",
      "Fitted parameters and errors: [a, t0, inc, ecc, w, linear_limb_darkening_coeff, m_airmass, b_airmass]: \n",
      "[ 1.63013266e+01  2.45926747e+06  9.00000000e+01  1.00000000e-10\n",
      "  9.00000000e+01  4.00000000e-01 -1.69567753e-02  1.02426417e+00]\n",
      "[0.00000000e+00 6.58514750e-19 0.00000000e+00 0.00000000e+00\n",
      " 6.40275391e-50 2.84136493e-65 6.58704465e-03 9.70631084e-03]\n",
      "Covariance matrix: \n",
      "[[ 0.00000000e+000  0.00000000e+000  0.00000000e+000  0.00000000e+000\n",
      "   0.00000000e+000  0.00000000e+000  0.00000000e+000  0.00000000e+000]\n",
      " [ 0.00000000e+000  4.33641676e-037  0.00000000e+000  0.00000000e+000\n",
      "  -4.11787169e-068 -1.84977425e-083  4.14178220e-021 -6.35019889e-021]\n",
      " [ 0.00000000e+000  0.00000000e+000  0.00000000e+000  0.00000000e+000\n",
      "   0.00000000e+000  0.00000000e+000  0.00000000e+000  0.00000000e+000]\n",
      " [ 0.00000000e+000  0.00000000e+000  0.00000000e+000  0.00000000e+000\n",
      "   0.00000000e+000  0.00000000e+000  0.00000000e+000  0.00000000e+000]\n",
      " [ 0.00000000e+000 -4.11787169e-068  0.00000000e+000  0.00000000e+000\n",
      "   4.09952576e-099  1.81536054e-114 -4.20223751e-052  6.18214213e-052]\n",
      " [ 0.00000000e+000 -1.84977425e-083  0.00000000e+000  0.00000000e+000\n",
      "   1.81536054e-114  8.07335465e-130 -1.85043093e-067  2.75603245e-067]\n",
      " [ 0.00000000e+000  4.14178220e-021  0.00000000e+000  0.00000000e+000\n",
      "  -4.20223751e-052 -1.85043093e-067  4.33891573e-005 -6.28142791e-005]\n",
      " [ 0.00000000e+000 -6.35019889e-021  0.00000000e+000  0.00000000e+000\n",
      "   6.18214213e-052  2.75603245e-067 -6.28142791e-005  9.42124702e-005]]\n",
      "\n",
      "Final batman TransitParams:\n",
      "{'a': 16.301326571397812,\n",
      " 'ecc': 1e-10,\n",
      " 'fp': None,\n",
      " 'inc': 89.999999991,\n",
      " 'limb_dark': 'linear',\n",
      " 'per': 4.617208,\n",
      " 'rp': 0.09902148034556439,\n",
      " 't0': 2459267.47212277,\n",
      " 't_secondary': None,\n",
      " 'u': [0.4],\n",
      " 'w': 90.0}\n",
      "\n",
      "0.000878030319662524\n",
      "NOT Dropping column 6\n"
     ]
    },
    {
     "name": "stdout",
     "output_type": "stream",
     "text": [
      "Initial batman TransitParams:\n",
      "{'a': 16.301326571397812,\n",
      " 'ecc': 1e-10,\n",
      " 'fp': None,\n",
      " 'inc': 89.999999991,\n",
      " 'limb_dark': 'linear',\n",
      " 'per': 4.617208,\n",
      " 'rp': 0.09902148034556439,\n",
      " 't0': 2459267.47212277,\n",
      " 't_secondary': None,\n",
      " 'u': [0.4],\n",
      " 'w': 90.0}\n",
      "\n",
      "Starting fit with airmass detrending...\n",
      "   Iteration     Total nfev        Cost      Cost reduction    Step norm     Optimality   \n",
      "       0              1         1.4498e+02                                    4.09e+02    \n",
      "       1              2         2.5553e+00      1.42e+02       5.73e-01       4.67e+00    \n",
      "       2              3         1.6109e-01      2.39e+00       8.43e-01       6.88e+00    \n",
      "       3              4         1.2084e-01      4.02e-02       9.63e-03       7.85e-02    \n",
      "`xtol` termination condition is satisfied.\n",
      "Function evaluations 4, initial cost 1.4498e+02, final cost 1.2084e-01, first-order optimality 7.85e-02.\n",
      "\n",
      "Fitted parameters and errors: [a, t0, inc, ecc, w, linear_limb_darkening_coeff, m_airmass, b_airmass]: \n",
      "[ 1.63013266e+01  2.45926747e+06  9.00000000e+01  1.00000000e-10\n",
      "  9.00000000e+01  4.00000000e-01 -1.72247664e-02  1.02465164e+00]\n",
      "[0.00000000e+00 1.30052556e-18 0.00000000e+00 0.00000000e+00\n",
      " 0.00000000e+00 0.00000000e+00 6.57790330e-03 9.69284063e-03]\n",
      "Covariance matrix: \n",
      "[[ 0.00000000e+00  0.00000000e+00  0.00000000e+00  0.00000000e+00\n",
      "   0.00000000e+00  0.00000000e+00  0.00000000e+00  0.00000000e+00]\n",
      " [ 0.00000000e+00  1.69136673e-36  0.00000000e+00  0.00000000e+00\n",
      "   0.00000000e+00  0.00000000e+00 -8.54729444e-21  1.24718805e-20]\n",
      " [ 0.00000000e+00  0.00000000e+00  0.00000000e+00  0.00000000e+00\n",
      "   0.00000000e+00  0.00000000e+00  0.00000000e+00  0.00000000e+00]\n",
      " [ 0.00000000e+00  0.00000000e+00  0.00000000e+00  0.00000000e+00\n",
      "   0.00000000e+00  0.00000000e+00  0.00000000e+00  0.00000000e+00]\n",
      " [ 0.00000000e+00  0.00000000e+00  0.00000000e+00  0.00000000e+00\n",
      "   0.00000000e+00  0.00000000e+00  0.00000000e+00  0.00000000e+00]\n",
      " [ 0.00000000e+00  0.00000000e+00  0.00000000e+00  0.00000000e+00\n",
      "   0.00000000e+00  0.00000000e+00  0.00000000e+00  0.00000000e+00]\n",
      " [ 0.00000000e+00 -8.54729444e-21  0.00000000e+00  0.00000000e+00\n",
      "   0.00000000e+00  0.00000000e+00  4.32688118e-05 -6.26400554e-05]\n",
      " [ 0.00000000e+00  1.24718805e-20  0.00000000e+00  0.00000000e+00\n",
      "   0.00000000e+00  0.00000000e+00 -6.26400554e-05  9.39511595e-05]]\n",
      "\n",
      "Final batman TransitParams:\n",
      "{'a': 16.301326571397812,\n",
      " 'ecc': 1e-10,\n",
      " 'fp': None,\n",
      " 'inc': 89.999999991,\n",
      " 'limb_dark': 'linear',\n",
      " 'per': 4.617208,\n",
      " 'rp': 0.09902148034556439,\n",
      " 't0': 2459267.47212277,\n",
      " 't_secondary': None,\n",
      " 'u': [0.4],\n",
      " 'w': 90.0}\n",
      "\n",
      "0.0008755944803059356\n",
      "NOT Dropping column 7\n",
      "Initial batman TransitParams:\n",
      "{'a': 16.301326571397812,\n",
      " 'ecc': 1e-10,\n",
      " 'fp': None,\n",
      " 'inc': 89.999999991,\n",
      " 'limb_dark': 'linear',\n",
      " 'per': 4.617208,\n",
      " 'rp': 0.09902148034556439,\n",
      " 't0': 2459267.47212277,\n",
      " 't_secondary': None,\n",
      " 'u': [0.4],\n",
      " 'w': 90.0}\n",
      "\n",
      "Starting fit with airmass detrending...\n",
      "   Iteration     Total nfev        Cost      Cost reduction    Step norm     Optimality   \n",
      "       0              1         1.4509e+02                                    4.09e+02    \n",
      "       1              2         2.5500e+00      1.43e+02       5.73e-01       4.67e+00    \n",
      "       2              3         1.5994e-01      2.39e+00       8.42e-01       6.86e+00    \n",
      "       3              4         1.1986e-01      4.01e-02       9.61e-03       7.83e-02    \n",
      "`xtol` termination condition is satisfied.\n",
      "Function evaluations 4, initial cost 1.4509e+02, final cost 1.1986e-01, first-order optimality 7.83e-02.\n",
      "\n",
      "Fitted parameters and errors: [a, t0, inc, ecc, w, linear_limb_darkening_coeff, m_airmass, b_airmass]: \n",
      "[ 1.63013266e+01  2.45926747e+06  9.00000000e+01  1.00000000e-10\n",
      "  9.00000000e+01  4.00000000e-01 -1.69037421e-02  1.02418786e+00]\n",
      "[0.00000000e+00 1.29031328e-18 2.58062656e-18 0.00000000e+00\n",
      " 1.11090823e-50 5.65035631e-65 6.55107948e-03 9.65331452e-03]\n",
      "Covariance matrix: \n",
      "[[ 0.00000000e+000  0.00000000e+000  0.00000000e+000  0.00000000e+000\n",
      "   0.00000000e+000  0.00000000e+000  0.00000000e+000  0.00000000e+000]\n",
      " [ 0.00000000e+000  1.66490836e-036 -3.32981673e-036  0.00000000e+000\n",
      "   0.00000000e+000 -7.29072979e-083 -8.38293644e-021  1.24342765e-020]\n",
      " [ 0.00000000e+000 -3.32981673e-036  6.65963345e-036  0.00000000e+000\n",
      "   0.00000000e+000  1.45814596e-082  1.67658729e-020 -2.48685530e-020]\n",
      " [ 0.00000000e+000  0.00000000e+000  0.00000000e+000  0.00000000e+000\n",
      "   0.00000000e+000  0.00000000e+000  0.00000000e+000  0.00000000e+000]\n",
      " [ 0.00000000e+000  0.00000000e+000  0.00000000e+000  0.00000000e+000\n",
      "   1.23411710e-100  0.00000000e+000 -9.34708326e-054 -6.30161350e-054]\n",
      " [ 0.00000000e+000 -7.29072979e-083  1.45814596e-082  0.00000000e+000\n",
      "   0.00000000e+000  3.19265264e-129  3.67093624e-067 -5.44504143e-067]\n",
      " [ 0.00000000e+000 -8.38293644e-021  1.67658729e-020  0.00000000e+000\n",
      "  -9.34708326e-054  3.67093624e-067  4.29166424e-005 -6.21302215e-005]\n",
      " [ 0.00000000e+000  1.24342765e-020 -2.48685530e-020  0.00000000e+000\n",
      "  -6.30161350e-054 -5.44504143e-067 -6.21302215e-005  9.31864813e-005]]\n",
      "\n",
      "Final batman TransitParams:\n",
      "{'a': 16.301326571397812,\n",
      " 'ecc': 1e-10,\n",
      " 'fp': None,\n",
      " 'inc': 89.999999991,\n",
      " 'limb_dark': 'linear',\n",
      " 'per': 4.617208,\n",
      " 'rp': 0.09902148034556439,\n",
      " 't0': 2459267.47212277,\n",
      " 't_secondary': None,\n",
      " 'u': [0.4],\n",
      " 'w': 90.0}\n",
      "\n",
      "0.0008684678171907738\n",
      "NOT Dropping column 9\n",
      "Initial batman TransitParams:\n",
      "{'a': 16.301326571397812,\n",
      " 'ecc': 1e-10,\n",
      " 'fp': None,\n",
      " 'inc': 89.999999991,\n",
      " 'limb_dark': 'linear',\n",
      " 'per': 4.617208,\n",
      " 'rp': 0.09902148034556439,\n",
      " 't0': 2459267.47212277,\n",
      " 't_secondary': None,\n",
      " 'u': [0.4],\n",
      " 'w': 90.0}\n",
      "\n",
      "Starting fit with airmass detrending...\n",
      "   Iteration     Total nfev        Cost      Cost reduction    Step norm     Optimality   \n",
      "       0              1         1.4496e+02                                    4.09e+02    \n",
      "       1              2         2.5459e+00      1.42e+02       5.73e-01       4.67e+00    \n",
      "       2              3         1.5847e-01      2.39e+00       8.42e-01       6.86e+00    \n",
      "       3              4         1.1845e-01      4.00e-02       9.60e-03       7.82e-02    \n",
      "`xtol` termination condition is satisfied.\n",
      "Function evaluations 4, initial cost 1.4496e+02, final cost 1.1845e-01, first-order optimality 7.82e-02.\n",
      "\n",
      "Fitted parameters and errors: [a, t0, inc, ecc, w, linear_limb_darkening_coeff, m_airmass, b_airmass]: \n",
      "[ 1.63013266e+01  2.45926747e+06  9.00000000e+01  1.00000000e-10\n",
      "  9.00000000e+01  4.00000000e-01 -1.65333496e-02  1.02365186e+00]\n",
      "[0.00000000e+00 6.41350264e-19 1.28270053e-18 0.00000000e+00\n",
      " 2.69997238e-50 1.12447393e-64 6.51242860e-03 9.59636069e-03]\n",
      "Covariance matrix: \n",
      "[[ 0.00000000e+000  0.00000000e+000  0.00000000e+000  0.00000000e+000\n",
      "   0.00000000e+000  0.00000000e+000  0.00000000e+000  0.00000000e+000]\n",
      " [ 0.00000000e+000  4.11330162e-037 -8.22660323e-037  0.00000000e+000\n",
      "   1.71113704e-068  7.20495405e-083 -4.14215542e-021  6.14399336e-021]\n",
      " [ 0.00000000e+000 -8.22660323e-037  1.64532065e-036  0.00000000e+000\n",
      "  -3.42227408e-068 -1.44099081e-082  8.28431083e-021 -1.22879867e-020]\n",
      " [ 0.00000000e+000  0.00000000e+000  0.00000000e+000  0.00000000e+000\n",
      "   0.00000000e+000  0.00000000e+000  0.00000000e+000  0.00000000e+000]\n",
      " [ 0.00000000e+000  1.71113704e-068 -3.42227408e-068  0.00000000e+000\n",
      "   7.28985087e-100  2.97695676e-114 -1.75777943e-052  2.53255354e-052]\n",
      " [ 0.00000000e+000  7.20495405e-083 -1.44099081e-082  0.00000000e+000\n",
      "   2.97695676e-114  1.26444161e-128 -7.21447400e-067  1.07896161e-066]\n",
      " [ 0.00000000e+000 -4.14215542e-021  8.28431083e-021  0.00000000e+000\n",
      "  -1.75777943e-052 -7.21447400e-067  4.24117263e-005 -6.13992568e-005]\n",
      " [ 0.00000000e+000  6.14399336e-021 -1.22879867e-020  0.00000000e+000\n",
      "   2.53255354e-052  1.07896161e-066 -6.13992568e-005  9.20901384e-005]]\n",
      "\n",
      "Final batman TransitParams:\n",
      "{'a': 16.301326571397812,\n",
      " 'ecc': 1e-10,\n",
      " 'fp': None,\n",
      " 'inc': 89.999999991,\n",
      " 'limb_dark': 'linear',\n",
      " 'per': 4.617208,\n",
      " 'rp': 0.09902148034556439,\n",
      " 't0': 2459267.47212277,\n",
      " 't_secondary': None,\n",
      " 'u': [0.4],\n",
      " 'w': 90.0}\n",
      "\n",
      "0.0008582494328994196\n",
      "NOT Dropping column 10\n",
      "Initial batman TransitParams:\n",
      "{'a': 16.301326571397812,\n",
      " 'ecc': 1e-10,\n",
      " 'fp': None,\n",
      " 'inc': 89.999999991,\n",
      " 'limb_dark': 'linear',\n",
      " 'per': 4.617208,\n",
      " 'rp': 0.09902148034556439,\n",
      " 't0': 2459267.47212277,\n",
      " 't_secondary': None,\n",
      " 'u': [0.4],\n",
      " 'w': 90.0}\n",
      "\n",
      "Starting fit with airmass detrending...\n",
      "   Iteration     Total nfev        Cost      Cost reduction    Step norm     Optimality   \n",
      "       0              1         1.4480e+02                                    4.09e+02    \n",
