Contributed talks;;;; 
P. R. Mickan;;;VG2.104; 
M. Klibanov;D.-L. Duong;M. Karimi;; 
Contributed talks;;;; 
R. Novikov;;;VG2.105; 
S. Zheng;J. Rönsch;V. Sivkin;; 
Contributed talks;;;; 
M. Halla;;;VG2.106; 
D. Gangadaraiah;D. McMahon;J. Nurminen;; 
Machine Learning for Inverse Problems in Medical Imaging;;;; 
C. Fiedler, J. Flemming;;;VG1.102; 
J. Flemming;C. Fiedler;P.-P. Jacobs;M. Wittig; 
Numerical meet statistical methods in inverse problems;;;; 
M. Hanke, M. Reiß, F. Werner;;;VG2.102; 
S. Pereverzyev;F. M. Frommer;B. Stankewitz;L. Hucker; 
Inverse Acoustic and Electromagnetic Scattering Theory - 30 years later;;;; 
F. Cakoni, H. Haddar;;;VG2.101; 
F. Cakoni;T. Hohage;P. Monk;R. Potthast; 
Defying the Curse of Dimensionality –  Theory and Algorithms for Large Dimensional Bayesian Inversion;;;; 
R. Flock, Y. Dong;;;VG1.108; 
J. Nitzler;J. Chung;Q. Chen;R. Flock; 
Theory and algorithms of super-resolution  in imaging and inverse problems;;;; 
H. Ammari, P. Liu;;;VG3.103; 
M. Ferreira Da Costa;X. Liu;P. Millien;D. Batenkov; 
Imaging with Non-Linear Measurements:  Tomography and Reconstruction from  Phaseless or Folded Data;;;; 
M. Beckmann, R. Beinert, M. Quellmalz;;;VG1.101; 
R. Alaifari;A. Bhandari;J. Hagemann;J. N. Ahlers; 
Recent developments in reconstruction  methods for inverse scattering and  electrical impedance tomography;;;; 
R. Griesmaier, N. Hyvönen;;;VG1.103; 
R. Griesmaier;N. Hyvönen;R. R. Maity;N. Nasr; 
Trends and open problems in cryo electron  microscopy;;;; 
C. Esteve-Yague, J. Schwab;;;VG3.102; 
V. Debarnot;W. Diepeveen;J. Kileel;; 
Inverse Problems on Graphs and Machine  Learning;;;; 
E. L. K. Blåsten, M. Lassas, J. Lu;;;VG2.103; 
H. Isozaki;L. Ylinen;J. Lu;D. Sanz-Alonso; 
Parameter identification in time dependent partial differential equations;;;; 
B. Kaltenbacher, W. Rundell;;;VG1.104; 
L. Oksanen;L. Pieronek;P. T. Huynh;T. Nguyen; 
Quantifying uncertainty for learned Bayesian models;;;; 
M. M. Betcke, M. Holler;;;VG1.105; 
N. Heilenkötter;G. Luo;T. Sahlström;T. I. Liaudat; 
Optimal Transport meets Inverse Problems;;;; 
M. Carioni, J.-F. Pietschmann, M. Schlottbom;;;VG0.111; 
J. Karlsson;D. Bon;R. Assereto;M. Bonafini; 
Scattering and spectral imaging: inverse  problems and algorithms;;;; 
E. T. Quinto, G. Rigaud;;;VG3.101; 
M. K. Nguyen;J. Webber;;; 
Uniqueness and stability in inverse problems for partial differential equations;;;; 
S. Foschiatti, E. Francini, E. Sincich;;;VG3.104; 
S. Foschiatti;J.-N. Wang;J. Railo;R. Gaburro; 
