Compressed Sensing meets Statistical Inverse Learning;;;; 
T. A. Bubba, L. Ratti, M. Santacesaria;;;VG2.103; 
A. Felisi;W. Zellinger;H. Kekkonen;; 
Fast optimization-based methods for inverse problems;;;; 
T. Valkonen;;;VG2.102; 
S. Leveque;J. M. Everink;X. Liu;B. Christian Skov Jensen; 
Inverse Modelling with Applications;;;; 
D. Lesnic, K. Van Bockstal;;;VG1.104; 
D. Lesnic;K. Van Bockstal;F. Maes;; 
Experimental and Algorithmic Progress in  Photoemission Orbital Imaging;;;; 
R. Luke, S. Mathias;;;VG1.102; 
B. Stadtmüller;F. S. Tautz;U. Höfer;G. S. M. Jansen; 
Inverse problems for fractional and nonlocal equations;;;; 
Y.-H. Lin, J. Railo, M. Salo;;;VG1.103; 
B. Kaltenbacher;G. Uhlmann;P. Zimmermann;G. Covi; 
Hyperparameter estimation in imaging  inverse problems: recent advances on optimisation-based, learning and statistical approaches;;;; 
L. Calatroni, M. Pragliola;;;VG0.111; 
P. Ochs;K. Papafitsoros;A. Sebastiani;F. Bevilacqua; 
Eigenvalues in inverse scattering;;;; 
M. Halla, P. Monk;;;VG3.104; 
A. Kleefeld;V. Selgas;F. Monteghetti;J. Sun; 
Learned reconstructions for nonlinear  inverse problems;;;; 
S. R. Arridge, A. S. Hauptmann;;;VG3.103; 
M. Santacesaria;J. Grohl;M. Lassas;J. Nickel; 
Statistical inverse problems: regularization, learning and guarantees;;;; 
K. Knudsen;;;VG2.105; 
S. Pereverzyev;A. Abhishake;Y. Ying;K. Mosegaard; 
Inverse Problems in radiation protection  and nuclear safety;;;; 
L. Kuger, S. Siltanen;;;VG1.108; 
R. Virta;C. Tarpau;P. Dendooven;F. Terzioglu; 
Modelling in Earth and planetary sciences  by data inversion at various scales;;;; 
C. Gerhards, V. Michel, F. J. Simons;;;VG2.104; 
C. Gerhards;X. Huang;N. Schneider;V. Michel; 
Integral geometry, rigidity and geometric  inverse problems;;;; 
F. S. Monard, P. Stefanov;;;VG1.105; 
L. Oksanen;P. Stefanov;Y. Wang;S. P. Flynn; 
The x-ray transform and its generalizations: Theory, methods, and applications;;;; 
S. K. Sahoo;;;VG1.101; 
P.-Z. Kow;S. K. Sahoo;G. Ambartsoumian;D. Agrawal; 
Nonlinear Inverse Scattering and Related  Topics;;;; 
Y. Yang;;;VG3.101; 
T. Zhou;Y. Heng;F. Dou;X. Liu; 
Inverse Problems of Transport Equations  and Related Topics;;;; 
R.-Y. Lai, H. Zhou;;;VG2.106; 
K. Hellmuth;B. Palacios;;; 
Inverse Problems in Time-Domain Imaging  at the Small Scales;;;; 
E. Bonnetier, X. Cao, M. Sini;;;VG3.102; 
A. Posilicano;H. Wang;A. Ghandriche;A. Mantile; 
