Contributed talks;;;; 
M. Halla;;;VG2.105; 
T. van Leeuwen;M. A. Boukraa;L. Buchele;J. A. Ramoz León; 
Contributed talks;;;; 
H. Li;;;VG2.106; 
N. M. Gottschling;O. Krivorotko;;; 
Regularization for Learning from Limited Data: From Theory to Medical Applications;;;; 
M. Holzleitner, S. Pereverzyev, W. Zellinger;;;VG1.101; 
S. Pereverzyev Jr.;P. Roy;L. Frischauf;W. Zellinger; 
Integral Operators in Potential Theory and Applications;;;; 
D. Choi, M. Lim, S. Shipman;;;VG2.102; 
D. Cho;S. Shipman;K. Ando;H. Liu; 
Optimization in Inverse Scattering: from Acoustics to X-rays;;;; 
R. I. Bot, R. Luke;;;VG1.103; 
O. A. Soloviev;K. Bredies;C. Molinari;; 
Stochastic iterative methods for inverse  problems;;;; 
L. Bungert, T. Jahn;;;VG0.111; 
B. Stankewitz;M. Wahl;N. Mücke;Z. Kereta; 
Inverse Problems in Elastic Media;;;; 
A. Aspri, E. Sherina;;;VG3.104; 
C. I. Carstea;A. Niclas;P. E. Barbone;L. Seppecher; 
Geomathematics;;;; 
J. Ilmavirta;;;VG3.101; 
E. Cherkaev;Y. Zou;E. Francini;; 
Inverse problems for nonlinear equations;;;; 
L. Oksanen, T. K. Tyni;;;VG1.104; 
T. Liimatainen;K. Krupchyk;;; 
Mathematics and Magnetic Resonance  Imaging;;;; 
K. Bredies, C. Clason, M. Uecker;;;VG1.105; 
C. Clason;M. Haltmeier;M. Blumenthal;B. Kocurov; 
Advanced Reconstruction and Phase  Retrieval in Nano X-ray Tomography;;;; 
T. Salditt, A. Wald;;;VG2.103; 
J. Shi;M. Langer;R. Mokso;T. Salditt; 
