# tags:
# type3, not monotone, right linear, regular
<SIGN> ::= '+' <AT LEAST ONE DIGIT PRE POINT> | '-' <AT LEAST ONE DIGIT PRE POINT> | '0' <PRE POINT> | '1' <PRE POINT> | '2' <PRE POINT> | '3' <PRE POINT> | '4' <PRE POINT> | '5' <PRE POINT> | '6' <PRE POINT> | '7' <PRE POINT> | '8' <PRE POINT> | '9' <PRE POINT>
<AT LEAST DIGIT ONE PRE POINT> ::= '0' <PRE POINT> | '1' <PRE POINT> | '2' <PRE POINT> | '3' <PRE POINT> | '4' <PRE POINT> | '5' <PRE POINT> | '6' <PRE POINT> | '7' <PRE POINT> | '8' <PRE POINT> | '9' <PRE POINT>
<PRE POINT> ::= '0' <PRE POINT> | '1' <PRE POINT> | '2' <PRE POINT> | '3' <PRE POINT> | '4' <PRE POINT> | '5' <PRE POINT> | '6' <PRE POINT> | '7' <PRE POINT> | '8' <PRE POINT> | '9' <PRE POINT>
<PRE POINT> ::= '.' <AT LEAST ONE NUMBER> | 'e' <EXPONENT SIGN> | 'e' <EXPONENT AT LEAST ONE NUMBER>
<PRE POINT> ::=
<AT LEAST ONE NUMBER> ::= '0' <PRE EXPONENT> | '1' <PRE EXPONENT> | '2' <PRE EXPONENT> | '3' <PRE EXPONENT> | '4' <PRE EXPONENT> | '5' <PRE EXPONENT> | '6' <PRE EXPONENT> | '7' <PRE EXPONENT> | '8' <PRE EXPONENT> | '9' <PRE EXPONENT>
<PRE EXPONENT> ::= '0' <PRE EXPONENT> | '1' <PRE EXPONENT> | '2' <PRE EXPONENT> | '3' <PRE EXPONENT> | '4' <PRE EXPONENT> | '5' <PRE EXPONENT> | '6' <PRE EXPONENT> | '7' <PRE EXPONENT> | '8' <PRE EXPONENT> | '9' <PRE EXPONENT>
<PRE EXPONENT> ::= 'e' <EXPONENT SIGN> | 'e' <EXPONENT AT LEAST ONE NUMBER>
<PRE EXPONENT> ::=
<EXPONENT SIGN> ::= '+' <EXPONENT AT LEAST ONE NUMBER> | '-' <EXPONENT AT LEAST ONE NUMBER>
<EXPONENT AT LEAST ONE NUMBER> ::= '0' <EXPONENT REST> | '1' <EXPONENT REST> | '2' <EXPONENT REST> | '3' <EXPONENT REST> | '4' <EXPONENT REST> | '5' <EXPONENT REST> | '6' <EXPONENT REST> | '7' <EXPONENT REST> | '8' <EXPONENT REST> | '9' <EXPONENT REST>
<EXPONENT REST> ::= '0' <EXPONENT REST> | '1' <EXPONENT REST> | '2' <EXPONENT REST> | '3' <EXPONENT REST> | '4' <EXPONENT REST> | '5' <EXPONENT REST> | '6' <EXPONENT REST> | '7' <EXPONENT REST> | '8' <EXPONENT REST> | '9' <EXPONENT REST>
<EXPONENT REST> ::=