,tcor non-bin graph_dist,mtcor non-bin graph_dist,dcor non-bin graph_dist,tcor non-bin corr_dist,mtcor non-bin corr_dist,dcor non-bin corr_dist,tcor bin graph_dist,mtcor bin graph_dist,dcor bin graph_dist,tcor bin corr_dist,mtcor bin corr_dist,dcor bin corr_dist
0,0.1657516849824633,0.16624454605224753,0.19184958614625316,0.22742359840969883,0.22763144708184102,0.21190823991759639,0.1658756322217952,0.16643489239644008,0.18796856634428602,0.228143458049206,0.22732862638960108,0.21053028341357763
1,0.3713671750513369,0.48924290751216537,0.21668106997347994,0.5071855934765037,0.6075441095252219,0.24441673451372814,0.20150761977686182,0.20001443078367262,0.18921059250763536,0.30343372132017266,0.30384165266585134,0.2127759174517545
2,0.23613363788817915,0.23679391467854313,0.2086691339413637,0.3255117401048236,0.32498803967212037,0.23510446425223244,0.19694755271679432,0.1947910794064748,0.1874367681804722,0.2900554577070666,0.2902194162951251,0.2129327483253311
3,0.17728591286284573,0.17752303809997097,0.18967424685342685,0.2491594960003174,0.24950800611981278,0.2127551454548676,0.17821351475198619,0.177301090762639,0.18882582104333628,0.24952950348819586,0.249634572155728,0.2111290373634095
4,0.19169384554000998,0.19228749997981828,0.19062484601354276,0.2798482991173352,0.2802077813090423,0.21441660391499856,0.19267431767432833,0.19225169225170285,0.18892163729232483,0.2800215646375781,0.28024363664568835,0.21257837301365817
5,0.23602147010504806,0.23593736164329826,0.22064163464074468,0.35484103836737657,0.35497413084493945,0.2545534232448118,0.23387844165275495,0.23710318765278385,0.2194451276065332,0.3545302224653416,0.3545740684307555,0.25400121712116813
