Gruppe;Treatment;DickeP;DickeA;
B1;Control;24%;1.295;3.5
B1;Control;53%;3.245;12.6
B1;Control;48%;2.695;7.5
B1;Control;54%;2.99;13.7
B1;Control;60%;2.435;32
B1;Control;61%;3.135;15.2
B1;Control;51%;2.47;40
B1;Control;55%;2.725;24.1
B2;Control;27%;1.465;4.9
B2;Control;27%;1.145;0.1
B2;Control;16%;0.53;1.5
B2;Control;61%;3.115;18.8
B2;Control;41%;1.675;6.1
B2;Control;12%;0.465;2.3
B2;Control;15%;0.565;0.5
B2;Control;56%;2.44;20.9
B3;Control;35%;1.52;3.6
B3;Control;38%;2.08;17.2
B3;Control;32%;1.42;8.2
B3;Control;32%;1.21;0.3
B3;Control;69%;2.815;7.3
B3;Control;32%;1.765;6.9
B3;Control;18%;1.075;42.8
B3;Control;30%;1.03;1.6
B4;Control;62%;2.33;14.9
B4;Control;33%;1.83;8.9
B4;Control;28%;1.42;8.6
B4;Control;37%;1.985;15.7
B4;Control;16%;0.84;4.6
B4;Control;27%;1.37;9.4
B4;Control;38%;1.825;11
B4;Control;30%;1.46;1
B5;Control;19%;0.95;0.3
B5;Control;53%;1.855;0.1
B5;Control;47%;2.295;13.5
B5;Control;54%;2.655;31.2
B5;Control;63%;2.19;16
B5;Control;39%;1.77;4.5
B5;Control;23%;1.34;7.1
B5;Control;51%;2.55;13.6
D2;Control;35%;2.1;8.2
D2;Control;33%;1.885;9.2
D2;Control;20%;2.065;3.1
D2;Control;33%;2.105;9.7
D2;Control;39%;2.47;28.8
D2;Control;30%;1.97;4.5
D2;Control;4%;0.15;3
D2;Control;49%;2.315;4.9
D4;Control;27%;1.93;8.2
D4;Control;30%;1.5;9.8
D4;Control;50%;2.865;18.1
D4;Control;29%;1.075;1.5
D4;Control;32%;2.14;8.4
D4;Control;21%;1.235;0.8
D4;Control;15%;1.3;9
D4;Control;25%;1.73;17.7
B1;Intermediate;44%;2.315;14.4
B1;Intermediate;38%;2.15;18.8
B1;Intermediate;51%;2.325;34.3
B1;Intermediate;38%;1.91;1.6
B1;Intermediate;41%;2.21;17.8
B1;Intermediate;44%;2.48;26.3
B1;Intermediate;24%;1.405;22.5
B1;Intermediate;39%;1.74;0.2
B2;Intermediate;29%;1.615;14.9
B2;Intermediate;41%;1.97;20.2
B2;Intermediate;45%;2.035;21.2
B2;Intermediate;52%;2.025;18.6
B2;Intermediate;44%;2.255;8.8
B2;Intermediate;26%;0.94;2.4
B2;Intermediate;30%;1.42;18.9
B2;Intermediate;32%;1.445;16.5
B3;Intermediate;11%;0.535;5.5
B3;Intermediate;23%;1.615;24.4
B3;Intermediate;31%;1.755;15.6
B3;Intermediate;44%;2.35;11.3
B3;Intermediate;33%;1.635;11.6
B3;Intermediate;62%;2.625;0.8
B3;Intermediate;95%;2.935;3
B3;Intermediate;38%;1.98;10.9
B4;Intermediate;10%;0.615;14.5
B4;Intermediate;52%;1.92;10.6
B4;Intermediate;18%;0.98;0.7
B4;Intermediate;31%;1.835;15.5
B4;Intermediate;28%;0.97;0.9
B4;Intermediate;24%;1.125;19.5
B4;Intermediate;7%;0.34;1
B4;Intermediate;;;
B5;Intermediate;42%;2.14;2.8
B5;Intermediate;48%;2.045;8.5
B5;Intermediate;33%;2;2.4
B5;Intermediate;35%;1.805;-0.7
B5;Intermediate;45%;2.305;14.5
B5;Intermediate;42%;2.005;6.9
B5;Intermediate;43%;1.975;0.9
B5;Intermediate;31%;0.84;1.5
D2;Intermediate;29%;1.52;18.9
D2;Intermediate;31%;2.005;3.9
D2;Intermediate;35%;1.8;2.5
D2;Intermediate;18%;0.93;13.7
D2;Intermediate;18%;1.54;4.5
D2;Intermediate;19%;1.395;2.5
D2;Intermediate;36%;0.205;3.5
D2;Intermediate;28%;1.92;18.5
D4;Intermediate;12%;0.96;1.7
D4;Intermediate;;;
D4;Intermediate;47%;2.355;22
D4;Intermediate;39%;1.75;2
D4;Intermediate;76%;3.04;8.4
D4;Intermediate;40%;2.175;19.6
D4;Intermediate;59%;2.545;8.2
D4;Intermediate;52%;3.32;2.6
B1;Severe;21%;1.095;24.3
B1;Severe;18%;0.685;1.2
B1;Severe;23%;1.135;1.7
B1;Severe;16%;0.93;4.6
B1;Severe;29%;1.45;0.1
B1;Severe;34%;1.645;12.6
B1;Severe;22%;1.115;6.9
B1;Severe;40%;1.625;11.1
B2;Severe;6%;0.255;3.5
B2;Severe;28%;1.43;15.3
B2;Severe;12%;0.575;0.6
B2;Severe;18%;1.02;0.8
B2;Severe;27%;1.05;7.5
B2;Severe;46%;2.055;5.4
B2;Severe;18%;1.145;10.6
B2;Severe;32%;1.535;4.1
B3;Severe;9%;0.335;1.2
B3;Severe;22%;1.145;11.7
B3;Severe;12%;0.71;15.1
B3;Severe;6%;0.33;12.5
B3;Severe;22%;1.135;12.4
B3;Severe;23%;1.225;13.4
B3;Severe;20%;0.92;15.4
B3;Severe;19%;0.895;1.5
B4;Severe;21%;1.2;9.6
B4;Severe;33%;1.44;0.4
B4;Severe;23%;1.025;3.6
B4;Severe;7%;0.42;9.9
B4;Severe;13%;0.715;12.6
B4;Severe;23%;1.06;3.5
B4;Severe;14%;0.66;1.6
B4;Severe;30%;1.405;16.4
B5;Severe;53%;2.225;9.5
B5;Severe;24%;1.1;5.9
B5;Severe;17%;0.985;15.3
B5;Severe;20%;1.065;19
B5;Severe;34%;1.525;18.7
B5;Severe;25%;1.085;2.3
B5;Severe;40%;1.705;14
B5;Severe;15%;0.815;16
D2;Severe;22%;1.34;10.5
D2;Severe;29%;1.515;7.1
D2;Severe;17%;1.06;2.9
D2;Severe;3%;0.195;5.4
D2;Severe;16%;1.195;2
D2;Severe;7%;0.525;3.2
D2;Severe;11%;0.725;10.5
D2;Severe;21%;1.225;6.5
D4;Severe;24%;1.585;-5.1
D4;Severe;23%;1.805;7
D4;Severe;51%;2.865;1.2
D4;Severe;17%;1.23;8.1
D4;Severe;18%;1.49;1.4
D4;Severe;10%;0.42;0.9
D4;Severe;54%;1.94;2
D4;Severe;6%;0.5;11.2
