﻿9;1206;12;101;104;103;100;100;99;100;100;100;100;99;100;;;;;
;;;CL;CS;GS;UL;US;Ha_adult;GL;Sel;CaHa;KS;KL;Oe;;;;;
Number;Population;sfc0018;;sfc0161;;sfc1063;;sfc1143;;GOT066;;FIR065;;FIR004;;FS 3-04;;mfs11;
1;CL;170;176;114;124;193;197;126;126;241;241;171;177;145;150;201;201;132;134
2;CL;151;164;126;134;199;209;116;130;241;241;168;177;143;145;201;201;134;140
3;CL;151;164;106;124;197;197;122;128;241;241;168;171;145;162;195;201;132;134
4;CL;170;176;118;134;187;195;126;126;241;241;171;177;145;150;201;201;132;136
5;CL;170;174;124;124;197;209;116;126;241;241;177;180;145;150;201;201;132;134
6;CL;170;170;126;130;197;207;126;126;241;241;168;171;145;145;201;201;134;134
7;CL;151;174;132;132;197;197;116;128;241;241;168;177;150;162;195;201;134;140
8;CL;158;170;124;124;193;211;116;130;241;241;168;177;145;150;201;201;132;134
9;CL;170;170;106;106;193;209;110;126;241;241;168;171;150;150;201;201;142;142
10;CL;158;170;106;124;197;199;122;130;241;241;171;177;143;145;195;201;134;136
11;CL;170;170;126;130;193;199;126;126;241;241;177;180;150;150;201;201;134;138
12;CL;170;176;110;124;201;209;126;126;238;241;168;171;143;145;195;201;134;134
13;CL;151;170;124;124;197;199;128;128;241;241;180;180;145;150;201;201;132;142
14;CL;166;166;124;124;199;201;114;128;241;241;168;177;145;145;201;204;132;134
15;CL;170;178;124;130;193;209;128;132;241;241;168;171;145;149;201;201;134;146
16;CL;170;170;124;124;209;209;126;126;241;241;168;171;150;150;201;201;134;134
17;CL;151;172;124;126;193;197;124;126;241;241;171;171;145;164;201;204;128;134
18;CL;164;170;124;124;197;209;120;128;241;241;168;177;143;145;195;201;134;140
19;CL;170;170;124;126;187;199;124;128;241;241;168;168;145;145;201;201;132;142
20;CL;166;176;124;124;195;197;124;130;241;241;171;171;145;150;201;201;132;142
21;CL;151;166;126;126;197;199;128;128;241;241;171;171;145;150;201;201;132;140
22;CL;170;170;124;134;197;199;126;128;241;241;168;177;145;150;201;201;134;134
23;CL;166;172;126;126;197;199;116;126;241;241;168;171;145;150;201;201;134;146
24;CL;170;170;124;128;199;211;124;130;238;241;171;171;145;149;201;201;134;134
25;CL;166;166;126;126;187;207;116;126;241;241;171;171;145;145;201;201;132;134
26;CL;151;170;106;136;197;201;116;126;241;241;168;177;143;145;201;204;134;146
27;CL;170;170;124;124;197;211;126;130;241;241;168;180;145;150;201;201;134;134
28;CL;170;172;124;126;197;203;126;128;241;241;168;180;145;145;201;201;134;142
29;CL;170;170;124;124;197;199;126;128;241;241;168;177;143;145;201;201;134;134
30;CL;151;166;124;124;205;209;116;124;241;241;168;171;145;145;201;201;134;134
31;CL;158;170;106;124;197;209;122;126;241;241;168;168;143;150;201;201;134;140
32;CL;170;170;114;126;193;209;110;124;241;241;168;171;150;150;201;201;142;144
33;CL;151;164;124;134;197;197;122;128;241;241;177;177;143;150;195;201;134;140
34;CL;164;174;106;124;193;203;128;130;241;241;168;168;145;150;201;201;134;134
35;CL;158;170;106;124;195;199;122;126;241;241;168;171;143;150;195;201;140;140
36;CL;170;170;124;128;197;205;126;128;241;241;177;180;147;150;201;201;134;136
37;CL;170;178;124;124;197;199;124;126;238;241;168;171;149;149;201;201;134;146
38;CL;170;176;124;130;197;201;116;126;241;241;168;171;145;145;201;201;134;146
39;CL;170;172;118;124;197;199;116;124;241;241;168;171;145;150;201;204;128;142
40;CL;151;170;114;134;197;197;114;130;241;241;168;180;145;150;195;201;134;140
41;CL;166;178;124;126;193;197;128;130;241;241;168;168;150;162;201;204;132;134
42;CL;151;170;124;124;187;197;122;128;241;241;168;171;145;145;201;201;134;134
43;CL;151;170;124;124;197;199;116;124;241;241;168;171;145;145;201;201;132;140
44;CL;164;166;124;126;197;199;128;128;241;241;168;168;145;145;201;201;132;134
45;CL;164;170;134;142;195;197;126;128;241;241;180;180;145;150;201;201;134;140
46;CL;151;176;114;124;197;197;128;130;241;241;171;171;145;149;201;201;134;142
47;CL;170;170;124;124;193;209;126;128;241;241;168;171;150;164;201;201;134;142
48;CL;170;170;124;134;197;205;128;128;241;241;168;177;145;162;201;207;132;134
49;CL;151;170;124;134;197;199;116;128;241;241;177;180;145;162;201;201;142;142
50;CL;151;170;124;124;197;197;124;126;241;241;168;168;145;150;201;201;134;142
51;CL;166;170;124;126;195;209;114;116;241;241;168;171;145;145;201;201;132;134
52;CL;170;178;126;126;193;199;116;128;241;244;168;168;145;145;201;201;134;134
53;CL;151;170;126;138;187;201;126;128;241;241;168;168;145;150;201;201;140;140
54;CL;170;170;114;128;197;199;124;130;238;241;171;180;150;150;201;201;134;134
55;CL;170;170;124;130;197;199;126;130;241;241;171;171;145;145;201;201;132;134
56;CL;176;178;124;126;197;199;116;128;241;241;171;171;145;145;201;201;132;142
57;CL;166;170;124;124;193;199;126;130;241;241;171;180;145;150;201;201;134;146
58;CL;170;170;124;124;197;209;124;128;241;241;168;177;143;150;201;207;134;134
59;CL;170;170;114;126;193;199;120;128;241;241;168;171;143;150;201;201;132;134
60;CL;170;178;126;126;193;205;120;128;241;241;168;177;150;150;201;201;134;140
61;CL;178;178;126;130;193;205;126;128;241;241;168;177;145;145;201;201;134;146
62;CL;176;178;124;126;197;205;126;128;241;241;168;177;145;150;201;201;132;134
63;CL;151;151;124;124;197;197;128;130;241;241;171;180;145;149;201;201;134;134
64;CL;170;170;124;124;209;209;116;128;241;241;171;171;150;150;195;201;134;142
65;CL;170;170;124;124;195;197;128;130;241;241;168;171;145;145;201;204;132;142
66;CL;166;170;124;126;195;195;128;128;241;241;171;171;145;145;201;201;132;134
67;CL;170;176;126;126;197;199;128;128;241;241;171;177;145;150;201;201;132;142
68;CL;170;170;114;124;199;209;124;126;238;241;168;171;143;143;201;201;134;134
69;CL;164;170;134;134;197;197;128;128;241;241;168;180;145;150;201;207;134;134
70;CL;170;170;126;126;193;193;120;124;238;241;168;168;143;150;201;201;134;134
71;CL;164;170;126;134;197;209;128;128;238;241;171;177;143;143;201;201;134;134
72;CL;170;172;110;126;193;199;116;128;241;241;171;180;145;150;201;201;132;142
73;CL;166;170;126;126;199;205;124;128;238;241;168;171;145;145;201;201;134;134
74;CL;172;176;124;124;197;209;126;128;241;241;168;180;150;150;201;201;132;134
75;CL;170;176;124;134;193;199;116;124;241;241;171;180;145;145;201;201;140;142
76;CL;151;170;126;134;197;209;114;128;241;241;171;171;145;149;201;201;140;142
77;CL;166;170;130;134;207;209;116;126;241;241;171;171;145;145;195;201;136;142
78;CL;174;178;106;126;197;205;116;118;241;241;168;171;149;150;201;201;134;142
79;CL;170;170;126;126;187;209;116;126;241;241;168;171;145;150;201;204;134;140
80;CL;170;170;126;130;187;207;126;128;241;241;171;171;145;145;201;201;132;140
81;CL;151;166;124;124;195;197;128;128;241;241;171;180;145;150;201;201;134;134
82;CL;170;176;124;124;197;209;126;128;241;241;171;180;145;150;201;201;134;142
83;CL;170;170;124;126;201;201;116;126;241;241;171;177;145;150;201;201;140;140
84;CL;170;170;124;126;199;205;126;128;241;241;177;177;145;150;201;201;132;136
85;CL;170;170;106;114;197;209;126;128;241;241;168;171;143;150;201;201;128;134
86;CL;170;170;114;126;207;209;120;128;241;241;177;177;143;147;201;201;132;134
87;CL;170;178;124;124;197;197;130;130;241;241;168;168;145;145;201;201;134;142
88;CL;170;170;126;126;197;197;122;126;241;241;168;177;145;145;195;201;140;140
89;CL;164;170;124;124;197;209;128;130;241;241;180;180;150;162;201;207;134;146
90;CL;170;170;124;124;199;211;114;128;241;241;171;177;145;149;201;204;132;134
91;CL;170;170;124;124;187;203;128;128;241;241;168;171;150;150;201;201;142;142
92;CL;164;170;126;136;201;209;128;130;241;241;168;171;145;150;201;201;132;140
93;CL;170;172;124;136;197;209;122;128;241;241;168;171;145;145;201;201;134;146
94;CL;151;170;106;124;197;197;122;128;241;241;168;171;143;162;201;201;134;140
95;CL;162;170;124;126;193;197;126;130;241;241;171;177;143;145;201;201;134;136
96;CL;170;170;124;124;193;193;120;126;241;241;171;171;143;149;201;201;134;146
97;CL;151;170;124;126;197;205;126;128;241;241;171;180;150;150;195;207;140;146
98;CL;164;170;124;142;199;209;126;128;238;241;168;168;162;164;201;201;132;136
99;CL;170;170;126;126;197;209;116;126;241;241;168;180;145;145;201;201;134;134
100;CL;151;176;118;124;201;201;126;128;241;241;177;180;145;150;201;201;132;140
101;CL;170;170;114;124;197;197;122;124;241;241;168;168;145;150;201;201;132;134
102;CS;151;170;124;124;193;205;126;128;241;241;168;177;145;145;201;201;134;142
103;CS;166;172;114;126;197;199;124;128;241;241;171;177;143;145;201;204;132;134
104;CS;170;170;134;134;201;201;126;128;241;241;168;171;145;147;201;204;134;142
105;CS;174;178;124;126;197;199;114;126;238;241;177;180;145;145;201;204;134;140
106;CS;170;176;114;114;193;195;114;128;241;241;168;177;145;145;201;204;142;144
107;CS;172;172;114;116;193;197;126;126;241;241;171;171;145;145;201;201;134;140
108;CS;174;176;124;134;197;205;114;116;241;241;168;177;145;145;201;201;134;134
109;CS;166;170;114;126;193;199;124;132;241;241;168;171;143;145;201;204;132;146
110;CS;170;178;106;106;195;197;126;128;241;241;171;177;145;149;201;204;140;144
111;CS;170;178;106;126;193;197;126;128;241;241;168;171;145;145;201;201;134;134
112;CS;170;176;124;124;193;195;126;126;241;241;168;168;145;145;201;201;142;142
113;CS;170;174;106;130;193;207;114;128;241;241;168;168;143;150;201;204;134;140
114;CS;172;178;126;150;187;195;124;124;241;241;177;177;143;145;201;201;134;134
115;CS;176;176;106;124;193;207;116;130;241;241;168;168;145;145;201;201;134;140
116;CS;166;170;114;134;193;201;126;128;241;241;168;168;145;145;201;201;132;144
117;CS;170;176;140;142;197;207;126;128;241;241;168;180;143;149;201;201;134;140
118;CS;170;176;106;116;195;201;124;128;241;241;168;168;145;145;201;201;132;140
119;CS;172;176;114;114;197;197;114;128;241;241;171;171;143;145;201;207;134;142
120;CS;172;172;126;134;197;201;124;124;241;241;171;180;145;145;201;201;132;134
121;CS;170;174;124;126;205;207;128;128;238;241;171;177;150;150;201;201;134;142
122;CS;176;176;114;144;193;193;124;126;241;241;171;171;145;150;201;207;134;134
123;CS;172;172;124;134;197;197;126;128;241;241;168;168;145;145;201;204;134;142
124;CS;151;176;114;114;193;193;116;124;241;241;177;180;145;145;201;201;132;140
125;CS;170;170;106;106;197;197;122;128;241;244;171;177;143;145;201;204;134;144
126;CS;170;174;106;114;193;197;114;128;241;241;168;180;145;145;201;201;134;134
127;CS;170;176;114;126;193;197;128;130;241;241;168;168;145;164;201;204;134;134
128;CS;170;172;124;126;197;201;126;128;241;246;171;177;145;145;201;204;134;134
129;CS;170;170;126;126;193;201;126;128;238;241;171;177;145;164;201;204;134;142
130;CS;170;176;106;124;197;205;114;126;238;241;168;177;143;145;201;201;132;132
131;CS;170;170;114;128;197;197;130;132;241;241;171;177;145;150;201;201;132;142
132;CS;170;174;124;126;193;197;116;126;241;241;168;177;143;145;201;201;132;142
133;CS;170;176;126;126;197;201;126;126;238;241;171;177;145;150;201;204;134;140
134;CS;170;176;106;114;193;201;126;128;241;241;177;180;145;164;201;201;134;136
135;CS;172;174;124;128;193;197;124;126;241;241;171;171;145;145;201;204;134;134
136;CS;170;176;114;126;193;205;126;128;238;241;171;171;145;145;201;201;132;142
137;CS;158;174;124;142;201;205;114;130;241;241;171;177;145;145;201;201;134;142
138;CS;170;178;124;126;199;201;116;128;241;241;168;171;145;150;201;201;134;142
139;CS;170;174;114;132;205;205;116;130;241;244;171;171;145;145;201;201;142;142
140;CS;170;172;106;124;193;197;124;128;241;241;168;180;145;145;201;204;134;134
141;CS;172;172;114;134;197;201;126;126;241;241;171;177;145;145;201;204;134;134
142;CS;170;174;106;124;195;201;126;128;241;241;168;171;145;145;201;201;134;134
143;CS;170;174;124;126;197;199;114;126;241;241;168;180;145;150;201;201;134;134
144;CS;170;176;126;126;193;197;126;128;241;241;171;171;145;145;201;207;132;132
145;CS;170;170;106;142;193;201;124;124;241;241;180;180;145;150;201;204;134;140
146;CS;170;170;124;130;195;205;124;126;241;241;177;177;149;150;201;204;134;134
147;CS;170;170;126;126;193;201;124;128;241;241;168;168;150;150;201;201;134;142
148;CS;170;170;124;124;199;201;128;132;241;241;168;168;143;150;201;201;132;146
149;CS;170;176;114;126;193;201;124;124;238;241;171;171;145;150;201;201;132;134
150;CS;170;170;124;128;197;197;126;126;241;241;168;171;145;150;201;204;134;142
151;CS;170;174;114;114;201;205;122;126;238;241;168;180;143;150;201;201;132;140
152;CS;170;176;114;114;195;195;128;128;241;241;168;171;145;145;204;207;134;134
153;CS;170;176;122;124;205;209;118;128;241;241;168;171;145;145;201;201;134;142
154;CS;164;170;114;126;197;201;128;128;241;241;168;171;145;145;204;204;132;142
155;CS;162;170;114;114;195;197;116;128;238;241;171;177;145;145;201;204;134;142
156;CS;170;170;114;126;193;193;126;128;241;241;168;171;143;145;201;201;134;134
157;CS;170;176;114;116;193;201;126;126;241;241;168;168;145;145;201;204;134;144
158;CS;166;170;124;124;193;195;126;128;241;241;168;171;145;145;201;204;132;140
159;CS;151;170;106;114;187;205;114;128;241;241;168;180;145;149;201;201;134;144
160;CS;170;170;114;114;193;197;116;126;241;241;177;180;145;145;201;201;140;142
161;CS;166;170;126;142;193;197;126;128;241;241;168;171;145;145;201;204;132;142
162;CS;176;178;124;142;193;197;120;126;241;241;168;177;145;145;201;201;132;140
163;CS;174;176;106;114;197;205;126;126;241;241;168;180;143;143;195;201;134;134
164;CS;170;170;106;124;197;201;126;128;241;241;171;177;145;145;201;201;140;140
165;CS;170;170;114;126;197;199;126;126;241;241;168;171;145;145;201;207;132;140
166;CS;151;178;106;124;197;201;126;126;241;244;168;171;145;150;195;204;134;134
167;CS;166;170;114;126;197;197;126;126;241;241;168;177;143;145;201;204;140;146
168;CS;170;170;106;134;195;197;124;128;241;241;171;171;145;145;201;201;134;146
169;CS;164;170;124;126;197;201;126;126;241;241;171;180;143;145;201;201;134;142
170;CS;166;174;126;136;197;201;114;116;241;241;168;177;145;164;201;204;134;134
171;CS;170;170;124;126;187;201;126;126;241;241;168;168;145;145;201;201;134;142
172;CS;170;170;106;114;197;197;126;128;241;241;168;177;143;145;201;201;132;142
173;CS;166;172;126;134;193;193;118;126;241;241;168;168;143;150;201;204;134;134
174;CS;166;170;124;124;197;199;128;128;241;241;168;168;145;145;201;204;132;134
175;CS;166;176;122;126;197;205;124;128;241;241;168;168;145;147;201;201;134;134
176;CS;164;170;106;114;193;201;120;126;241;241;168;177;145;145;201;201;136;142
177;CS;172;176;124;130;195;197;124;126;241;241;177;180;145;145;201;207;132;134
178;CS;170;172;106;124;195;201;116;124;241;241;171;177;145;145;201;201;132;144
179;CS;170;172;134;136;197;197;128;128;241;241;171;180;145;145;201;201;134;144
180;CS;164;170;114;126;197;199;120;128;241;241;168;168;143;145;201;201;132;142
181;CS;158;170;114;124;197;207;128;128;241;241;168;180;145;145;201;201;132;134
182;CS;170;174;106;124;197;197;126;126;241;241;171;171;143;145;201;204;132;134
183;CS;176;176;124;128;193;201;124;126;241;241;168;171;143;150;201;204;132;140
184;CS;151;170;106;114;205;211;118;128;238;241;168;180;143;145;201;201;132;140
185;CS;174;178;124;132;201;207;126;128;241;241;171;180;145;145;201;204;132;138
186;CS;158;170;124;134;195;195;126;128;241;241;171;180;145;150;201;201;132;134
187;CS;151;174;124;124;199;205;116;132;241;241;168;177;143;145;201;201;134;134
188;CS;170;174;114;126;197;197;126;128;241;241;177;180;145;150;201;201;134;140
189;CS;170;170;124;126;197;199;106;128;241;241;168;171;145;150;201;201;134;134
190;CS;172;176;124;134;193;201;124;126;241;241;168;180;143;143;201;204;134;134
191;CS;151;174;106;124;187;201;128;128;241;241;168;177;150;150;201;201;134;140
192;CS;170;170;106;124;197;197;126;128;241;241;168;168;145;145;201;201;132;140
193;CS;172;176;124;134;197;199;126;128;241;241;168;177;145;145;201;201;142;142
194;CS;158;170;106;124;205;205;128;128;241;241;171;177;145;145;201;204;134;142
195;CS;172;174;106;126;197;197;128;128;241;241;180;180;145;150;201;201;134;134
196;CS;170;170;114;124;193;201;126;126;241;244;177;177;143;145;201;204;132;140
197;CS;170;170;114;130;195;205;126;126;241;241;177;180;145;145;201;201;132;132
198;CS;170;172;114;124;197;201;128;130;241;241;177;180;145;145;201;204;134;142
199;CS;170;170;106;126;197;199;126;128;241;241;180;180;143;145;201;201;134;140
200;CS;170;170;124;126;197;197;116;126;241;241;168;168;145;145;201;204;134;140
201;CS;170;172;106;126;193;195;126;126;241;241;171;180;143;145;201;204;132;134
202;CS;170;170;126;126;197;197;116;128;241;241;168;171;145;145;201;204;134;134
203;CS;166;174;124;128;187;193;114;122;241;241;168;177;145;145;201;201;134;134
204;CS;158;176;108;114;195;197;114;126;241;241;171;171;150;150;201;204;132;146
205;CS;170;178;114;126;201;205;126;126;238;241;171;177;145;145;201;201;132;134
206;GS;174;176;126;142;201;201;114;128;241;241;171;171;143;145;201;201;134;134
207;GS;158;166;126;126;195;201;124;128;241;241;171;177;145;145;204;204;132;134
208;GS;170;170;126;134;193;205;126;128;241;241;180;180;145;150;201;201;134;134
209;GS;164;176;126;126;193;201;124;128;241;241;168;168;145;145;201;204;134;134
210;GS;162;176;124;126;201;201;116;126;241;241;171;171;145;145;201;204;132;132
211;GS;162;176;124;126;201;201;116;126;241;241;171;171;145;145;201;204;132;132
212;GS;166;170;126;126;187;193;116;126;241;241;177;180;145;145;201;201;132;134
213;GS;151;170;106;134;195;201;118;132;241;241;168;177;143;150;204;204;132;134
214;GS;151;176;124;126;197;199;126;126;241;241;171;171;143;150;201;201;134;142
215;GS;176;178;114;124;193;193;114;128;241;241;177;177;145;164;201;201;134;134
216;GS;170;174;106;126;193;197;124;126;241;241;168;168;150;150;201;201;132;140
217;GS;174;174;114;128;193;197;128;128;241;241;168;168;145;150;195;201;140;142
218;GS;151;170;106;126;197;201;116;118;241;241;168;177;143;145;204;204;132;132
219;GS;172;176;112;126;201;201;120;128;241;241;168;180;143;150;201;204;134;134
220;GS;172;172;106;126;193;193;122;128;238;241;168;168;145;150;201;204;140;144
221;GS;151;170;124;126;193;205;128;128;241;241;168;180;145;150;201;201;136;144
222;GS;170;172;114;114;195;201;128;128;241;241;168;171;150;150;201;207;132;134
223;GS;166;172;126;126;187;193;116;130;241;241;177;180;145;145;201;201;140;140
224;GS;170;170;106;114;199;207;116;126;241;241;168;177;145;145;201;204;134;138
225;GS;178;178;124;124;197;201;116;126;241;241;168;180;143;145;201;204;132;134
226;GS;170;170;114;126;197;197;128;132;241;241;168;168;145;150;204;204;132;134
227;GS;164;170;128;134;193;193;112;126;241;241;171;177;145;147;201;201;134;142
228;GS;170;176;126;126;197;199;124;128;241;241;168;180;145;150;201;204;132;134
229;GS;176;176;106;124;193;197;126;126;241;241;168;171;145;145;201;204;134;140
230;GS;158;178;114;124;187;197;124;126;238;241;168;177;145;145;201;201;132;134
231;GS;170;170;114;134;193;201;114;116;241;241;168;177;143;147;201;204;132;142
232;GS;170;170;124;124;193;201;126;126;241;241;171;180;143;143;195;207;134;134
233;GS;166;174;122;124;197;205;106;126;241;241;177;180;145;147;201;201;140;142
234;GS;170;174;114;142;197;197;118;126;241;241;171;180;145;145;201;201;132;146
235;GS;164;170;106;124;193;209;126;126;241;241;168;171;145;150;201;204;134;140
236;GS;174;176;124;126;193;193;116;124;241;241;168;180;150;164;201;201;134;134
237;GS;151;176;114;126;193;195;126;130;241;241;171;180;150;150;201;201;134;142
238;GS;166;174;118;126;193;197;118;126;241;241;168;168;145;145;201;204;140;146
239;GS;174;176;114;126;197;197;126;128;241;241;171;180;143;150;201;204;134;134
240;GS;170;170;124;128;197;201;128;130;241;241;171;177;145;147;201;201;134;134
241;GS;170;174;126;126;197;201;126;128;241;241;168;168;143;143;201;204;134;134
242;GS;174;178;114;134;195;205;124;128;241;241;171;177;145;145;201;201;140;142
243;GS;164;174;128;138;197;197;120;130;241;241;168;171;143;147;201;204;132;134
244;GS;166;172;114;128;197;201;124;128;238;241;168;168;145;147;201;201;134;134
245;GS;170;172;124;126;195;201;124;130;241;241;171;171;145;145;201;204;134;142
246;GS;170;172;106;106;187;195;114;128;241;241;168;177;145;145;201;201;134;142
247;GS;170;176;118;126;195;199;126;128;241;241;168;180;150;150;201;204;140;142
248;GS;170;176;126;136;193;199;126;126;241;241;168;168;145;147;201;201;134;142
249;GS;170;170;112;124;197;201;126;130;241;241;168;180;145;164;201;201;134;142
250;GS;170;172;126;126;193;193;124;126;241;241;171;177;143;150;201;201;132;134
251;GS;170;170;114;124;193;205;128;130;238;241;168;168;145;164;201;201;134;146
252;GS;164;176;124;124;197;201;116;128;241;241;168;168;150;150;201;201;134;134
253;GS;170;170;138;144;193;197;114;126;241;241;168;171;145;145;201;201;134;140
254;GS;166;178;124;128;199;201;126;128;241;241;168;171;162;164;201;204;132;134
255;GS;166;174;114;124;193;201;128;128;241;241;168;168;145;150;201;204;134;140
256;GS;164;164;114;134;195;199;124;128;241;241;180;180;145;147;201;201;132;134
257;GS;178;178;124;126;187;201;116;130;241;241;171;177;145;150;201;204;134;140
258;GS;158;172;114;126;193;193;116;118;241;241;171;177;145;147;201;201;134;140
259;GS;164;170;114;126;193;199;128;128;241;241;168;180;150;150;201;201;134;136
260;GS;170;170;124;134;193;199;116;126;241;241;168;177;145;145;201;201;132;134
261;GS;170;170;114;124;199;201;126;126;238;241;168;171;145;145;201;201;134;146
262;GS;170;178;106;126;197;201;114;130;241;241;171;171;145;150;201;201;142;142
263;GS;151;170;124;124;197;199;106;126;241;241;168;171;145;150;201;201;134;140
264;GS;170;170;128;134;193;199;118;128;241;241;168;171;145;149;201;204;134;140
265;GS;170;170;124;124;193;199;126;130;241;241;168;168;145;145;201;201;134;134
266;GS;151;170;114;126;193;197;116;126;241;241;171;180;145;145;201;201;132;134
267;GS;170;170;106;126;193;197;106;126;241;241;168;171;143;145;201;201;134;134
268;GS;158;176;124;126;193;195;126;126;238;241;168;180;145;150;201;204;140;142
269;GS;170;170;124;134;201;205;114;126;241;241;171;171;145;145;201;201;134;134
270;GS;166;170;124;126;199;209;114;126;241;241;168;177;145;150;204;204;132;132
271;GS;170;176;130;130;197;205;126;126;238;241;171;171;145;149;201;201;132;132
272;GS;170;172;114;130;197;197;114;130;241;241;168;168;143;145;201;201;134;134
273;GS;158;166;126;126;197;201;116;126;241;241;168;168;145;150;201;201;132;134
274;GS;174;178;106;126;193;197;126;128;241;241;171;180;143;150;201;204;134;140
275;GS;170;172;126;134;205;205;114;128;241;241;168;180;145;147;201;201;134;142
276;GS;151;172;126;126;193;199;126;128;241;241;168;171;145;150;201;201;134;142
277;GS;170;170;106;126;195;199;128;128;241;241;168;171;145;145;195;201;136;142
278;GS;170;170;108;126;195;205;126;128;241;241;168;168;143;145;201;204;134;134
279;GS;172;174;126;146;193;197;124;128;241;241;168;177;145;150;201;201;134;146
280;GS;172;176;106;126;187;197;126;128;241;241;168;177;145;145;201;201;134;142
281;GS;170;176;124;142;197;205;126;128;241;241;168;177;143;145;201;201;134;140
282;GS;174;176;106;124;193;195;126;128;241;241;171;171;150;150;201;201;140;142
283;GS;151;176;124;134;193;193;126;128;238;241;168;171;145;145;201;201;140;140
284;GS;172;176;126;134;193;199;118;126;244;244;168;180;143;145;201;204;132;140
285;GS;170;174;114;114;193;201;118;124;244;244;171;180;145;150;201;207;132;142
286;GS;170;178;124;124;193;197;126;128;238;241;168;168;145;145;201;204;134;142
287;GS;170;172;112;126;197;199;126;126;241;241;168;171;145;150;201;204;132;140
288;GS;174;176;128;128;193;197;126;128;241;241;168;171;145;145;201;204;140;140
289;GS;170;176;126;126;193;197;128;128;241;241;168;177;145;145;201;201;134;134
290;GS;176;178;124;126;197;197;126;126;241;241;168;180;145;150;201;201;140;146
291;GS;170;178;114;126;199;201;128;132;241;241;168;168;145;145;201;201;134;136
292;GS;170;176;126;128;197;205;126;128;241;241;168;180;145;145;201;204;134;142
293;GS;164;170;126;130;197;197;124;126;241;241;171;171;145;145;201;201;134;142
294;GS;170;170;108;124;193;197;118;120;241;241;168;168;145;145;201;201;132;132
295;GS;158;170;106;134;187;197;126;126;241;241;168;177;149;149;201;201;134;142
296;GS;170;174;124;126;195;199;126;126;241;241;168;168;145;150;195;204;132;134
297;GS;170;176;126;126;193;197;124;128;241;241;168;168;147;158;201;201;132;140
298;GS;166;166;114;124;197;199;126;126;241;241;171;180;145;145;201;201;134;140
299;GS;170;178;124;136;193;197;126;126;241;241;180;180;145;150;201;201;132;134
300;GS;172;172;114;126;193;201;114;126;241;241;171;180;145;145;201;201;134;142
301;GS;170;174;106;106;193;197;124;132;241;241;168;180;143;145;201;201;132;134
302;GS;170;176;114;126;187;197;126;128;238;241;177;180;145;162;201;204;134;134
303;GS;170;176;114;126;197;207;116;124;241;241;168;177;148;148;204;204;134;140
304;GS;170;170;124;126;197;201;116;124;241;241;168;180;145;145;201;201;134;134
305;GS;170;176;124;126;195;197;126;126;241;241;171;180;145;150;201;201;134;134
306;GS;170;170;126;142;197;197;128;128;241;241;168;177;150;150;201;204;132;140
307;GS;170;172;116;124;197;201;118;124;241;241;168;168;145;150;201;201;134;134
308;GS;176;176;124;126;201;201;116;126;241;241;171;171;150;164;201;201;134;140
309;UL;158;170;124;130;193;211;124;128;241;241;168;180;143;145;201;201;134;134
310;UL;158;172;124;124;193;195;126;128;241;241;168;171;143;145;201;201;134;142
311;UL;166;170;124;124;193;197;130;130;241;241;171;180;145;145;201;204;134;140
312;UL;170;172;124;124;195;201;126;128;241;241;168;168;145;145;201;201;132;134
313;UL;170;172;124;126;199;201;126;126;241;241;168;171;145;145;201;201;132;134
314;UL;170;170;114;124;201;201;114;114;238;241;168;177;143;145;195;201;134;134
315;UL;158;170;124;124;197;201;126;128;241;241;171;177;145;145;201;201;132;142
316;UL;170;170;124;124;193;201;114;124;241;241;168;171;143;145;201;201;132;134
317;UL;170;176;124;126;197;199;120;126;238;241;168;171;145;164;201;201;132;134
318;UL;166;170;124;126;193;193;126;128;241;241;168;171;143;145;201;201;132;132
319;UL;170;170;124;126;197;199;126;128;241;241;168;171;145;150;201;204;140;142
320;UL;170;170;114;124;199;201;126;128;241;241;171;180;143;150;201;204;134;142
321;UL;170;170;124;126;193;197;124;130;241;241;168;180;145;145;201;201;132;142
322;UL;172;172;126;126;193;197;126;126;241;241;171;177;145;145;201;201;136;146
323;UL;151;174;122;126;193;193;126;128;241;241;168;177;145;145;201;204;132;132
324;UL;170;176;124;124;193;201;128;128;241;241;180;180;145;145;201;204;134;142
325;UL;168;170;114;134;197;205;114;126;241;241;168;171;150;150;201;201;132;142
326;UL;170;170;124;124;199;201;126;128;241;241;168;171;145;145;201;201;132;142
327;UL;174;176;124;128;193;195;124;126;241;244;171;171;145;150;201;201;134;140
328;UL;170;170;106;114;193;197;124;126;241;241;168;180;145;145;201;201;132;140
329;UL;170;176;114;130;193;195;126;128;241;241;171;171;145;150;201;201;134;146
330;UL;168;170;142;142;199;201;126;132;241;241;171;180;145;145;201;201;134;134
331;UL;164;170;124;126;199;205;128;132;241;241;168;180;145;145;201;201;134;134
332;UL;166;172;116;124;187;199;126;130;238;241;168;168;150;150;201;201;134;136
333;UL;170;178;106;114;205;205;126;126;241;241;171;171;145;145;201;201;134;136
334;UL;170;170;106;126;201;205;124;128;238;241;171;180;145;147;201;201;136;136
335;UL;166;172;126;142;195;201;114;124;241;241;171;177;143;143;201;201;134;134
336;UL;170;174;114;130;195;197;114;126;241;241;171;171;145;145;195;201;134;136
337;UL;170;170;124;142;193;201;114;126;241;241;171;171;145;145;201;201;134;142
338;UL;170;170;114;124;193;201;126;128;241;241;168;180;145;149;201;204;132;134
339;UL;170;176;124;128;193;201;114;124;241;241;171;180;145;150;201;204;134;142
340;UL;170;170;124;126;193;201;114;128;241;241;171;171;145;150;201;204;132;134
341;UL;166;170;124;128;201;201;114;126;241;241;168;177;145;150;201;201;134;142
342;UL;170;170;124;134;193;199;116;126;241;241;171;177;145;145;201;204;132;134
343;UL;170;174;124;124;197;201;124;128;241;241;168;168;145;150;201;201;132;142
344;UL;162;170;114;144;193;201;124;126;241;241;168;180;149;149;201;201;134;134
345;UL;170;176;114;126;195;195;126;126;241;241;168;171;145;145;201;201;136;144
346;UL;170;174;126;128;193;199;126;128;241;241;168;171;143;145;201;201;134;144
347;UL;170;170;114;124;199;211;116;126;241;241;171;171;149;149;201;201;134;142
348;UL;170;170;124;130;197;199;126;126;241;241;168;171;143;145;201;201;136;144
349;UL;172;178;106;114;195;197;126;128;241;241;171;177;145;150;201;204;132;132
350;UL;164;170;114;126;193;193;124;126;241;241;171;171;145;147;201;207;134;136
351;UL;172;174;124;126;193;197;114;124;241;241;168;171;145;149;201;201;132;142
352;UL;172;174;124;124;193;193;120;126;241;241;168;171;145;150;201;201;134;140
353;UL;170;172;124;124;187;193;126;128;241;241;168;177;145;145;201;207;134;140
354;UL;170;170;124;142;193;199;128;132;241;241;168;180;145;145;201;201;134;136
355;UL;166;170;124;124;193;195;124;126;241;241;168;180;143;145;201;201;134;140
356;UL;170;178;126;130;197;207;124;126;241;241;168;180;145;150;201;201;134;134
357;UL;170;176;114;130;193;197;114;126;241;241;171;171;143;150;201;201;134;136
358;UL;170;170;124;124;201;205;126;126;241;241;171;171;145;145;201;201;132;146
359;UL;170;178;114;124;205;205;116;126;241;241;168;168;145;150;201;201;134;140
360;UL;166;170;124;128;195;201;126;128;241;241;171;180;145;145;201;201;134;136
361;UL;170;170;106;124;195;205;126;132;241;241;171;171;145;145;201;201;136;140
362;UL;164;170;124;130;193;197;120;128;241;241;171;171;143;147;201;201;134;136
363;UL;174;178;124;124;193;195;128;128;241;241;168;171;147;147;195;204;132;136
364;UL;170;178;114;124;193;201;124;126;241;246;171;180;145;145;201;204;136;140
365;UL;170;170;114;124;193;197;124;128;241;241;171;180;145;145;201;204;132;134
366;UL;170;176;114;142;197;197;124;128;241;241;171;171;145;149;201;201;134;136
367;UL;151;176;106;124;197;197;116;126;241;241;171;177;145;150;201;201;132;134
368;UL;151;170;114;126;195;205;124;126;241;241;171;180;147;150;201;204;132;136
369;UL;170;176;108;124;195;201;126;126;241;241;177;177;145;150;201;201;132;140
370;UL;170;176;114;134;199;201;114;126;238;241;171;180;145;150;201;201;134;134
371;UL;170;172;114;124;201;201;122;130;241;241;168;171;143;147;201;204;134;142
372;UL;158;172;126;126;197;197;128;136;241;241;168;171;145;149;204;204;134;134
373;UL;166;172;124;140;193;193;124;126;241;241;171;171;145;145;201;201;140;140
374;UL;170;172;124;124;197;201;124;128;241;241;168;171;145;150;201;204;134;134
375;UL;170;170;124;126;193;201;126;132;241;241;168;171;143;145;201;201;132;140
376;UL;172;176;114;124;201;201;126;126;238;241;168;171;147;147;201;201;132;136
377;UL;170;170;124;126;201;211;114;128;241;241;177;180;162;162;201;201;132;134
378;UL;170;176;124;124;193;205;114;124;241;241;171;180;145;162;201;201;134;134
379;UL;170;176;114;124;197;201;126;126;241;241;171;171;145;152;201;201;134;134
380;UL;170;170;124;142;195;207;126;132;241;241;168;171;143;145;201;201;132;136
381;UL;170;172;106;126;193;195;120;126;241;241;168;171;145;145;201;201;134;146
382;UL;170;176;126;126;195;197;110;126;238;241;171;171;145;150;201;201;134;140
383;UL;172;176;114;128;193;193;126;128;241;241;168;180;145;145;201;201;134;134
384;UL;170;172;114;124;193;201;126;126;241;241;171;171;145;145;201;201;134;134
385;UL;176;176;114;126;187;193;126;128;241;241;171;180;150;150;201;201;134;136
386;UL;166;170;124;124;197;211;124;124;241;241;177;180;143;145;201;201;134;134
387;UL;170;170;114;114;197;199;118;124;241;241;171;180;143;150;201;201;132;142
388;UL;170;176;114;126;193;195;124;126;241;241;168;171;145;145;201;204;134;140
389;UL;172;172;114;134;193;197;118;126;241;241;171;180;150;150;201;201;136;140
390;UL;172;176;124;126;193;197;126;128;241;241;168;171;143;143;201;201;134;140
391;UL;158;174;124;124;195;197;116;126;241;241;171;171;145;145;201;201;134;134
392;UL;158;172;106;124;193;195;126;128;241;241;171;180;147;150;201;204;134;142
393;UL;170;170;114;124;193;201;126;130;241;241;171;171;143;145;201;204;134;142
394;UL;174;176;114;124;187;201;130;130;238;241;168;171;143;145;201;204;132;134
395;UL;170;172;124;126;197;197;124;126;241;241;171;177;145;145;201;207;132;148
396;UL;151;172;124;124;197;205;126;126;241;241;171;180;145;145;201;201;140;142
397;UL;158;166;114;124;199;201;114;128;241;241;171;180;143;143;201;204;136;142
398;UL;172;176;114;124;193;201;126;126;241;241;168;171;145;145;201;201;132;142
399;UL;170;172;114;140;193;199;124;128;241;241;171;177;143;143;201;201;140;142
400;UL;166;170;124;126;201;211;126;126;241;241;171;180;143;162;201;201;134;134
401;UL;172;176;126;140;197;197;114;128;241;241;168;177;145;145;201;201;140;140
402;UL;164;176;124;126;205;207;114;126;241;241;171;180;143;162;201;201;134;142
403;UL;176;176;114;124;193;205;124;128;241;241;171;180;145;162;201;204;134;136
404;UL;170;178;124;126;197;205;114;124;241;241;171;177;145;147;201;201;134;136
405;UL;170;176;124;126;193;205;118;132;241;241;168;171;143;143;201;201;132;140
406;UL;151;176;124;124;193;199;118;118;241;241;171;171;145;145;201;201;132;132
407;UL;170;170;126;138;193;205;114;128;241;241;171;171;145;145;201;201;134;138
408;UL;170;172;106;124;201;207;124;132;241;241;168;177;145;150;201;201;134;142
409;US;162;178;114;124;195;201;124;124;241;246;168;171;145;150;201;201;134;140
410;US;170;178;114;124;197;199;114;126;241;241;171;171;143;150;201;201;134;140
411;US;166;178;124;134;199;199;124;126;241;241;168;171;143;145;201;201;140;142
412;US;172;172;124;130;199;211;124;124;241;241;168;171;145;150;201;201;142;146
413;US;166;172;124;126;187;195;124;126;241;246;171;177;145;147;201;204;134;134
414;US;164;172;130;140;195;207;126;126;241;241;168;168;147;150;201;201;132;142
415;US;170;170;114;124;195;195;126;126;241;246;171;171;145;150;201;201;134;136
416;US;166;170;106;134;193;207;120;126;241;241;168;168;143;145;201;201;134;142
417;US;166;178;114;124;195;195;124;126;241;246;171;180;147;147;201;201;132;140
418;US;170;174;126;138;197;199;126;128;241;241;168;168;145;150;201;201;132;134
419;US;170;178;124;130;199;201;126;128;241;241;168;171;145;147;201;204;132;140
420;US;170;176;114;124;193;197;126;126;241;241;171;171;145;145;201;201;134;144
421;US;162;176;124;124;195;197;124;126;241;246;171;180;145;147;201;201;134;140
422;US;170;176;114;124;193;195;124;126;241;241;171;177;145;147;201;204;140;142
423;US;166;178;114;124;201;201;124;126;241;246;171;177;145;147;201;201;136;142
424;US;172;172;110;124;193;195;126;126;241;241;171;171;145;145;201;201;134;140
425;US;172;172;126;138;195;201;124;126;241;246;171;171;145;145;201;201;134;136
426;US;170;174;114;126;197;207;116;128;241;241;168;171;145;150;201;201;132;134
427;US;170;178;118;142;197;199;126;126;241;241;180;180;145;150;201;201;134;134
428;US;164;170;126;128;193;193;126;126;241;241;171;171;145;147;201;201;134;136
429;US;170;170;124;124;193;201;116;124;241;241;171;171;145;145;201;201;134;142
430;US;170;174;124;126;197;209;126;126;241;241;171;171;145;145;201;201;134;134
431;US;174;176;114;124;197;197;124;126;241;241;168;171;145;145;201;201;132;134
432;US;164;170;124;126;193;197;126;126;241;241;171;171;145;145;201;204;134;140
433;US;170;178;114;124;201;209;124;128;241;241;171;177;145;147;201;201;132;134
434;US;164;170;124;126;193;209;126;126;241;241;171;171;145;145;201;204;132;146
435;US;170;170;124;126;195;201;126;128;241;241;171;171;145;145;201;201;142;142
436;US;170;172;124;138;197;205;124;126;241;246;171;171;145;162;201;201;132;134
437;US;164;164;114;124;197;201;126;126;241;241;168;171;145;145;201;201;134;142
438;US;164;170;114;126;193;197;126;126;241;246;168;171;145;147;201;204;132;134
439;US;170;176;124;126;195;197;116;128;241;241;171;171;143;145;195;201;134;140
440;US;170;172;124;126;195;197;124;124;241;246;171;171;145;147;195;201;134;146
441;US;170;170;106;126;195;195;124;126;241;241;171;171;150;150;201;201;134;134
442;US;170;176;124;142;197;201;118;126;241;241;171;171;147;147;201;204;134;134
443;US;170;172;114;134;193;207;114;124;241;241;168;171;143;145;201;201;134;142
444;US;166;176;124;126;197;201;116;126;241;241;168;171;145;145;201;201;134;140
445;US;166;170;114;124;193;201;124;126;241;241;168;171;145;145;201;201;134;142
446;US;172;172;124;134;195;195;126;128;241;241;171;171;145;147;201;201;142;142
447;US;170;170;124;126;197;199;124;128;238;241;168;171;150;150;201;201;140;142
448;US;172;178;124;150;195;197;114;126;241;241;168;171;150;150;207;207;132;136
449;US;164;176;116;124;193;201;114;126;241;241;171;180;145;145;201;201;142;148
450;US;164;170;114;124;193;199;126;126;241;241;171;171;145;145;201;201;132;150
451;US;170;170;114;124;197;209;126;128;241;241;171;171;145;145;201;201;132;132
452;US;170;170;114;124;193;199;126;128;241;241;171;171;145;145;201;201;132;134
453;US;170;170;106;126;199;209;114;126;241;241;168;171;145;145;201;204;132;134
454;US;164;170;114;114;193;201;126;126;241;241;171;171;145;145;201;201;146;148
455;US;170;172;114;126;197;199;126;126;241;241;168;177;145;145;204;207;132;134
456;US;170;170;114;124;193;197;110;126;241;241;171;171;145;145;201;207;132;136
457;US;170;178;124;124;197;205;126;126;241;241;171;171;145;145;201;201;134;140
458;US;170;176;124;142;193;201;126;126;241;241;171;180;145;145;201;201;134;146
459;US;176;176;124;124;197;201;114;126;241;241;180;180;145;145;201;201;134;148
460;US;170;176;114;142;193;193;118;126;241;241;168;180;143;143;201;201;134;142
461;US;170;170;114;142;197;199;126;132;241;241;171;180;145;145;201;201;134;142
462;US;172;172;114;124;193;193;126;128;241;241;171;171;145;145;201;201;132;142
463;US;164;170;106;132;197;201;126;128;238;241;171;180;143;145;201;201;140;140
464;US;170;176;124;126;197;197;124;130;238;241;171;171;147;150;201;201;132;134
465;US;162;172;114;150;195;201;124;128;241;241;168;171;145;145;201;201;136;140
466;US;164;172;130;140;193;207;126;126;241;241;168;168;143;150;201;201;140;142
467;US;170;178;114;134;193;201;126;128;241;241;171;171;145;145;201;201;134;136
468;US;166;170;106;124;193;201;114;124;241;241;168;180;145;152;201;201;132;134
469;US;170;170;124;136;197;197;126;132;241;241;171;171;145;150;201;204;132;136
470;US;166;172;114;134;197;199;126;128;241;241;168;171;143;143;201;201;132;142
471;US;172;172;114;116;195;197;126;130;241;246;168;171;147;150;201;204;134;142
472;US;170;172;126;138;193;195;118;126;241;241;171;177;145;145;195;201;134;134
473;US;162;174;124;126;195;197;114;128;241;241;168;168;145;145;201;201;134;134
474;US;162;170;114;124;199;201;124;126;241;246;171;171;145;150;201;204;140;142
475;US;170;172;124;134;197;201;126;126;241;241;168;171;145;145;201;201;134;140
476;US;170;174;114;124;197;201;126;126;241;241;171;180;143;145;201;201;132;134
477;US;170;176;124;134;195;197;114;128;238;241;171;171;145;145;201;201;134;134
478;US;170;170;106;126;201;201;118;126;241;241;168;168;145;145;201;201;136;142
479;US;164;170;124;126;193;207;124;126;241;241;168;171;145;145;201;201;134;136
480;US;170;170;124;126;193;207;124;126;241;241;168;171;145;145;201;201;134;146
481;US;164;170;114;124;197;197;114;126;241;241;168;171;145;145;204;207;136;136
482;US;170;172;114;124;193;197;128;130;241;241;171;177;143;145;201;204;132;140
483;US;170;170;124;126;193;195;126;126;241;241;168;180;145;145;201;201;132;146
484;US;164;172;124;134;193;193;126;126;241;241;168;180;145;150;201;201;132;134
485;US;170;170;124;126;193;193;124;128;241;241;171;180;145;145;201;201;134;142
486;US;170;178;124;124;193;201;124;124;241;241;168;171;145;149;201;201;134;134
487;US;170;170;114;124;193;197;124;126;241;241;168;171;145;150;201;201;134;142
488;US;170;170;124;140;195;195;114;126;238;241;171;171;150;150;201;201;132;134
489;US;162;170;106;114;195;201;114;128;238;241;171;171;145;145;201;201;134;134
490;US;166;174;124;126;193;197;118;128;241;241;168;180;145;145;204;204;132;146
491;US;172;176;124;126;187;197;114;124;241;241;168;171;147;150;201;201;132;146
492;US;172;176;114;126;187;197;114;124;241;246;171;171;145;150;201;204;140;146
493;US;170;170;124;126;197;199;126;132;241;241;171;171;145;145;201;201;134;146
494;US;170;170;106;130;197;207;114;128;241;246;168;171;143;145;201;201;134;142
495;US;176;178;114;122;193;195;124;126;241;241;168;171;145;150;201;201;136;146
496;US;164;164;126;126;193;199;126;128;241;241;168;171;150;150;201;201;134;134
497;US;170;176;116;124;195;197;114;118;241;241;171;180;143;145;201;204;134;140
498;US;170;170;114;124;195;201;124;128;241;241;171;171;145;145;195;201;132;134
499;US;166;176;106;106;193;197;126;128;238;241;171;177;145;145;201;201;134;136
500;US;164;176;114;114;193;199;126;128;241;241;168;171;145;145;201;201;132;134
501;US;166;170;106;134;193;197;126;132;241;241;171;171;145;145;201;201;132;136
502;US;170;170;114;126;193;197;126;126;238;241;168;177;145;145;201;201;132;142
503;US;170;174;114;124;0;0;118;128;241;241;168;168;145;145;201;201;132;134
504;US;0;0;0;0;0;0;0;0;241;241;168;171;145;145;201;201;136;142
505;US;164;170;124;126;193;199;126;126;241;241;171;180;145;145;201;204;134;146
506;US;170;170;110;124;195;197;116;126;241;241;171;180;145;145;201;201;132;134
507;US;170;170;124;130;193;201;126;126;238;241;171;171;145;145;201;204;134;134
508;US;170;170;126;126;193;193;126;130;241;241;171;177;145;150;201;201;132;134
509;Ha_adult;170;176;124;126;195;199;124;126;241;241;168;171;149;149;201;201;140;142
510;Ha_adult;174;176;114;126;193;199;124;126;241;241;171;180;149;149;201;204;134;140
511;Ha_adult;172;176;124;126;197;201;124;126;241;241;171;180;145;149;201;201;132;140
512;Ha_adult;172;176;124;126;193;197;124;128;241;241;168;177;145;145;201;201;140;140
513;Ha_adult;170;170;114;126;193;199;124;128;241;241;168;171;145;145;201;201;132;140
514;Ha_adult;170;176;114;126;199;201;126;126;241;241;168;168;145;145;201;201;140;140
515;Ha_adult;172;174;106;114;197;201;116;128;241;241;168;180;149;149;201;201;134;134
516;Ha_adult;170;174;126;134;193;197;122;126;238;241;168;168;149;149;201;201;132;134
517;Ha_adult;151;170;122;124;195;205;126;130;241;241;171;177;145;145;201;204;132;134
518;Ha_adult;174;178;124;130;195;201;126;128;241;241;168;180;145;145;201;204;132;142
519;Ha_adult;166;166;106;126;197;201;126;126;241;241;168;177;145;149;201;201;134;140
520;Ha_adult;170;170;114;124;197;205;126;126;241;241;177;177;145;145;201;201;134;136
521;Ha_adult;170;178;124;130;193;205;126;126;238;241;168;177;145;145;201;201;132;134
522;Ha_adult;170;176;114;136;193;197;116;126;241;241;168;168;145;145;201;204;132;134
523;Ha_adult;164;174;124;124;201;201;116;126;238;241;171;177;145;149;201;201;134;146
524;Ha_adult;176;178;124;130;201;205;114;126;238;241;171;171;145;149;201;201;134;146
525;Ha_adult;170;170;126;126;197;199;128;132;238;241;171;180;145;145;201;204;132;134
526;Ha_adult;170;170;114;126;187;197;106;124;241;241;168;168;149;149;201;201;132;134
527;Ha_adult;164;174;126;126;199;207;124;128;238;241;171;171;145;149;204;204;140;140
528;Ha_adult;170;178;126;142;199;201;124;128;238;241;171;171;147;147;201;204;132;134
529;Ha_adult;164;174;114;114;193;199;126;128;238;241;168;171;164;164;201;201;134;140
530;Ha_adult;166;176;122;126;195;201;114;126;241;241;171;171;149;149;201;201;134;142
531;Ha_adult;170;174;124;126;187;197;126;128;241;241;171;177;145;149;201;201;134;134
532;Ha_adult;158;170;114;124;195;205;114;128;241;241;168;180;145;149;195;201;134;146
533;Ha_adult;158;170;114;124;195;207;118;126;241;241;171;180;145;149;201;201;134;146
534;Ha_adult;170;170;124;126;193;197;128;128;241;241;168;180;145;149;201;201;134;140
535;Ha_adult;170;170;114;124;201;205;118;126;241;241;171;177;149;149;201;201;132;142
536;Ha_adult;170;170;124;126;195;197;124;126;241;241;168;171;145;149;201;201;134;142
537;Ha_adult;170;176;124;124;187;195;118;130;241;241;171;177;143;149;201;204;134;142
538;Ha_adult;164;170;124;126;197;197;126;132;241;241;168;171;147;149;201;201;140;146
539;Ha_adult;170;170;124;128;201;205;126;126;241;241;177;180;145;145;201;204;134;140
540;Ha_adult;166;170;124;128;193;195;124;132;241;241;168;168;145;145;201;201;134;134
541;Ha_adult;172;172;114;142;197;197;126;128;241;241;171;177;145;147;201;201;134;140
542;Ha_adult;172;176;106;128;193;199;126;126;241;241;168;171;145;147;204;204;134;146
543;Ha_adult;176;176;126;136;193;205;126;128;241;241;168;171;143;149;201;204;134;134
544;Ha_adult;170;170;114;140;195;195;114;124;241;241;168;180;145;145;201;201;134;142
545;Ha_adult;170;170;114;140;195;197;114;124;241;241;168;180;145;145;201;201;134;142
546;Ha_adult;176;178;124;124;193;195;128;128;241;241;168;177;145;145;201;204;134;134
547;Ha_adult;170;176;118;124;187;193;126;126;241;243;168;177;145;149;201;201;134;142
548;Ha_adult;172;174;114;126;195;201;124;126;235;241;171;177;145;149;201;201;134;134
549;Ha_adult;170;172;124;126;205;205;126;132;241;241;168;171;145;145;201;201;134;134
550;Ha_adult;170;176;116;126;193;195;114;128;241;241;168;171;143;145;201;201;134;134
551;Ha_adult;170;172;126;126;197;205;126;128;241;241;171;171;143;145;201;201;134;146
552;Ha_adult;172;178;106;122;195;205;126;132;241;241;168;168;143;145;201;201;134;134
553;Ha_adult;170;178;134;134;193;197;124;126;241;241;168;171;143;147;201;201;134;140
554;Ha_adult;176;178;114;134;187;197;124;128;241;241;168;171;145;149;201;201;134;134
555;Ha_adult;170;176;126;136;201;209;124;126;241;241;177;180;145;149;201;201;134;134
556;Ha_adult;170;176;126;134;193;197;124;128;241;241;171;177;145;149;201;201;134;134
557;Ha_adult;172;172;114;114;193;193;124;128;241;241;171;180;143;145;201;201;134;134
558;Ha_adult;166;176;114;114;197;209;126;128;241;241;168;177;145;145;201;201;132;142
559;Ha_adult;170;174;124;126;187;197;126;128;241;241;168;177;145;149;201;204;132;134
560;Ha_adult;170;170;124;134;197;197;126;128;241;241;168;171;143;143;201;204;134;134
561;Ha_adult;170;172;128;130;193;209;116;128;241;241;168;168;143;143;201;207;134;146
562;Ha_adult;170;176;124;142;193;197;126;126;241;241;168;171;143;145;201;207;134;134
563;Ha_adult;170;172;106;124;193;199;116;120;241;241;168;180;145;149;201;201;134;134
564;Ha_adult;170;176;126;138;195;197;112;128;235;241;168;168;145;145;201;201;142;146
565;Ha_adult;170;170;114;142;195;197;116;128;241;241;168;171;145;145;201;201;134;134
566;Ha_adult;170;176;114;134;193;199;114;128;241;241;168;180;145;145;201;201;132;140
567;Ha_adult;162;170;124;126;197;197;128;132;241;241;171;180;145;145;201;201;134;142
568;Ha_adult;162;170;124;124;195;209;126;126;241;241;168;180;145;149;201;201;132;142
569;Ha_adult;164;170;134;136;197;199;126;126;241;241;168;168;143;149;201;201;134;134
570;Ha_adult;151;174;114;124;193;195;126;128;238;241;171;171;143;145;204;204;134;142
571;Ha_adult;174;178;106;124;193;207;122;126;241;241;168;171;145;145;201;201;134;146
572;Ha_adult;170;178;124;126;187;197;124;126;241;241;168;171;145;145;201;201;134;134
573;Ha_adult;158;170;124;126;197;207;114;126;241;241;168;171;145;149;195;201;134;134
574;Ha_adult;170;176;124;128;195;201;118;126;241;241;180;180;150;150;201;201;134;146
575;Ha_adult;170;170;124;124;197;201;122;124;241;241;171;171;149;149;204;204;140;142
576;Ha_adult;170;170;124;126;193;197;122;128;241;241;177;180;145;150;201;201;134;140
577;Ha_adult;170;170;128;128;197;197;128;128;238;241;177;177;145;145;201;201;134;142
578;Ha_adult;170;174;126;126;193;207;128;130;241;241;171;177;143;145;201;204;140;152
579;Ha_adult;170;170;124;126;197;201;118;126;241;241;168;177;145;149;201;201;132;134
580;Ha_adult;170;176;114;126;195;197;128;128;241;241;180;180;145;150;201;201;134;140
581;Ha_adult;170;170;124;124;193;195;126;132;241;241;171;180;145;145;201;201;140;140
582;Ha_adult;170;178;114;126;193;197;126;128;241;241;168;171;145;149;201;201;134;140
583;Ha_adult;166;174;124;124;193;207;114;128;241;241;171;171;143;145;201;204;134;140
584;Ha_adult;164;170;124;126;197;197;126;132;241;241;168;171;147;149;201;201;140;146
585;Ha_adult;170;170;124;128;193;205;126;126;241;241;171;171;145;147;201;201;140;140
586;Ha_adult;170;170;124;124;205;207;128;132;241;241;168;171;143;145;201;201;132;140
587;Ha_adult;151;176;124;126;193;205;126;128;241;241;168;171;149;149;201;204;134;140
588;Ha_adult;170;174;106;124;193;205;126;132;241;241;168;177;145;149;201;201;134;140
589;Ha_adult;172;172;124;124;195;199;124;128;241;241;168;180;145;145;201;201;134;140
590;Ha_adult;174;174;124;130;201;205;124;126;238;241;168;171;145;149;201;201;134;146
591;Ha_adult;170;178;126;136;193;197;126;130;238;241;168;168;147;149;201;204;132;134
592;Ha_adult;170;180;124;124;193;197;120;126;238;241;168;171;145;145;201;201;132;134
593;Ha_adult;170;170;106;136;197;199;126;128;241;241;177;180;145;147;204;204;132;134
594;Ha_adult;170;170;114;114;197;199;114;128;241;241;168;177;145;145;201;201;132;142
595;Ha_adult;164;170;114;136;197;201;126;126;241;241;180;180;145;145;201;204;134;134
596;Ha_adult;170;178;130;136;193;197;126;128;241;241;177;177;149;149;201;201;134;140
597;Ha_adult;176;178;114;126;197;197;126;128;241;243;168;171;145;145;201;201;134;140
598;Ha_adult;151;176;106;142;193;193;120;126;238;241;171;171;143;145;201;201;134;134
599;Ha_adult;170;178;124;126;187;197;126;128;241;241;171;171;145;145;201;204;132;132
600;Ha_adult;170;178;106;126;197;205;126;128;241;241;177;180;149;149;201;201;134;146
601;Ha_adult;170;170;106;136;197;199;126;128;241;241;177;180;145;147;204;204;132;134
602;Ha_adult;176;178;122;124;205;205;124;126;241;241;171;177;145;149;201;201;134;140
603;Ha_adult;172;178;124;128;0;0;126;126;241;241;177;180;145;145;201;201;134;140
604;Ha_adult;170;170;116;136;193;205;118;128;241;241;0;0;150;150;201;207;132;134
605;Ha_adult;170;176;114;134;199;199;126;132;241;241;180;180;145;145;201;201;134;134
606;Ha_adult;170;170;114;124;187;197;114;116;241;241;177;180;145;150;201;201;134;142
607;Ha_adult;170;170;106;142;193;193;118;126;243;243;168;180;143;150;201;204;134;140
608;GL;162;178;106;126;193;197;124;126;241;246;168;180;150;150;201;204;142;146
609;GL;172;176;106;126;197;197;126;126;241;246;168;171;150;150;201;201;132;146
610;GL;170;176;126;126;193;199;128;126;241;241;171;177;145;147;201;201;132;140
611;GL;170;176;114;126;197;199;126;128;241;241;171;180;150;150;201;201;134;144
612;GL;170;170;126;126;197;197;126;126;241;241;168;177;143;145;201;201;134;142
613;GL;170;170;112;114;197;205;118;128;241;241;168;177;145;162;201;201;132;134
614;GL;170;174;112;126;199;201;114;128;241;241;168;180;145;145;201;201;136;142
615;GL;158;178;126;142;199;199;114;126;238;241;171;180;145;145;204;204;132;132
616;GL;174;176;124;126;187;205;130;132;238;241;168;171;145;145;201;204;132;140
617;GL;162;176;114;126;199;199;130;132;238;241;168;168;145;145;201;204;134;140
618;GL;170;170;126;134;193;197;126;128;238;241;171;171;145;145;201;204;132;134
619;GL;170;176;126;126;199;199;126;130;238;241;171;177;145;145;201;204;132;140
620;GL;158;174;124;128;197;205;114;128;241;246;168;180;145;150;201;204;140;142
621;GL;170;172;106;126;197;199;126;130;238;241;177;180;143;145;201;201;134;134
622;GL;162;174;124;124;187;197;114;126;0;0;168;168;145;145;201;204;132;140
623;GL;170;174;114;126;193;199;128;130;241;241;168;168;145;145;201;201;142;146
624;GL;170;172;106;114;193;199;126;128;241;241;171;177;145;145;201;201;132;144
625;GL;170;170;124;126;197;199;114;116;241;241;168;171;145;145;201;204;134;134
626;GL;170;170;114;124;193;197;126;130;241;241;171;171;145;145;201;204;140;144
627;GL;170;174;124;124;187;199;126;128;241;241;168;171;145;162;201;201;132;140
628;GL;164;170;114;116;195;199;128;136;238;241;168;171;145;145;201;201;132;134
629;GL;170;176;114;126;193;199;116;126;241;241;168;177;145;150;201;201;134;134
630;GL;172;176;114;126;199;199;114;136;238;241;168;171;145;162;201;201;132;134
631;GL;164;166;116;126;193;199;128;128;241;241;168;180;145;145;201;201;134;146
632;GL;170;174;124;124;197;197;116;128;241;241;168;180;145;145;201;201;140;142
633;GL;174;176;106;134;197;207;116;128;238;241;177;180;143;145;204;204;136;140
634;GL;174;176;124;126;187;193;116;126;241;241;168;180;145;145;201;201;136;140
635;GL;170;176;106;114;197;197;126;126;241;241;171;171;143;145;201;201;134;142
636;GL;170;170;122;126;193;197;126;130;241;241;177;180;145;145;201;201;132;134
637;GL;174;176;114;126;197;197;116;128;241;241;171;171;143;145;201;204;134;134
638;GL;176;178;114;116;193;199;120;126;241;241;168;171;145;150;201;201;132;134
639;GL;172;174;124;126;187;199;124;128;241;246;168;177;145;145;201;207;134;140
640;GL;174;176;126;128;197;201;126;130;238;241;171;171;145;145;201;201;132;134
641;GL;170;172;106;126;197;199;126;130;238;241;177;180;143;145;201;201;134;134
642;GL;166;170;126;126;195;197;126;130;238;241;168;177;143;145;201;201;140;146
643;GL;166;174;106;124;197;201;126;130;238;246;168;171;145;145;201;204;132;140
644;GL;166;174;114;128;193;197;126;130;238;241;180;180;145;145;201;201;134;134
645;GL;170;172;126;134;199;199;126;126;241;241;168;171;143;145;201;204;134;146
646;GL;164;170;126;128;199;201;128;130;238;241;168;177;145;145;201;201;132;136
647;GL;170;176;124;128;197;201;126;128;241;241;171;171;143;145;201;201;140;142
648;GL;174;176;106;106;187;193;126;126;241;241;171;171;145;145;201;204;134;142
649;GL;174;176;106;114;195;197;116;120;241;241;171;171;143;145;201;201;134;142
650;GL;151;176;124;126;193;193;126;126;241;244;171;180;145;145;201;201;136;142
651;GL;174;176;124;126;197;199;116;126;241;244;171;180;143;145;201;204;140;144
652;GL;170;170;106;116;197;197;118;128;241;241;171;177;145;149;201;201;134;134
653;GL;176;176;106;124;193;201;126;126;238;241;168;180;143;145;201;204;140;142
654;GL;166;174;106;124;199;199;128;130;241;244;180;180;145;145;201;207;134;142
655;GL;174;178;106;134;187;197;130;130;238;241;168;177;145;145;201;204;134;140
656;GL;170;174;126;128;199;201;128;130;238;241;168;171;145;145;201;204;140;140
657;GL;170;170;126;126;193;197;126;126;241;241;168;168;145;145;201;201;134;136
658;GL;170;170;124;128;197;199;114;128;241;241;168;171;145;150;201;201;132;140
659;GL;170;172;114;126;187;199;126;130;241;241;168;168;145;150;201;207;132;140
660;GL;170;174;114;126;199;199;128;130;241;241;168;180;143;145;201;204;134;140
661;GL;162;176;124;126;197;197;118;128;241;241;171;180;145;145;204;207;140;144
662;GL;170;178;114;124;193;199;128;130;241;241;171;180;145;145;201;201;140;142
663;GL;162;164;106;128;197;197;116;126;241;241;171;180;145;145;201;201;134;142
664;GL;170;176;114;126;197;201;116;126;241;241;168;168;145;150;201;201;134;140
665;GL;170;176;116;118;195;201;118;130;241;241;171;171;145;145;201;201;134;134
666;GL;162;170;124;124;197;199;118;128;241;241;171;180;145;150;201;201;132;134
667;GL;170;170;116;126;199;199;126;130;241;241;168;171;145;145;201;201;132;134
668;GL;162;170;126;126;197;199;116;126;241;241;177;180;145;164;201;207;134;136
669;GL;170;170;116;124;197;197;126;126;241;241;171;177;145;150;201;201;132;142
670;GL;170;178;124;134;193;197;126;130;238;241;168;168;145;145;201;204;134;134
671;GL;174;174;124;128;187;199;116;128;241;241;168;180;145;150;195;204;134;140
672;GL;164;170;116;122;197;199;128;130;241;241;168;180;145;145;201;201;134;134
673;GL;172;172;114;126;197;199;118;126;241;241;180;180;143;145;201;201;140;144
674;GL;170;170;114;126;199;199;126;130;238;241;168;171;145;145;201;201;134;142
675;GL;166;170;114;126;197;199;128;132;241;241;168;171;143;145;201;201;134;142
676;GL;158;174;106;116;193;201;118;126;241;241;171;171;143;145;201;201;134;134
677;GL;166;166;116;124;197;207;114;126;241;241;171;171;143;143;201;201;134;142
678;GL;170;174;116;124;193;197;116;126;241;241;168;168;145;145;201;207;134;146
679;GL;170;170;126;134;193;199;116;126;241;241;171;171;145;145;201;207;134;134
680;GL;170;170;126;134;193;199;116;126;241;241;171;171;145;145;201;207;134;134
681;GL;174;188;124;126;197;197;126;128;241;241;171;180;145;145;201;207;134;140
682;GL;164;174;116;128;193;199;116;126;241;241;168;177;143;145;201;204;134;146
683;GL;172;174;114;126;187;199;128;128;238;241;180;180;145;145;201;201;132;134
684;GL;162;172;124;126;199;199;128;130;238;241;168;180;145;145;201;201;134;140
685;GL;170;174;114;128;199;201;118;126;241;241;171;180;150;162;201;201;134;142
686;GL;174;176;124;124;187;197;116;126;241;241;171;180;145;145;201;201;140;142
687;GL;174;176;124;124;193;197;118;120;241;241;171;180;143;145;201;201;142;142
688;GL;166;176;124;130;197;197;126;126;241;241;168;180;145;150;201;201;134;142
689;GL;170;170;124;126;197;197;126;126;241;246;168;180;145;145;201;201;134;134
690;GL;162;170;116;124;199;201;126;128;241;241;168;180;145;145;201;201;134;140
691;GL;170;170;114;126;197;199;126;126;241;241;171;177;143;145;201;201;134;134
692;GL;166;176;116;130;197;201;118;126;241;241;168;171;145;150;201;207;134;134
693;GL;174;174;114;126;193;201;114;126;241;241;171;171;143;145;201;201;136;136
694;GL;166;170;124;126;197;201;126;126;241;241;180;180;145;145;201;201;134;142
695;GL;170;170;106;126;193;195;126;128;241;246;171;177;143;145;201;201;134;134
696;GL;170;174;124;142;193;205;126;126;241;241;168;171;145;145;201;201;134;136
697;GL;166;178;124;134;187;193;118;130;241;241;168;180;145;145;201;204;132;142
698;GL;170;176;114;126;197;197;130;130;238;241;168;171;145;162;201;204;134;140
699;GL;170;176;114;114;197;201;128;130;241;241;168;171;150;162;201;204;132;140
700;GL;164;170;122;126;193;197;126;128;241;241;168;180;145;162;201;204;132;140
701;GL;170;172;122;126;197;197;126;126;241;241;168;171;145;150;201;204;132;140
702;GL;162;174;106;124;193;197;126;126;241;244;180;180;145;145;201;204;136;144
703;GL;151;178;126;126;197;199;126;128;241;241;168;180;145;150;201;201;134;136
704;GL;170;178;126;134;193;197;126;126;241;241;168;171;145;145;195;207;134;134
705;GL;170;172;124;126;193;197;120;126;238;241;171;180;145;145;201;201;0;0
706;GL;174;174;124;128;197;197;126;128;241;241;177;180;145;145;201;201;134;136
707;GL;174;174;124;128;197;197;126;128;241;241;177;180;145;145;201;201;134;136
708;Sel;170;172;124;124;197;199;116;126;241;241;171;171;150;150;201;201;132;134
709;Sel;164;170;106;114;199;201;124;126;241;241;168;177;143;150;201;201;134;134
710;Sel;158;170;124;124;197;197;116;126;241;241;168;171;143;145;195;201;140;142
711;Sel;170;172;126;126;195;197;128;128;241;241;177;177;145;145;201;201;134;134
712;Sel;150;176;126;126;197;199;124;128;241;241;168;168;145;149;201;201;132;142
713;Sel;174;178;114;126;195;207;116;124;238;241;168;180;145;149;201;201;132;134
714;Sel;162;170;130;138;187;197;128;128;241;241;168;171;145;164;201;204;134;134
715;Sel;176;178;124;128;197;197;126;130;241;241;177;177;143;143;195;201;134;134
716;Sel;164;170;124;126;195;197;126;126;241;241;171;171;143;145;201;201;132;140
717;Sel;170;170;106;128;193;197;126;126;238;241;171;180;145;145;201;201;134;140
718;Sel;170;178;106;106;193;197;126;126;241;241;171;177;143;149;201;201;134;142
719;Sel;170;170;106;142;193;201;126;130;241;241;171;177;145;145;201;201;134;134
720;Sel;170;172;124;124;197;197;126;132;241;241;168;168;145;149;201;201;134;142
721;Sel;170;170;126;126;197;197;126;128;238;241;168;177;145;145;201;201;142;144
722;Sel;170;170;114;126;193;197;118;126;241;241;168;177;145;149;201;201;134;146
723;Sel;162;170;114;126;199;201;116;128;241;241;171;171;145;145;201;204;140;140
724;Sel;170;176;114;128;187;205;120;126;241;241;171;180;143;145;201;201;132;132
725;Sel;170;170;114;124;197;197;128;128;241;241;168;171;143;145;201;204;132;142
726;Sel;174;178;114;126;187;201;116;126;241;241;168;171;145;147;201;201;132;134
727;Sel;172;176;114;124;205;209;126;126;241;241;171;177;143;145;201;201;132;134
728;Sel;150;178;116;124;197;197;126;132;241;241;168;177;145;145;201;204;140;146
729;Sel;170;176;124;128;197;201;116;126;241;241;171;171;145;149;201;201;134;140
730;Sel;170;178;124;142;193;197;116;128;241;241;168;180;145;145;201;204;134;134
731;Sel;170;178;106;110;193;197;128;128;241;241;168;168;145;149;201;201;134;142
732;Sel;164;170;124;126;197;205;124;126;241;241;168;168;143;145;201;204;132;134
733;Sel;170;172;124;142;187;199;124;130;241;241;168;177;145;145;201;201;132;134
734;Sel;158;170;130;144;197;199;124;128;241;241;171;171;143;145;201;201;132;134
735;Sel;162;170;106;124;193;197;124;128;241;241;171;171;145;145;201;201;140;142
736;Sel;170;172;114;126;195;207;128;130;241;241;168;171;145;145;201;201;134;134
737;Sel;170;174;114;124;195;205;116;126;241;241;168;171;145;149;201;201;132;134
738;Sel;170;176;116;116;193;199;114;126;238;241;168;171;143;145;201;201;134;134
739;Sel;158;172;126;134;193;207;114;128;241;241;168;168;145;149;201;201;132;142
740;Sel;170;176;126;126;195;209;116;128;241;241;168;168;143;145;201;204;132;134
741;Sel;172;178;124;126;193;193;120;124;241;241;171;180;145;145;201;204;132;134
742;Sel;170;178;124;124;195;197;126;128;241;241;168;171;143;145;201;201;134;142
743;Sel;150;166;128;134;201;205;126;128;241;241;168;171;145;145;201;204;134;140
744;Sel;170;170;106;124;193;201;124;128;241;241;168;171;145;145;201;201;140;142
745;Sel;150;170;120;126;193;197;114;126;238;241;168;171;145;149;201;201;132;140
746;Sel;166;170;114;128;193;197;114;116;241;241;171;177;145;145;201;201;140;142
747;Sel;170;176;114;114;193;199;114;126;241;241;171;177;145;162;201;201;134;140
748;Sel;170;170;106;126;197;197;124;126;241;241;168;168;149;149;201;201;132;144
749;Sel;164;170;124;126;197;207;126;126;241;241;168;177;149;149;201;201;132;134
750;Sel;170;172;124;124;197;197;126;128;241;241;171;171;143;145;201;201;132;134
751;Sel;170;172;126;142;197;197;126;128;241;241;168;171;145;149;201;201;132;134
752;Sel;170;174;126;126;197;199;126;128;241;241;168;168;143;162;201;204;134;134
753;Sel;170;172;124;126;205;205;126;126;241;241;168;180;145;145;201;201;132;134
754;Sel;170;176;124;126;193;201;118;128;238;241;168;168;145;145;201;204;132;140
755;Sel;174;176;126;128;193;199;124;128;241;241;168;180;149;149;201;201;134;144
756;Sel;170;170;124;130;201;205;126;128;241;241;168;171;143;145;201;204;132;146
757;Sel;172;172;136;142;193;205;126;128;241;241;168;171;149;149;195;201;134;134
758;Sel;170;170;126;134;193;197;128;132;241;241;171;180;145;149;201;204;134;146
759;Sel;170;176;124;126;193;193;126;128;241;241;168;168;149;149;201;201;134;142
760;Sel;170;178;112;144;187;197;126;128;241;241;168;177;149;149;201;204;140;140
761;Sel;172;176;126;126;197;201;126;126;241;241;168;180;145;149;201;201;132;140
762;Sel;170;176;106;114;201;207;124;132;241;241;168;168;145;149;201;201;134;140
763;Sel;170;176;114;126;193;205;128;128;241;241;177;180;145;149;201;201;134;140
764;Sel;170;170;126;136;193;197;126;128;241;241;171;171;145;149;201;207;132;134
765;Sel;172;176;106;114;207;209;118;126;241;241;168;168;145;149;201;204;134;134
766;Sel;172;176;126;126;197;201;126;126;241;241;168;180;145;149;201;201;132;140
767;Sel;166;170;124;130;193;199;114;130;241;241;171;180;145;149;201;201;134;134
768;Sel;170;170;124;134;195;197;126;128;241;241;168;171;145;145;201;201;134;134
769;Sel;174;176;114;126;187;197;124;126;241;241;171;177;143;145;201;201;134;140
770;Sel;166;172;106;126;187;201;126;126;241;241;168;171;145;149;201;204;140;146
771;Sel;150;172;116;124;197;199;126;126;241;241;168;171;145;145;201;201;134;142
772;Sel;172;176;106;126;193;199;116;126;241;241;171;171;143;145;201;201;132;142
773;Sel;176;176;116;124;199;201;126;134;241;241;168;171;143;145;201;201;134;134
774;Sel;174;176;116;130;187;199;126;128;241;243;171;180;145;145;201;201;134;146
775;Sel;174;176;114;124;197;205;116;118;241;241;168;168;145;145;201;204;134;142
776;Sel;170;178;124;142;197;197;126;126;241;241;171;177;145;145;201;201;134;134
777;Sel;170;170;124;126;195;197;128;132;241;241;168;180;149;149;201;201;134;142
778;Sel;170;176;116;124;197;199;114;126;241;241;171;171;145;149;201;201;132;146
779;Sel;170;176;116;126;187;199;120;126;241;241;171;171;143;145;201;201;134;146
780;Sel;172;174;114;114;205;207;116;128;241;241;168;171;145;145;201;201;134;146
781;Sel;170;174;114;116;193;199;126;128;241;243;168;171;143;145;201;201;134;134
782;Sel;170;174;124;130;201;201;118;124;241;241;168;177;145;149;201;201;134;140
783;Sel;164;178;124;126;197;201;126;126;241;241;171;177;149;164;201;201;132;134
784;Sel;170;170;124;124;197;205;128;130;0;0;168;171;145;145;201;207;134;140
785;Sel;170;176;116;126;199;199;126;128;241;241;171;171;145;145;201;201;134;146
786;Sel;170;170;114;128;197;201;126;126;241;241;168;171;145;145;201;204;138;140
787;Sel;170;172;114;124;197;205;126;128;241;241;171;171;149;149;201;201;134;136
788;Sel;164;176;124;124;197;205;124;128;241;241;168;180;145;145;201;201;134;146
789;Sel;170;174;130;142;197;197;126;130;241;241;168;177;145;145;201;201;134;134
790;Sel;172;178;126;134;199;205;114;132;241;241;168;168;143;149;195;201;132;132
791;Sel;170;176;106;114;193;197;116;124;241;241;171;180;145;149;201;204;132;134
792;Sel;174;176;126;126;193;205;124;132;241;241;171;180;147;149;201;201;132;134
793;Sel;170;170;114;126;197;207;118;128;238;241;168;180;143;147;201;201;134;134
794;Sel;162;176;126;128;199;199;126;128;241;241;171;180;145;147;201;201;142;142
795;Sel;170;174;128;128;195;199;128;128;241;241;168;180;145;145;201;204;134;142
796;Sel;170;170;114;130;193;199;116;126;241;241;177;180;145;147;201;201;132;134
797;Sel;172;176;114;128;197;197;126;132;241;241;168;168;145;145;201;201;132;146
798;Sel;158;176;128;128;199;199;126;128;241;243;171;180;145;149;201;201;132;142
799;Sel;170;176;126;128;193;205;126;128;241;241;177;177;145;149;201;201;132;134
800;Sel;170;176;128;130;199;199;126;128;241;241;180;180;147;149;201;201;132;132
801;Sel;170;176;126;126;193;205;126;126;241;243;168;168;143;145;201;201;134;144
802;Sel;170;176;126;126;199;205;126;128;241;241;177;180;143;145;201;201;140;142
803;Sel;170;176;126;130;197;199;128;128;241;241;168;180;145;149;201;201;132;142
804;Sel;172;174;126;130;197;197;120;126;241;241;177;177;145;145;201;201;132;134
805;Sel;170;172;126;126;199;205;114;126;238;241;171;177;145;145;201;201;132;134
806;Sel;172;174;110;124;193;197;118;118;241;241;168;180;143;145;201;201;134;134
807;Sel;170;172;126;126;199;199;114;118;241;241;168;171;145;145;201;201;132;134
808;CaHa;166;176;114;134;197;205;126;128;241;241;171;171;145;145;201;204;134;134
809;CaHa;174;178;126;134;197;207;126;126;241;244;171;180;145;145;201;204;134;142
810;CaHa;170;170;126;142;193;197;124;126;238;241;168;177;145;145;201;201;132;134
811;CaHa;164;174;122;124;187;197;126;128;241;241;171;177;145;145;201;204;134;140
812;CaHa;170;174;114;126;197;197;118;126;241;241;177;180;145;149;201;204;140;142
813;CaHa;172;174;124;126;205;205;126;128;241;241;171;171;145;145;201;201;140;144
814;CaHa;170;170;106;124;197;201;126;128;241;241;168;177;145;145;201;204;134;134
815;CaHa;170;172;114;114;195;197;124;126;241;241;171;171;145;145;204;207;134;142
816;CaHa;172;176;124;124;187;197;122;128;241;241;171;177;145;145;201;204;132;144
817;CaHa;150;170;122;124;197;201;124;128;241;241;171;177;143;149;201;201;134;134
818;CaHa;174;176;126;126;197;201;124;126;241;241;171;180;143;149;201;201;132;142
819;CaHa;170;178;134;134;197;207;128;128;238;241;168;168;145;145;201;201;134;142
820;CaHa;164;176;114;130;193;201;128;128;241;241;168;171;145;145;195;201;142;144
821;CaHa;170;172;124;124;195;211;124;130;241;241;168;171;145;149;201;201;134;144
822;CaHa;170;170;106;140;187;197;124;126;238;241;177;180;143;150;201;201;134;134
823;CaHa;170;176;108;126;193;205;126;128;241;241;171;180;143;145;204;204;132;134
824;CaHa;170;170;114;126;197;197;126;128;241;243;171;177;145;145;201;204;134;140
825;CaHa;170;170;114;126;197;199;126;126;241;243;171;171;145;145;201;207;132;134
826;CaHa;170;170;106;106;193;199;128;128;241;241;168;171;145;145;201;204;134;134
827;CaHa;170;170;126;132;193;197;126;128;241;241;168;168;145;145;201;207;134;142
828;CaHa;170;170;126;126;187;197;118;124;241;241;168;171;143;149;201;201;132;142
829;CaHa;170;170;106;134;193;197;120;128;241;241;168;177;145;149;201;201;132;134
830;CaHa;176;178;126;130;193;197;128;130;241;241;168;180;143;145;201;204;134;140
831;CaHa;170;170;106;126;193;197;126;128;241;241;168;168;145;149;201;204;132;140
832;CaHa;170;170;106;136;197;197;126;130;241;241;168;180;143;143;195;204;134;134
833;CaHa;170;178;114;126;199;199;126;128;238;241;171;171;145;145;201;207;132;134
834;CaHa;174;176;124;142;195;197;126;128;241;241;171;171;145;145;201;201;142;142
835;CaHa;170;178;114;132;193;199;126;126;241;244;171;177;145;149;201;207;134;134
836;CaHa;150;176;126;134;193;197;118;124;241;241;171;171;145;147;201;201;134;144
837;CaHa;170;174;106;126;195;197;126;128;241;241;168;171;143;145;201;204;140;142
838;CaHa;170;170;124;126;201;201;114;128;241;241;177;180;143;149;201;201;134;134
839;CaHa;170;170;114;126;195;197;126;128;241;241;171;171;145;150;201;201;134;146
840;CaHa;150;170;106;114;193;193;124;128;241;241;168;168;145;147;201;207;134;140
841;CaHa;176;176;106;106;193;201;128;128;241;241;168;177;149;149;201;201;134;134
842;CaHa;176;178;114;124;187;199;126;128;241;243;171;171;145;145;201;204;134;134
843;CaHa;170;170;112;124;197;197;128;128;241;241;180;180;145;149;201;207;134;140
844;CaHa;170;176;124;126;195;195;118;128;241;241;171;177;149;149;201;201;134;142
845;CaHa;164;170;114;128;193;201;118;124;241;241;168;171;143;149;201;204;134;140
846;CaHa;170;178;130;142;193;201;126;132;238;241;168;171;145;145;195;204;134;148
847;CaHa;166;176;114;142;193;197;126;128;241;241;168;171;145;145;201;201;134;136
848;CaHa;172;174;106;126;187;207;124;132;241;241;168;177;143;143;201;204;132;134
849;CaHa;170;170;114;136;193;197;126;128;241;241;168;171;149;150;201;204;134;134
850;CaHa;176;178;114;126;193;199;126;126;241;241;168;168;145;149;201;201;134;142
851;CaHa;170;174;124;134;195;199;124;126;241;241;168;171;147;149;201;204;134;134
852;CaHa;166;170;124;126;187;205;126;128;241;241;168;168;143;149;201;201;134;134
853;CaHa;172;176;106;116;193;199;124;130;241;241;168;168;149;150;201;204;132;134
854;CaHa;176;176;106;124;199;201;128;130;241;241;168;171;149;150;201;204;134;134
855;CaHa;170;176;106;114;201;205;124;130;241;241;168;168;145;145;201;207;134;140
856;CaHa;170;176;124;126;195;195;126;130;241;243;177;177;145;149;201;201;134;140
857;CaHa;176;176;126;134;193;197;128;128;241;241;168;171;145;145;201;204;134;134
858;CaHa;164;170;106;116;195;195;128;128;241;241;171;177;149;149;201;204;132;134
859;CaHa;162;172;114;124;197;197;126;130;238;241;171;180;143;145;201;204;134;144
860;CaHa;164;170;124;124;197;197;124;132;238;241;171;171;145;149;201;201;136;140
861;CaHa;170;170;114;114;197;205;116;128;241;241;177;180;143;149;201;204;134;134
862;CaHa;176;176;114;130;197;201;126;126;241;241;168;171;145;145;201;201;134;140
863;CaHa;170;176;124;124;193;195;126;128;241;244;177;180;145;147;201;204;132;140
864;CaHa;166;170;126;130;197;201;124;126;241;241;171;171;145;149;201;201;132;140
865;CaHa;170;176;124;126;197;205;126;128;241;241;171;180;145;145;201;201;132;142
866;CaHa;170;174;106;134;187;207;126;128;241;241;168;171;145;145;201;204;132;140
867;CaHa;170;170;106;114;193;197;124;124;241;244;171;171;143;143;201;204;132;134
868;CaHa;164;164;124;128;199;207;116;128;241;241;168;180;143;145;201;201;140;142
869;CaHa;174;176;106;124;197;201;128;130;241;241;168;177;143;145;201;204;134;134
870;CaHa;170;170;114;128;193;199;126;126;241;241;171;177;145;145;201;207;132;134
871;CaHa;150;170;124;126;195;197;124;128;238;241;180;180;145;164;201;204;134;144
872;CaHa;150;170;114;124;197;207;126;128;241;241;168;180;145;149;201;207;134;140
873;CaHa;170;174;114;114;193;199;126;128;241;241;171;180;145;145;201;207;132;140
874;CaHa;170;170;114;124;197;201;114;124;241;241;168;180;143;145;201;204;134;140
875;CaHa;170;176;114;134;195;197;126;128;241;241;168;171;149;149;201;201;134;142
876;CaHa;170;170;114;132;193;193;116;128;241;241;168;180;145;145;204;207;142;146
877;CaHa;158;170;114;126;197;205;126;136;241;243;171;171;145;145;201;201;134;142
878;CaHa;170;170;130;150;187;197;124;126;241;241;168;177;143;162;201;201;134;142
879;CaHa;170;170;106;126;193;199;128;130;241;241;168;171;145;149;201;201;134;134
880;CaHa;170;170;114;126;201;205;124;128;241;241;171;177;145;149;201;204;132;134
881;CaHa;170;170;116;124;193;197;128;128;241;241;168;180;145;149;201;201;134;142
882;CaHa;170;176;106;124;193;197;122;126;241;241;171;177;143;164;201;204;140;140
883;CaHa;172;176;124;126;193;197;128;128;241;241;168;177;145;145;201;204;132;144
884;CaHa;170;176;106;106;197;199;124;126;241;241;168;168;145;164;201;204;140;142
885;CaHa;170;170;114;138;199;199;128;128;241;241;171;171;145;145;201;204;134;142
886;CaHa;162;174;124;126;197;205;124;128;241;241;168;168;145;149;201;204;134;134
887;CaHa;166;170;124;124;197;205;128;128;241;241;168;168;145;145;201;201;132;140
888;CaHa;158;178;114;126;197;197;126;126;241;241;168;180;145;145;201;204;134;142
889;CaHa;170;172;114;114;193;197;126;128;241;241;168;171;143;145;201;204;134;142
890;CaHa;170;172;126;134;201;205;126;126;241;241;171;171;145;149;201;201;134;142
891;CaHa;170;176;126;130;195;199;116;126;241;241;168;171;145;145;201;207;132;134
892;CaHa;170;176;106;126;187;201;118;126;241;241;171;180;149;149;201;201;140;142
893;CaHa;170;170;114;124;199;205;126;126;241;241;168;177;143;145;201;201;140;142
894;CaHa;158;176;106;124;193;201;122;126;0;0;177;180;143;149;201;201;132;140
895;CaHa;172;176;106;124;187;197;126;128;241;241;180;180;145;162;201;201;134;140
896;CaHa;176;176;124;124;193;201;126;130;241;241;168;168;145;145;201;201;140;142
897;CaHa;170;178;124;126;195;195;114;128;238;241;168;171;145;164;201;201;134;140
898;CaHa;166;170;126;130;197;197;116;126;241;241;171;171;145;149;201;201;134;134
899;CaHa;170;174;114;134;197;201;126;128;241;241;171;171;145;164;201;201;134;142
900;CaHa;170;176;124;126;193;195;116;128;241;241;168;177;145;145;201;201;140;142
901;CaHa;172;176;126;126;195;195;124;126;241;241;171;177;145;145;201;201;134;134
902;CaHa;170;174;114;114;195;197;126;132;241;241;168;171;143;145;201;207;134;140
903;CaHa;170;176;106;114;193;193;128;128;241;241;171;180;145;147;201;207;134;134
904;CaHa;170;170;130;134;195;207;128;128;241;241;168;171;145;145;201;201;134;142
905;CaHa;170;170;114;124;197;205;128;128;241;241;171;171;145;145;201;201;134;146
906;CaHa;170;170;124;134;197;205;128;128;241;244;177;177;145;145;201;201;134;142
907;CaHa;166;170;114;126;197;197;126;128;241;241;168;171;145;145;201;201;132;134
908;KS;170;172;124;124;195;197;116;122;241;241;168;180;143;145;201;201;132;134
909;KS;170;170;124;142;193;197;116;124;241;241;168;177;145;145;201;207;134;148
910;KS;170;178;124;128;193;197;124;126;241;241;168;171;143;147;201;204;134;142
911;KS;170;170;122;124;199;205;122;124;241;241;171;180;145;149;201;201;132;134
912;KS;170;172;124;126;193;205;114;132;238;241;171;177;145;145;201;201;132;132
913;KS;158;170;124;126;193;197;114;126;238;241;168;171;145;145;201;201;134;142
914;KS;170;178;124;126;193;197;126;126;241;241;171;171;145;145;201;204;132;132
915;KS;158;176;126;142;197;201;114;126;241;241;168;171;143;145;201;204;134;134
916;KS;170;174;114;126;193;193;116;128;241;241;168;177;143;143;201;204;134;134
917;KS;170;170;114;126;193;197;128;130;241;241;171;177;145;145;201;204;142;148
918;KS;164;174;124;124;197;197;124;124;241;241;168;171;145;145;201;204;142;148
919;KS;170;176;126;132;197;205;124;128;241;241;168;171;149;149;201;201;134;134
920;KS;170;178;126;128;197;205;126;126;238;241;171;171;145;145;201;201;132;142
921;KS;158;158;124;126;193;199;114;122;241;241;171;171;143;143;201;207;134;142
922;KS;172;176;124;128;197;205;116;126;0;0;168;177;145;145;201;201;132;142
923;KS;158;176;124;128;197;197;126;128;241;241;168;171;149;149;201;201;132;134
924;KS;170;172;124;126;197;199;122;126;238;241;168;171;145;145;201;201;134;148
925;KS;170;176;124;126;193;195;126;128;238;241;168;171;145;145;201;201;132;140
926;KS;174;176;126;126;187;197;114;114;241;241;171;177;145;147;201;201;134;142
927;KS;174;178;114;124;193;197;126;128;241;241;171;171;145;145;201;201;134;142
928;KS;170;170;126;126;197;197;114;126;241;241;171;171;145;147;201;201;132;134
929;KS;170;170;114;124;193;199;122;124;241;241;168;177;145;145;201;201;134;134
930;KS;170;178;114;124;197;197;126;128;241;241;171;177;145;145;201;204;134;134
931;KS;170;178;130;132;187;197;126;128;241;241;171;171;145;150;201;204;134;134
932;KS;166;178;124;124;195;197;124;128;241;241;168;168;145;145;201;201;132;134
933;KS;172;178;142;142;193;195;124;126;241;241;171;177;145;145;201;204;134;142
934;KS;170;176;124;124;193;197;114;126;241;241;168;177;145;145;201;204;134;134
935;KS;170;176;124;124;187;199;126;130;241;241;171;171;145;149;201;204;134;134
936;KS;170;174;124;128;197;205;124;132;241;244;168;171;143;145;201;207;134;134
937;KS;176;178;124;124;193;205;124;128;241;241;168;177;145;145;201;201;134;134
938;KS;170;172;114;126;197;197;118;130;238;241;171;171;145;149;201;204;132;140
939;KS;170;170;124;126;195;197;126;126;241;241;168;180;145;145;201;201;134;140
940;KS;170;170;124;126;197;197;124;128;241;241;171;171;145;145;201;201;134;140
941;KS;170;170;124;126;193;201;124;124;241;241;168;177;145;145;201;201;134;134
942;KS;164;170;124;126;193;195;116;126;241;241;168;171;145;162;201;207;132;148
943;KS;170;174;114;128;193;197;122;124;241;241;168;171;145;145;204;207;132;134
944;KS;170;174;124;128;195;197;120;128;241;241;171;177;145;149;201;207;132;132
945;KS;170;178;124;124;195;201;110;126;241;241;168;171;145;145;201;204;140;142
946;KS;170;170;124;124;197;205;124;128;241;241;171;171;145;149;201;201;132;134
947;KS;166;170;114;124;197;201;110;110;241;241;171;177;143;145;201;204;132;140
948;KS;170;178;124;124;197;197;122;126;241;241;168;171;145;145;201;201;132;132
949;KS;166;178;124;128;193;197;122;126;241;241;168;171;143;143;201;204;134;134
950;KS;170;176;126;142;195;197;124;128;238;241;168;171;143;145;201;201;134;134
951;KS;170;170;124;126;193;197;124;128;241;241;168;180;145;149;201;201;132;132
952;KS;170;170;126;126;197;197;124;126;241;241;168;168;145;145;201;201;132;134
953;KS;172;176;124;150;197;197;118;126;241;241;171;180;145;145;201;201;134;134
954;KS;172;178;126;128;197;197;114;124;241;241;168;177;145;145;201;201;132;134
955;KS;166;176;122;124;197;197;122;126;238;241;168;171;150;150;201;201;134;142
956;KS;170;178;124;124;197;199;122;124;241;241;168;168;143;145;201;204;132;142
957;KS;158;170;124;124;193;201;122;122;241;241;168;171;143;145;201;201;134;134
958;KS;170;174;124;126;199;205;122;126;241;241;168;171;145;145;201;201;132;132
959;KS;170;174;124;124;197;199;122;128;241;241;168;168;145;145;201;201;132;134
960;KS;176;178;124;124;197;197;122;128;241;241;171;177;145;145;201;201;134;136
961;KS;170;170;124;128;193;195;122;126;241;241;171;171;145;145;201;204;134;142
962;KS;158;170;114;134;195;197;114;126;241;241;168;180;145;145;201;201;132;134
963;KS;170;174;124;134;193;197;124;126;241;241;168;168;145;149;201;201;134;140
964;KS;170;178;124;126;193;197;124;126;241;241;171;171;143;143;201;201;132;134
965;KS;164;170;124;124;197;199;122;124;238;241;168;171;145;145;201;204;132;132
966;KS;170;178;106;126;193;197;124;126;241;241;168;171;145;145;201;201;132;134
967;KS;172;178;116;124;193;195;124;126;241;241;168;171;143;145;201;201;134;134
968;KS;170;174;122;132;193;197;124;126;241;241;168;180;145;145;201;201;134;142
969;KS;170;178;116;124;193;205;118;126;241;241;168;171;143;145;201;201;134;142
970;KS;170;178;112;126;193;195;124;130;241;241;168;168;145;145;204;204;132;142
971;KS;170;172;114;124;193;197;124;128;241;241;168;177;145;145;201;201;134;142
972;KS;150;170;126;142;193;199;114;126;241;241;171;180;145;149;201;201;132;134
973;KS;174;176;124;124;193;207;116;128;241;241;168;171;145;149;201;201;132;134
974;KS;170;172;106;124;197;197;124;126;241;241;171;171;143;164;201;201;134;140
975;KS;170;170;134;136;197;201;126;126;241;241;171;180;145;145;201;201;134;134
976;KS;170;174;116;124;193;197;126;128;238;241;168;171;145;145;201;201;134;134
977;KS;170;176;116;124;197;199;124;128;241;241;168;171;147;149;201;207;134;140
978;KS;170;174;124;134;193;197;128;128;238;241;168;171;143;149;201;201;132;132
979;KS;170;174;124;126;187;197;124;126;238;241;168;168;145;145;201;201;132;132
980;KS;170;178;106;126;197;197;116;126;241;241;168;168;145;145;201;204;140;142
981;KS;170;174;124;128;195;199;110;116;241;241;168;168;145;145;201;201;134;134
982;KS;170;174;126;126;193;195;116;126;241;241;168;168;145;145;201;204;132;134
983;KS;158;170;124;124;193;197;126;126;241;241;168;177;145;145;201;201;132;132
984;KS;166;170;114;124;193;199;122;124;241;241;171;177;145;145;201;201;134;140
985;KS;176;178;124;126;193;199;124;132;241;241;171;171;145;145;201;201;132;134
986;KS;170;170;124;124;197;207;114;126;241;241;171;171;145;149;201;201;134;134
987;KS;170;174;114;124;187;205;116;128;241;241;168;168;143;145;201;204;132;134
988;KS;170;170;106;114;193;205;122;126;238;241;171;171;145;149;201;201;132;148
989;KS;164;174;124;126;197;205;124;126;241;241;171;171;145;145;201;204;132;132
990;KS;166;178;114;124;197;197;126;128;241;246;168;168;145;149;201;204;134;136
991;KS;166;172;124;126;197;201;114;126;0;0;168;168;145;145;201;201;134;134
992;KS;170;174;124;128;201;205;118;126;238;241;171;171;145;145;201;204;132;136
993;KS;166;170;124;126;197;197;126;130;241;241;168;171;143;145;201;201;134;134
994;KS;170;174;106;126;197;205;126;128;238;241;171;171;145;145;201;201;132;132
995;KS;170;170;124;126;193;195;122;124;241;241;168;171;145;145;201;201;134;134
996;KS;150;174;0;0;201;205;126;126;241;241;177;180;145;145;195;201;134;142
997;KS;170;174;126;126;197;197;116;128;241;241;168;171;145;147;201;201;134;142
998;KS;170;176;114;134;197;197;126;126;241;241;168;171;145;147;201;201;132;134
999;KS;178;178;124;130;197;197;116;128;241;241;168;171;143;149;201;201;134;134
1000;KS;170;174;108;124;193;197;124;126;241;241;168;177;143;145;201;204;134;142
1001;KS;170;178;124;126;193;197;126;126;241;241;168;171;145;149;201;201;134;140
1002;KS;170;170;126;134;197;199;124;124;241;241;168;171;145;145;201;201;132;142
1003;KS;170;178;114;124;195;197;122;128;238;241;168;171;145;149;201;201;132;134
1004;KS;170;178;124;128;193;201;122;128;241;241;171;171;145;145;201;201;132;134
1005;KS;170;174;124;128;193;197;124;124;241;241;168;168;145;147;201;201;132;134
1006;KS;170;178;114;124;193;197;116;122;241;241;168;171;145;145;204;204;132;132
1007;KS;170;170;124;126;193;197;126;126;241;241;168;171;145;145;201;201;132;142
1008;KL;170;176;124;126;193;193;116;126;241;241;168;171;143;162;201;201;134;134
1009;KL;170;176;114;126;197;205;116;126;238;241;171;177;145;145;201;201;134;142
1010;KL;170;170;124;138;197;205;122;128;241;241;171;177;143;149;201;201;142;142
1011;KL;170;178;126;126;193;195;116;128;241;241;177;177;145;149;201;201;134;134
1012;KL;174;178;124;126;193;195;116;128;241;241;168;171;143;145;201;201;134;142
1013;KL;170;170;124;124;195;205;116;124;241;241;168;171;145;145;201;201;134;134
1014;KL;170;178;114;124;195;211;124;128;241;241;168;177;145;145;201;204;134;142
1015;KL;170;176;114;124;197;205;126;128;241;244;168;171;145;145;201;201;134;142
1016;KL;176;178;124;124;197;197;128;128;241;241;168;171;143;145;201;201;134;140
1017;KL;174;174;116;126;193;197;128;128;241;241;171;177;145;145;201;201;132;134
1018;KL;174;176;126;130;193;197;114;122;241;241;171;180;145;145;201;201;132;134
1019;KL;170;170;126;142;197;207;116;130;241;241;168;168;145;145;201;201;134;134
1020;KL;170;178;124;134;197;197;124;128;241;241;168;171;143;145;204;204;134;136
1021;KL;170;178;124;124;193;197;114;128;241;241;171;171;145;145;201;201;134;134
1022;KL;170;178;124;124;195;205;116;122;241;241;168;177;145;145;201;204;132;142
1023;KL;174;176;124;126;193;205;126;126;238;241;168;171;143;145;201;201;132;134
1024;KL;166;170;124;124;193;197;110;122;241;241;168;180;145;145;201;204;134;134
1025;KL;170;176;124;126;197;197;122;128;241;241;168;180;145;145;201;201;132;134
1026;KL;170;170;114;124;193;193;116;122;241;241;168;171;149;149;201;201;132;142
1027;KL;170;170;114;138;197;205;128;128;241;241;171;171;145;145;201;201;134;142
1028;KL;170;178;124;142;197;197;118;128;241;241;168;168;145;145;201;201;134;134
1029;KL;170;174;114;114;205;205;128;128;241;241;171;171;149;149;201;201;132;134
1030;KL;166;172;124;136;201;205;116;126;241;241;168;171;145;149;201;201;134;140
1031;KL;174;174;124;138;197;201;126;128;241;241;171;171;145;145;201;201;132;134
1032;KL;170;170;114;124;193;205;116;126;238;241;171;171;145;145;201;201;134;140
1033;KL;170;170;114;124;193;205;122;128;241;241;168;171;149;149;201;201;134;134
1034;KL;170;178;124;128;197;205;126;128;241;241;168;171;145;149;201;201;134;134
1035;KL;170;174;124;128;193;205;116;126;241;241;168;171;143;149;201;204;134;134
1036;KL;170;170;114;126;197;205;128;128;241;241;171;180;145;149;201;204;134;142
1037;KL;170;172;114;126;193;197;126;128;241;241;171;171;145;149;201;201;134;136
1038;KL;170;170;126;128;195;197;122;124;241;241;168;177;145;145;201;204;132;132
1039;KL;170;170;124;126;197;205;126;126;238;241;168;177;149;149;201;204;132;134
1040;KL;174;178;124;126;193;197;126;126;241;241;168;171;143;145;201;201;134;142
1041;KL;172;178;114;126;193;197;128;130;241;241;168;180;145;145;201;201;132;134
1042;KL;174;178;114;124;195;195;124;128;241;241;171;177;143;145;201;201;132;142
1043;KL;170;174;114;126;193;193;126;128;241;241;171;177;145;145;201;201;132;132
1044;KL;170;178;114;114;197;197;126;128;241;241;171;171;143;145;201;201;132;134
1045;KL;170;176;124;126;195;197;126;128;241;241;171;171;143;145;201;201;142;146
1046;KL;174;176;124;126;193;197;126;128;241;241;168;171;143;145;201;201;134;134
1047;KL;170;174;126;126;193;197;124;128;241;241;168;171;145;149;201;201;134;134
1048;KL;170;178;114;126;195;197;128;128;241;241;168;171;143;143;201;201;132;132
1049;KL;170;170;114;118;195;205;126;128;241;241;171;171;145;149;201;201;134;140
1050;KL;170;178;124;126;195;205;128;128;241;241;168;177;143;145;201;201;134;142
1051;KL;170;178;114;124;195;197;114;122;241;241;168;177;145;149;201;201;132;134
1052;KL;170;178;114;114;195;205;124;128;241;241;168;168;145;145;201;201;134;134
1053;KL;170;178;106;124;193;195;116;124;241;241;171;171;145;145;201;201;132;134
1054;KL;170;174;126;136;197;205;126;128;241;241;171;171;145;145;201;204;134;134
1055;KL;174;178;124;124;195;207;128;128;241;241;168;168;145;145;201;201;134;134
1056;KL;170;174;114;126;193;197;126;128;241;241;168;177;145;145;201;201;142;142
1057;KL;170;170;114;124;193;193;122;124;241;241;168;171;145;145;201;201;134;134
1058;KL;158;170;124;126;193;205;114;128;241;241;168;168;145;145;201;201;134;140
1059;KL;170;172;114;126;195;197;128;128;241;241;171;171;145;145;201;207;134;140
1060;KL;170;178;124;126;195;205;124;128;241;241;168;171;143;145;201;201;134;134
1061;KL;170;170;114;124;193;197;128;130;241;241;168;171;143;145;201;201;132;134
1062;KL;170;170;114;124;193;197;128;130;241;241;168;171;143;145;201;201;132;134
1063;KL;170;170;114;124;193;197;128;130;241;241;168;171;143;145;201;201;132;134
1064;KL;170;170;124;130;193;197;128;130;241;241;168;171;145;145;201;201;134;134
1065;KL;170;170;114;124;197;205;116;128;241;241;168;171;145;145;201;204;134;134
1066;KL;170;170;124;124;197;205;116;128;241;241;168;168;145;145;201;201;134;142
1067;KL;170;178;114;124;193;197;116;128;241;241;168;168;143;145;201;201;134;142
1068;KL;170;170;124;130;193;197;128;130;241;241;168;171;145;145;201;201;134;134
1069;KL;170;170;124;126;193;197;124;128;241;241;168;168;145;149;201;204;132;142
1070;KL;164;170;124;126;197;201;128;128;241;241;168;171;143;145;201;201;134;134
1071;KL;174;178;124;124;197;197;122;128;241;241;168;168;145;149;201;201;132;134
1072;KL;170;170;114;114;205;205;126;126;241;241;168;180;145;145;201;201;136;140
1073;KL;174;174;126;126;193;197;116;126;241;241;168;171;145;145;201;201;132;142
1074;KL;170;178;114;114;195;205;126;130;238;241;168;177;145;149;201;201;132;134
1075;KL;170;170;114;124;195;197;126;128;241;241;171;177;145;145;201;201;134;142
1076;KL;174;178;124;124;197;197;126;128;241;241;168;171;143;145;201;201;134;134
1077;KL;170;170;106;124;193;205;114;126;241;241;168;168;145;149;204;204;134;134
1078;KL;150;170;106;126;205;205;126;128;238;241;168;171;143;145;201;201;134;134
1079;KL;170;174;114;126;197;205;126;126;238;241;171;171;145;149;201;201;132;132
1080;KL;170;174;114;124;193;205;128;132;241;241;168;177;143;149;201;204;134;134
1081;KL;170;174;114;134;195;205;114;128;241;241;177;177;143;145;195;204;134;134
1082;KL;170;170;124;124;193;205;128;128;241;241;168;168;145;149;201;204;134;140
1083;KL;170;176;126;126;197;205;116;124;241;241;168;168;143;149;201;204;132;134
1084;KL;164;170;124;136;197;205;126;128;241;241;171;177;145;145;201;204;134;134
1085;KL;170;170;124;126;193;197;116;128;241;241;168;168;145;149;201;204;134;134
1086;KL;170;174;124;124;193;195;126;128;241;241;177;177;145;145;201;201;134;134
1087;KL;170;178;114;124;195;195;128;128;241;241;171;171;145;145;201;201;134;142
1088;KL;170;170;124;134;197;211;116;128;241;241;177;180;145;149;201;204;134;142
1089;KL;170;172;114;124;197;197;126;128;238;241;177;180;145;145;201;201;132;142
1090;KL;162;170;114;114;197;205;124;128;241;241;171;177;143;145;201;201;134;142
1091;KL;158;176;106;126;187;195;126;128;241;241;168;177;145;145;201;201;134;142
1092;KL;174;178;124;128;195;197;116;128;241;241;168;168;143;145;201;201;134;134
1093;KL;174;176;114;124;193;195;126;128;241;241;168;177;145;149;201;201;134;142
1094;KL;170;172;124;130;197;197;116;128;241;241;168;168;145;149;201;201;134;134
1095;KL;170;170;114;130;197;199;116;116;241;241;168;168;143;145;201;201;134;134
1096;KL;170;178;124;124;193;195;122;128;241;241;171;180;145;145;201;201;134;134
1097;KL;170;174;106;124;193;197;126;128;241;241;168;180;145;145;201;204;132;142
1098;KL;170;170;126;132;195;197;124;132;241;241;171;171;143;145;201;204;134;142
1099;KL;170;170;114;124;197;197;114;116;241;241;168;168;145;145;201;204;132;134
1100;KL;170;170;114;124;193;197;116;124;241;241;171;171;143;145;201;201;132;134
1101;KL;170;174;114;124;195;199;122;128;241;244;168;168;145;145;201;201;132;134
1102;KL;150;170;114;128;193;201;116;122;241;241;171;177;145;145;201;204;134;142
1103;KL;164;170;114;126;197;205;126;128;241;241;171;171;145;145;201;201;132;134
1104;KL;170;174;126;126;193;205;116;126;241;241;168;171;145;145;201;201;134;134
1105;KL;170;176;124;126;193;197;116;126;241;241;171;171;145;145;201;204;134;142
1106;KL;170;178;114;114;195;197;114;128;241;241;171;171;145;145;201;201;134;134
1107;Oe;170;172;114;124;197;199;126;130;241;241;168;171;150;150;201;204;134;134
1108;Oe;162;170;124;126;197;197;128;128;241;241;168;171;143;143;201;204;132;134
1109;Oe;170;174;106;124;195;197;114;128;241;241;168;171;143;145;204;204;134;140
1110;Oe;162;174;114;142;199;199;126;128;241;241;168;171;145;145;201;201;140;150
1111;Oe;170;170;114;126;199;205;116;124;241;241;171;177;145;145;201;204;134;134
1112;Oe;174;174;128;130;193;197;128;128;241;241;177;180;145;145;201;204;134;140
1113;Oe;162;170;114;114;197;199;114;126;241;241;171;171;145;145;201;201;134;134
1114;Oe;170;178;124;126;197;197;114;126;241;241;171;177;145;145;201;201;134;140
1115;Oe;172;174;114;128;193;197;126;130;241;241;171;171;145;164;195;201;140;142
1116;Oe;172;176;124;124;197;197;128;128;238;241;168;168;143;149;201;204;134;146
1117;Oe;176;176;114;126;199;205;114;128;238;241;171;171;145;145;201;201;134;142
1118;Oe;164;172;124;134;193;193;106;126;241;241;171;177;143;145;201;201;134;134
1119;Oe;170;172;114;134;187;205;126;126;241;241;168;177;143;145;204;204;134;134
1120;Oe;170;174;106;128;193;199;126;126;241;241;168;168;145;150;201;204;140;140
1121;Oe;164;174;124;144;197;201;114;126;241;241;168;171;145;145;201;201;134;134
1122;Oe;170;178;114;124;195;197;126;126;241;241;180;180;145;149;201;201;132;134
1123;Oe;170;176;114;124;197;197;126;128;241;241;168;180;145;164;201;201;134;140
1124;Oe;176;176;114;114;187;193;126;126;241;241;171;171;145;149;201;204;134;134
1125;Oe;170;174;106;114;197;197;128;132;241;241;168;171;143;143;201;204;134;134
1126;Oe;170;176;114;126;193;205;126;130;241;241;168;171;145;164;201;201;132;134
1127;Oe;172;176;106;132;197;197;118;126;241;241;168;171;145;145;201;201;134;134
1128;Oe;150;170;124;130;193;197;116;118;241;241;168;171;145;145;201;201;136;140
1129;Oe;170;176;106;114;197;197;114;126;241;241;168;171;145;145;201;204;132;140
1130;Oe;176;176;126;138;197;205;130;132;241;241;171;177;145;145;195;201;134;134
1131;Oe;170;170;128;130;193;197;114;126;241;241;168;171;145;145;201;201;140;142
1132;Oe;176;178;130;134;193;205;118;124;241;241;171;177;145;145;201;201;134;134
1133;Oe;170;170;106;130;193;197;126;128;241;241;168;177;145;145;201;201;134;142
1134;Oe;170;176;124;130;197;199;126;128;238;241;177;180;143;145;201;201;134;134
1135;Oe;172;172;114;126;195;201;124;126;241;241;168;168;143;145;201;201;140;140
1136;Oe;170;176;124;132;193;201;128;128;241;241;168;168;145;147;201;201;140;142
1137;Oe;170;178;124;126;195;201;124;130;241;241;171;171;143;145;201;204;132;134
1138;Oe;170;176;114;116;193;197;124;126;241;241;177;180;143;145;195;201;134;136
1139;Oe;170;172;114;134;187;199;124;126;241;241;171;177;145;145;201;201;134;140
1140;Oe;166;170;126;126;197;197;128;130;241;241;168;171;145;149;201;204;134;134
1141;Oe;162;172;124;126;195;199;126;128;238;241;168;171;145;145;201;201;140;150
1142;Oe;170;176;114;124;197;199;114;126;241;241;171;171;145;145;201;201;134;142
1143;Oe;170;176;114;126;197;199;126;128;241;241;168;177;143;145;201;201;134;142
1144;Oe;170;170;114;124;197;205;114;128;238;241;168;171;143;145;201;201;134;140
1145;Oe;174;176;124;142;197;197;116;128;241;241;168;180;145;149;201;204;134;134
1146;Oe;170;170;124;126;187;195;116;130;238;241;168;171;145;145;201;201;132;134
1147;Oe;162;170;114;126;197;199;118;126;241;241;171;177;145;145;195;204;140;142
1148;Oe;170;172;126;126;187;195;126;126;241;241;171;171;145;145;201;207;134;134
1149;Oe;176;178;106;106;193;197;114;126;241;241;168;171;145;149;195;201;134;134
1150;Oe;170;176;134;142;195;197;124;126;241;241;171;171;143;149;201;204;132;134
1151;Oe;150;172;114;130;193;201;114;130;241;241;168;168;145;149;201;204;134;142
1152;Oe;170;176;126;138;201;201;124;128;241;241;168;171;143;143;201;201;134;140
1153;Oe;170;176;106;126;193;193;116;128;238;241;180;180;149;149;201;204;134;140
1154;Oe;172;176;106;124;193;201;126;126;241;241;171;177;143;145;201;201;134;134
1155;Oe;170;170;122;126;201;205;128;130;241;241;171;171;145;149;201;201;132;134
1156;Oe;150;150;114;130;193;201;114;130;241;241;168;177;145;149;201;204;134;134
1157;Oe;170;174;112;126;193;193;128;130;241;241;168;168;143;145;201;201;132;134
1158;Oe;170;170;106;130;195;205;106;124;241;241;168;171;145;145;201;201;134;144
1159;Oe;170;172;106;128;197;205;116;128;238;241;168;168;145;149;201;201;134;134
1160;Oe;170;172;126;128;197;197;126;128;241;241;168;180;145;145;201;201;134;134
1161;Oe;170;174;114;142;193;193;126;128;241;241;171;177;145;145;201;204;134;142
1162;Oe;170;176;126;130;197;199;126;126;238;241;168;177;143;145;201;204;134;142
1163;Oe;170;172;106;114;193;201;114;126;241;241;168;171;143;145;201;201;134;142
1164;Oe;170;170;114;126;193;201;126;128;238;241;171;177;145;145;195;204;132;134
1165;Oe;164;170;114;114;193;193;114;128;244;244;168;171;145;145;201;201;134;142
1166;Oe;170;174;124;126;195;199;124;126;241;241;171;171;145;145;201;201;134;142
1167;Oe;150;170;132;136;201;203;114;126;241;241;171;177;145;149;201;201;134;134
1168;Oe;150;170;114;114;197;201;126;128;241;241;171;171;145;149;201;201;134;134
1169;Oe;178;178;124;126;193;197;126;128;241;241;180;180;145;145;201;201;132;134
1170;Oe;174;174;126;134;199;199;116;128;241;241;168;177;145;145;201;204;134;138
1171;Oe;170;172;126;152;199;207;124;128;241;241;168;168;145;145;201;204;132;134
1172;Oe;176;188;106;116;195;197;124;132;241;241;171;171;145;149;201;201;132;142
1173;Oe;170;178;114;126;197;205;124;126;238;241;171;177;145;149;201;201;142;146
1174;Oe;150;178;114;130;197;197;128;130;241;241;171;177;143;145;201;204;132;134
1175;Oe;170;170;124;128;193;201;118;130;241;241;171;177;145;149;201;207;132;140
1176;Oe;150;170;114;124;193;207;124;132;241;241;168;180;145;145;201;201;134;136
1177;Oe;170;172;114;116;193;199;126;128;241;241;171;171;145;149;201;204;134;140
1178;Oe;170;178;124;124;187;197;126;126;241;241;168;168;145;145;201;201;134;142
1179;Oe;170;174;114;124;197;205;128;128;244;244;168;177;145;149;201;201;132;134
1180;Oe;164;172;124;126;187;193;124;128;241;241;168;168;145;149;201;201;134;142
1181;Oe;166;174;122;126;187;197;118;120;241;241;168;177;145;145;201;204;132;142
1182;Oe;170;170;106;114;197;197;122;124;238;241;171;177;145;149;201;204;134;144
1183;Oe;158;170;142;142;197;201;128;128;241;241;171;177;143;145;201;201;134;134
1184;Oe;170;172;126;130;193;195;126;130;241;241;168;171;145;145;201;204;134;142
1185;Oe;164;166;126;130;193;201;120;126;241;241;168;171;143;150;201;201;134;140
1186;Oe;170;170;106;114;193;201;124;126;241;241;168;171;145;149;201;201;132;140
1187;Oe;178;178;124;130;187;205;114;126;241;241;168;171;143;143;201;204;134;140
1188;Oe;170;172;106;124;193;199;112;124;241;241;171;180;145;149;201;204;134;150
1189;Oe;158;178;116;124;193;193;114;128;241;241;168;177;145;145;201;201;142;142
1190;Oe;166;172;136;142;197;201;114;126;241;241;171;180;145;149;201;201;134;134
1191;Oe;170;170;106;126;197;197;114;116;241;241;168;171;145;149;195;201;132;134
1192;Oe;162;178;124;124;195;197;128;130;238;241;168;177;145;149;201;201;134;134
1193;Oe;170;172;106;120;193;197;116;130;238;241;168;171;145;149;201;204;134;134
1194;Oe;166;170;124;136;199;201;114;130;241;241;168;171;145;150;201;201;134;146
1195;Oe;166;170;106;130;201;205;124;126;241;241;177;180;145;145;201;204;134;140
1196;Oe;170;176;124;126;187;197;128;128;241;241;171;171;145;145;201;201;132;140
1197;Oe;170;176;124;142;193;197;116;118;238;241;171;180;145;162;201;207;134;134
1198;Oe;170;172;114;138;197;199;126;126;241;241;168;168;143;145;201;201;140;148
1199;Oe;166;170;114;132;187;197;126;126;241;241;171;177;145;145;201;201;134;140
1200;Oe;170;172;114;134;193;197;124;124;241;241;171;171;145;145;201;201;134;142
1201;Oe;172;174;114;126;195;201;116;128;241;241;180;180;143;145;201;201;134;142
1202;Oe;170;178;106;130;197;197;114;132;241;241;168;171;145;145;201;204;134;140
1203;Oe;170;170;114;114;195;197;130;132;241;241;168;177;145;149;201;201;134;140
1204;Oe;150;170;114;114;193;197;126;126;241;241;168;168;145;145;201;201;134;134
1205;Oe;172;176;128;130;187;199;126;128;241;241;168;168;145;145;204;204;132;134
1206;Oe;170;174;124;134;193;197;126;130;238;238;168;168;145;145;201;204;134;140
