heureCLEA (tokens)
Ramm : 0.7493828684275488
New  : 0.8879906196000987
heureCLEA (verbs)
Ramm : 0.8191343963553531
New  : 0.9079726651480637
Don Quijote (tokens)
Kappa: 0.9636024027359519
Ramm : 0.5575553055868017
New  : 0.8717660292463442
Don Quijote (verbs)
Kappa: 0.959757175022088
Ramm : 0.6373937677053825
New  : 0.9263456090651558
Finiteness (verbs)
Ramm: 0.8271954674220963
New : 0.8810198300283286
Tense (finite verbs)
Ramm: 0.7152103559870551
New : 0.9288025889967637
Mood (finite verbs)
Ramm: 0.7572815533980582
New : 0.8220064724919094
Voice (finite verbs)
Ramm: 0.8252427184466019
New : 0.9352750809061489
Modality (finite verbs)
Ramm: 0.0
New : 0.7980769230769231
Tense (verbs)
Ramm: 0.6373937677053825
New : 0.9263456090651558
Mood (verbs)
Ramm: 0.7313915857605178
New : 0.7896440129449838
Voice (verbs)
Ramm: 0.7053824362606232
New : 0.9376770538243626
Modality (verbs)
Ramm: 0.0
New : 0.7980769230769231
Clauses
Gold: 443
Pred: 388
Pr: 0.8711340206185567
Re: 0.7629796839729119
F1: 0.8134777376654633
