,,,,,verb,verb,verb,verb,haben,haben,haben,haben,sein,sein,sein,sein,werden,werden,werden,werden,
aux,tense,aspect,voice,mode,inf,pres,past,part,inf,pres,past,part,inf,pres,past,part,inf,pres,past,part,example
haben,pres,imperf,active,inf,inf,,,,,,,,,,,,,,,,(zu) sehen
haben,pres,imperf,pass:dynamic,inf,,,,past,,,,,,,,,inf,,,,gesehen (zu) werden
haben,pres,imperf,pass:static,inf,,,,past,,,,,inf,,,,,,,,gesehen (zu) sein
haben,pres,perf,active,inf,,,,past,inf,,,,,,,,,,,,gesehen (zu) haben
haben,pres,perf,pass:dynamic,inf,,,,past,,,,,inf,,,,,,,past,gesehen worden (zu) sein
haben,pres,perf,pass:static,inf,,,,past,,,,,inf,,,past,,,,,gesehen gewesen (zu) sein
haben,pres,imperf,active,part,,,,pres,,,,,,,,,,,,,sehend
haben,pres,perf,pass,part,,,,past,,,,,,,,,,,,,gesehen
haben,pres,imperf,active,imp,,imp,,,,,,,,,,,,,,,sieh
haben,pres,imperf,pass:dynamic,imp,,,,past,,,,,,,,,,imp,,,werde gesehen
haben,pres,imperf,pass:static,imp,,,,past,,,,,,imp,,,,,,,sei gesehen
haben,pres,perf,active,imp,,,,past,,imp,,,,,,,,,,,habe gesehen
haben,pres,perf,pass:dynamic,imp,,,,past,,,,,,imp,,,,,,past,sei gesehen worden
haben,pres,perf,pass:static,imp,,,,past,,,,,,imp,,past,,,,,sei gesehen gewesen
haben,pres,imperf,active,ind,,ind,,,,,,,,,,,,,,,[er] sieht
haben,pres,imperf,active,subj:pres,,subj,,,,,,,,,,,,,,,[er] sehe
haben,pres,imperf,pass:dynamic,ind,,,,past,,,,,,,,,,ind,,,[er] wird gesehen
haben,pres,imperf,pass:dynamic,subj:pres,,,,past,,,,,,,,,,subj,,,[er] werde gesehen
haben,pres,imperf,pass:static,ind,,,,past,,,,,,ind,,,,,,,[er] ist gesehen
haben,pres,imperf,pass:static,subj:pres,,,,past,,,,,,subj,,,,,,,[er] sei gesehen
haben,past,imperf,active,ind,,,ind,,,,,,,,,,,,,,[er] sah
haben,past,imperf,active,subj:past,,,subj,,,,,,,,,,,,,,[er] sähe
haben,past,imperf,pass:dynamic,ind,,,,past,,,,,,,,,,,ind,,[er] wurde gesehen
haben,past,imperf,pass:dynamic,subj:past,,,,past,,,,,,,,,,,subj,,[er] würde gesehen
haben,past,imperf,pass:static,ind,,,,past,,,,,,,ind,,,,,,[er] war gesehen
haben,past,imperf,pass:static,subj:past,,,,past,,,,,,,subj,,,,,,[er] wäre gesehen
haben,pres,perf,active,ind,,,,past,,ind,,,,,,,,,,,[er] hat gesehen
haben,pres,perf,active,subj:pres,,,,past,,subj,,,,,,,,,,,[er] habe gesehen
haben,pres,perf,pass:dynamic,ind,,,,past,,,,,,ind,,,,,,past,[er] ist gesehen worden
haben,pres,perf,pass:dynamic,subj:pres,,,,past,,,,,,subj,,,,,,past,[er] sei gesehen worden
haben,pres,perf,pass:static,ind,,,,past,,,,,,ind,,past,,,,,[er] ist gesehen gewesen
haben,pres,perf,pass:static,subj:pres,,,,past,,,,,,subj,,past,,,,,[er] sei gesehen gewesen
haben,past,perf,active,ind,,,,past,,,ind,,,,,,,,,,[er] hatte gesehen
haben,past,perf,active,subj:past,,,,past,,,subj,,,,,,,,,,[er] hätte gesehen
haben,past,perf,pass:dynamic,ind,,,,past,,,,,,,ind,,,,,past,[er] war gesehen worden
haben,past,perf,pass:dynamic,subj:past,,,,past,,,,,,,subj,,,,,past,[er] wäre gesehen worden
haben,past,perf,pass:static,ind,,,,past,,,,,,,ind,past,,,,,[er] war gesehen gewesen
haben,past,perf,pass:static,subj:past,,,,past,,,,,,,subj,past,,,,,[er] wäre gesehen gewesen
haben,fut,imperf,active,ind,inf,,,,,,,,,,,,,ind,,,[er] wird sehen
haben,fut,imperf,active,subj:pres,inf,,,,,,,,,,,,,subj,,,[er] werde sehen
haben,fut,imperf,active,subj:past,inf,,,,,,,,,,,,,,subj,,[er] würde sehen
haben,fut,imperf,pass:dynamic,ind,,,,past,,,,,,,,,inf,ind,,,[er] wird gesehen werden
haben,fut,imperf,pass:dynamic,subj:pres,,,,past,,,,,,,,,inf,subj,,,[er] werde gesehen werden
haben,fut,imperf,pass:dynamic,subj:past,,,,past,,,,,,,,,inf,,subj,,[er] würde gesehen werden
haben,fut,imperf,pass:static,ind,,,,past,,,,,inf,,,,,ind,,,[er] wird gesehen sein
haben,fut,imperf,pass:static,subj:pres,,,,past,,,,,inf,,,,,subj,,,[er] werde gesehen sein
haben,fut,imperf,pass:static,subj:past,,,,past,,,,,inf,,,,,,subj,,[er] würde gesehen sein
haben,fut,perf,active,ind,,,,past,inf,,,,,,,,,ind,,,[er] wird gesehen haben
haben,fut,perf,active,subj:pres,,,,past,inf,,,,,,,,,subj,,,[er] werde gesehen haben
haben,fut,perf,active,subj:past,,,,past,inf,,,,,,,,,,subj,,[er] würde gesehen haben
haben,fut,perf,pass:dynamic,ind,,,,past,,,,,inf,,,,,ind,,past,[er] wird gesehen worden sein
haben,fut,perf,pass:dynamic,subj:pres,,,,past,,,,,inf,,,,,subj,,past,[er] werde gesehen worden sein
haben,fut,perf,pass:dynamic,subj:past,,,,past,,,,,inf,,,,,,subj,past,[er] würde gesehen worden sein
haben,fut,perf,pass:static,ind,,,,past,,,,,inf,,,past,,ind,,,[er] wird gesehen gewesen sein
haben,fut,perf,pass:static,subj:pres,,,,past,,,,,inf,,,past,,subj,,,[er] werde gesehen gewesen sein
haben,fut,perf,pass:static,subj:past,,,,past,,,,,inf,,,past,,,subj,,[er] würde gesehen gewesen sein
sein,pres,imperf,active,inf,inf,,,,,,,,,,,,,,,,(zu) gehen
sein,pres,imperf,pass:dynamic,inf,,,,past,,,,,,,,,inf,,,,gegangen (zu) werden
sein,pres,imperf,pass:static,inf,,,,past,,,,,inf,,,,,,,,gegangen (zu) sein
sein,pres,perf,active,inf,,,,past,,,,,inf,,,,,,,,gegangen (zu) sein
sein,pres,perf,pass:dynamic,inf,,,,past,,,,,inf,,,,,,,past,gegangen worden (zu) sein
sein,pres,perf,pass:static,inf,,,,past,,,,,inf,,,past,,,,,gegangen gewesen (zu) sein
sein,pres,imperf,active,part,,,,pres,,,,,,,,,,,,,gehend
sein,pres,perf,pass,part,,,,past,,,,,,,,,,,,,gegangen
sein,pres,imperf,active,imp,,imp,,,,,,,,,,,,,,,geh
sein,pres,imperf,pass:dynamic,imp,,,,past,,,,,,,,,,imp,,,werde gegangen
sein,pres,imperf,pass:static,imp,,,,past,,,,,,imp,,,,,,,sei gegangen
sein,pres,perf,active,imp,,,,past,,,,,,imp,,,,,,,sei gegangen
sein,pres,perf,pass:dynamic,imp,,,,past,,,,,,imp,,,,,,past,sei gegangen worden
sein,pres,perf,pass:static,imp,,,,past,,,,,,imp,,past,,,,,sei gegangen gewesen
sein,pres,imperf,active,ind,,ind,,,,,,,,,,,,,,,[er] geht
sein,pres,imperf,active,subj:pres,,subj,,,,,,,,,,,,,,,[er] gehe
sein,pres,imperf,pass:dynamic,ind,,,,past,,,,,,,,,,ind,,,[er] wird gegangen
sein,pres,imperf,pass:dynamic,subj:pres,,,,past,,,,,,,,,,subj,,,[er] werde gegangen
sein,pres,imperf,pass:static,ind,,,,past,,,,,,ind,,,,,,,[er] ist gegangen
sein,pres,imperf,pass:static,subj:pres,,,,past,,,,,,subj,,,,,,,[er] sei gegangen
sein,past,imperf,active,ind,,,ind,,,,,,,,,,,,,,[er] ging
sein,past,imperf,active,subj:past,,,subj,,,,,,,,,,,,,,[er] ginge
sein,past,imperf,pass:dynamic,ind,,,,past,,,,,,,,,,,ind,,[er] wurde gegangen
sein,past,imperf,pass:dynamic,subj:past,,,,past,,,,,,,,,,,subj,,[er] würde gegangen
sein,past,imperf,pass:static,ind,,,,past,,,,,,,ind,,,,,,[er] war gegangen
sein,past,imperf,pass:static,subj:past,,,,past,,,,,,,subj,,,,,,[er] wäre gegangen
sein,pres,perf,active,ind,,,,past,,,,,,ind,,,,,,,[er] ist gegangen
sein,pres,perf,active,subj:pres,,,,past,,,,,,subj,,,,,,,[er] sei gegangen
sein,pres,perf,pass:dynamic,ind,,,,past,,,,,,ind,,,,,,past,[er] ist gegangen worden
sein,pres,perf,pass:dynamic,subj:pres,,,,past,,,,,,subj,,,,,,past,[er] sei gegangen worden
sein,pres,perf,pass:static,ind,,,,past,,,,,,ind,,past,,,,,[er] ist gegangen gewesen
sein,pres,perf,pass:static,subj:pres,,,,past,,,,,,subj,,past,,,,,[er] sei gegangen gewesen
sein,past,perf,active,ind,,,,past,,,,,,,ind,,,,,,[er] war gegangen
sein,past,perf,active,subj:past,,,,past,,,,,,,subj,,,,,,[er] wäre gegangen
sein,past,perf,pass:dynamic,ind,,,,past,,,,,,,ind,,,,,past,[er] war gegangen worden
sein,past,perf,pass:dynamic,subj:past,,,,past,,,,,,,subj,,,,,past,[er] wäre gegangen worden
sein,past,perf,pass:static,ind,,,,past,,,,,,,ind,past,,,,,[er] war gegangen gewesen
sein,past,perf,pass:static,subj:past,,,,past,,,,,,,subj,past,,,,,[er] wäre gegangen gewesen
sein,fut,imperf,active,ind,inf,,,,,,,,,,,,,ind,,,[er] wird gehen
sein,fut,imperf,active,subj:pres,inf,,,,,,,,,,,,,subj,,,[er] werde gehen
sein,fut,imperf,active,subj:past,inf,,,,,,,,,,,,,,subj,,[er] würde gehen
sein,fut,imperf,pass:dynamic,ind,,,,past,,,,,,,,,inf,ind,,,[er] wird gegangen werden
sein,fut,imperf,pass:dynamic,subj:pres,,,,past,,,,,,,,,inf,subj,,,[er] werde gegangen werden
sein,fut,imperf,pass:dynamic,subj:past,,,,past,,,,,,,,,inf,,subj,,[er] würde gegangen werden
sein,fut,imperf,pass:static,ind,,,,past,,,,,inf,,,,,ind,,,[er] wird gegangen sein
sein,fut,imperf,pass:static,subj:pres,,,,past,,,,,inf,,,,,subj,,,[er] werde gegangen sein
sein,fut,imperf,pass:static,subj:past,,,,past,,,,,inf,,,,,,subj,,[er] würde gegangen sein
sein,fut,perf,active,ind,,,,past,,,,,inf,,,,,ind,,,[er] wird gegangen sein
sein,fut,perf,active,subj:pres,,,,past,,,,,inf,,,,,subj,,,[er] werde gegangen sein
sein,fut,perf,active,subj:past,,,,past,,,,,inf,,,,,,subj,,[er] würde gegangen sein
sein,fut,perf,pass:dynamic,ind,,,,past,,,,,inf,,,,,ind,,past,[er] wird gegangen worden sein
sein,fut,perf,pass:dynamic,subj:pres,,,,past,,,,,inf,,,,,subj,,past,[er] werde gegangen worden sein
sein,fut,perf,pass:dynamic,subj:past,,,,past,,,,,inf,,,,,,subj,past,[er] würde gegangen worden sein
sein,fut,perf,pass:static,ind,,,,past,,,,,inf,,,past,,ind,,,[er] wird gegangen gewesen sein
sein,fut,perf,pass:static,subj:pres,,,,past,,,,,inf,,,past,,subj,,,[er] werde gegangen gewesen sein
sein,fut,perf,pass:static,subj:past,,,,past,,,,,inf,,,past,,,subj,,[er] würde gegangen gewesen sein
