1	 	_	 	_	XY	_	nom|sg|fem	-1	0	_	--	_	_
2	Meine	_	Mein	_	PPOSAT	_	nom|sg|fem	-1	4	_	NK	_	_
3	erste	_	erster	_	ADJA	_	nom|sg|fem|pos	-1	4	_	NK	_	_
4	Liebe	_	Liebe	_	NN	_	nom|sg|fem	-1	0	_	--	_	_
5	 	_	 	_	XY	_	_	-1	0	_	--	_	_

1	An	_	an	_	APPR	_	_	-1	11	_	MO	_	_
2	den	_	der	_	ART	_	dat|pl|masc	-1	3	_	NK	_	_
3	Sonntagen	_	Sonntag	_	NN	_	dat|pl|masc	-1	1	_	NK	_	_
4	durfte	_	dürfen	_	VMFIN	_	sg|3|past|ind	-1	0	_	--	_	_
5	ich	_	ich	_	PPER	_	nom|sg|*|1	-1	4	_	SB	_	_
6	immer	_	immer	_	ADV	_	_	-1	4	_	MO	_	_
7	zu	_	zu	_	APPR	_	_	-1	11	_	MO	_	_
8	Herrn	_	Herr	_	NN	_	dat|sg|masc	-1	7	_	NK	_	_
9	von	_	von	_	APPR	_	_	-1	8	_	PG	_	_
10	Rupp	_	Rupp	_	NE	_	dat|sg|neut	-1	9	_	NK	_	_
11	kommen	_	kommen	_	VVINF	_	_	-1	4	_	OC	_	_
12	und	_	und	_	KON	_	_	-1	11	_	CD	_	_
13	bei	_	bei	_	APPR	_	_	-1	16	_	MO	_	_
14	ihm	_	ihm	_	PPER	_	dat|sg|masc|3	-1	13	_	NK	_	_
15	Mittag	_	Mittag	_	NN	_	acc|sg|masc	-1	16	_	OA	_	_
16	essen	_	essen	_	VVINF	_	_	-1	12	_	CJ	_	_
17	.	_	--	_	$.	_	_	-1	16	_	--	_	_

1	Er	_	er	_	PPER	_	nom|sg|masc|3	-1	2	_	SB	_	_
2	war	_	sein	_	VAFIN	_	sg|3|past|ind	-1	0	_	--	_	_
3	ein	_	ein	_	ART	_	nom|sg|masc	-1	5	_	NK	_	_
4	alter	_	alt	_	ADJA	_	nom|sg|masc|pos	-1	5	_	NK	_	_
5	Jagdfreund	_	Jagdfreund	_	NN	_	nom|sg|masc	-1	2	_	PD	_	_
6	von	_	von	_	APPR	_	_	-1	5	_	MNR	_	_
7	meinem	_	mein	_	PPOSAT	_	dat|sg|masc	-1	8	_	NK	_	_
8	Papa	_	Papa	_	NN	_	dat|sg|masc	-1	6	_	NK	_	_
9	und	_	und	_	KON	_	_	-1	2	_	CD	_	_
10	hatte	_	haben	_	VAFIN	_	sg|3|past|ind	-1	9	_	CJ	_	_
11	schon	_	schon	_	ADV	_	_	-1	16	_	MO	_	_
12	viele	_	vieler	_	PIAT	_	acc|pl|masc	-1	13	_	NK	_	_
13	Hirsche	_	Hirsche	_	NN	_	acc|pl|masc	-1	16	_	OA	_	_
14	bei	_	bei	_	APPR	_	_	-1	16	_	MO	_	_
15	uns	_	uns	_	PPER	_	dat|pl|*|1	-1	14	_	NK	_	_
16	geschossen	_	schießen	_	VVPP	_	_	-1	10	_	OC	_	_
17	.	_	--	_	$.	_	_	-1	16	_	--	_	_

1	Es	_	es	_	PPER	_	nom|sg|neut|3	-1	2	_	SB	_	_
2	war	_	sein	_	VAFIN	_	sg|3|past|ind	-1	0	_	--	_	_
3	sehr	_	sehr	_	ADV	_	_	-1	4	_	MO	_	_
4	schön	_	schön	_	ADJD	_	pos	-1	2	_	PD	_	_
5	bei	_	bei	_	APPR	_	_	-1	2	_	MO	_	_
6	ihm	_	ihm	_	PPER	_	dat|sg|*|3	-1	5	_	NK	_	_
7	.	_	--	_	$.	_	_	-1	6	_	--	_	_

1	Er	_	er	_	PPER	_	nom|sg|masc|3	-1	2	_	SB	_	_
2	behandelte	_	behandeln	_	VVFIN	_	sg|3|past|ind	-1	0	_	--	_	_
3	mich	_	mich	_	PPER	_	acc|sg|*|1	-1	2	_	OA	_	_
4	beinahe	_	beinahe	_	ADV	_	_	-1	2	_	MO	_	_
5	wie	_	wie	_	KOKOM	_	_	-1	7	_	CM	_	_
6	einen	_	ein	_	ART	_	acc|sg|masc	-1	7	_	NK	_	_
7	Herrn	_	Herr	_	NN	_	acc|sg|masc	-1	2	_	MO	_	_
8	,	_	--	_	$,	_	_	-1	7	_	--	_	_
9	und	_	und	_	KON	_	_	-1	2	_	CD	_	_
10	wenn	_	wenn	_	KOUS	_	_	-1	14	_	CP	_	_
11	das	_	der	_	ART	_	nom|sg|neut	-1	12	_	NK	_	_
12	Essen	_	Essen	_	NN	_	nom|sg|neut	-1	14	_	SB	_	_
13	vorbei	_	vorbei	_	ADV	_	_	-1	14	_	MO	_	_
14	war	_	sein	_	VAFIN	_	sg|3|past|ind	-1	16	_	MO	_	_
15	,	_	--	_	$,	_	_	-1	14	_	--	_	_
16	gab	_	geben	_	VVFIN	_	sg|3|past|ind	-1	9	_	CJ	_	_
17	er	_	er	_	PPER	_	nom|sg|masc|3	-1	16	_	SB	_	_
18	mir	_	sich	_	PPER	_	dat|sg|*|1	-1	16	_	DA	_	_
19	immer	_	immer	_	ADV	_	_	-1	16	_	MO	_	_
20	eine	_	ein	_	ART	_	acc|sg|fem	-1	21	_	NK	_	_
21	Zigarre	_	Zigarre	_	NN	_	acc|sg|fem	-1	16	_	OA	_	_
22	und	_	und	_	KON	_	_	-1	16	_	CD	_	_
23	sagte	_	sagen	_	VVFIN	_	sg|3|past|ind	-1	22	_	CJ	_	_
24	:	_	--	_	$.	_	_	-1	23	_	--	_	_
25	»	_	»	_	XY	_	_	-1	7	_	NK	_	_
26	Du	_	du	_	PPER	_	nom|sg|*|2	-1	27	_	SB	_	_
27	kannst	_	kannen	_	VVFIN	_	sg|3|pres|ind	-1	23	_	OC	_	_
28	es	_	es	_	PPER	_	nom|sg|neut|3	-1	16	_	EP	_	_
29	schon	_	schon	_	ADV	_	_	-1	30	_	MO	_	_
30	vertragen	_	vertragen	_	VVINF	_	_	-1	16	_	OC	_	_
31	.	_	--	_	$.	_	_	-1	30	_	--	_	_

1	Dein	_	dein	_	PPOSAT	_	nom|sg|masc	-1	2	_	NK	_	_
2	Vater	_	Vater	_	NN	_	nom|sg|masc	-1	3	_	SB	_	_
3	hat	_	haben	_	VAFIN	_	sg|3|pres|ind	-1	0	_	--	_	_
4	auch	_	auch	_	ADV	_	_	-1	5	_	MO	_	_
5	geraucht	_	rauchen	_	VVPP	_	_	-1	3	_	OC	_	_
6	wie	_	wie	_	KOKOM	_	_	-1	8	_	CM	_	_
7	eine	_	ein	_	ART	_	acc|sg|fem	-1	8	_	NK	_	_
8	Lokomotive	_	Lokomotive	_	NN	_	acc|sg|fem	-1	5	_	MO	_	_
9	.	_	--	_	$.	_	_	-1	8	_	--	_	_

1	«	_	«	_	XY	_	_	-1	8	_	PNC	_	_
2	Da	_	da	_	ADV	_	_	-1	3	_	MO	_	_
3	war	_	sein	_	VAFIN	_	sg|1|past|ind	-1	0	_	--	_	_
4	ich	_	ich	_	PPER	_	nom|sg|masc|1	-1	3	_	SB	_	_
5	sehr	_	sehr	_	ADV	_	_	-1	6	_	MO	_	_
6	stolz	_	stolz	_	ADJD	_	pos	-1	3	_	PD	_	_
7	.	_	--	_	$.	_	_	-1	6	_	--	_	_
8	 	_	 	_	XY	_	_	-1	0	_	--	_	_

1	Die	_	der	_	ART	_	nom|sg|fem	-1	2	_	NK	_	_
2	Frau	_	Frau	_	NN	_	nom|sg|fem	-1	5	_	SB	_	_
3	von	_	von	_	APPR	_	_	-1	2	_	PG	_	_
4	Rupp	_	Rupp	_	NE	_	dat|sg|*	-1	3	_	NK	_	_
5	war	_	sein	_	VAFIN	_	sg|3|past|ind	-1	0	_	--	_	_
6	eine	_	ein	_	ART	_	nom|sg|fem	-1	9	_	NK	_	_
7	furchtbar	_	furchtbar	_	ADJD	_	pos	-1	8	_	MO	_	_
8	noble	_	nobel	_	ADJA	_	nom|sg|fem|pos	-1	9	_	NK	_	_
9	Dame	_	--	_	NN	_	nom|sg|fem	-1	5	_	PD	_	_
10	,	_	--	_	$,	_	_	-1	9	_	--	_	_
11	und	_	und	_	KON	_	_	-1	5	_	CD	_	_
12	wenn	_	wenn	_	KOUS	_	_	-1	14	_	CP	_	_
13	sie	_	sie	_	PPER	_	nom|sg|fem|3	-1	14	_	SB	_	_
14	redete	_	reden	_	VVFIN	_	sg|3|past|ind	-1	16	_	MO	_	_
15	,	_	--	_	$,	_	_	-1	14	_	--	_	_
16	machte	_	machen	_	VVFIN	_	sg|3|past|ind	-1	11	_	CJ	_	_
17	sie	_	sie	_	PPER	_	nom|sg|fem|3	-1	16	_	SB	_	_
18	einen	_	ein	_	ART	_	acc|sg|masc	-1	20	_	NK	_	_
19	spitzigen	_	spitzig	_	ADJA	_	acc|sg|masc|pos	-1	20	_	NK	_	_
20	Mund	_	Mund	_	NN	_	acc|sg|masc	-1	16	_	OA	_	_
21	,	_	--	_	$,	_	_	-1	20	_	--	_	_
22	damit	_	damit	_	KOUS	_	_	-1	25	_	CP	_	_
23	es	_	es	_	PPER	_	nom|sg|neut|3	-1	25	_	SB	_	_
24	hochdeutsch	_	hochdeutsch	_	ADJD	_	pos	-1	25	_	PD	_	_
25	wurde	_	werden	_	VAFIN	_	sg|3|past|ind	-1	16	_	MO	_	_
26	.	_	--	_	$.	_	_	-1	25	_	--	_	_

1	Sie	_	sie	_	PPER	_	nom|sg|fem|3	-1	2	_	SB	_	_
2	ermahnte	_	ermahnen	_	VVFIN	_	sg|3|past|ind	-1	0	_	--	_	_
3	mich	_	mich	_	PRF	_	acc|sg|1	-1	2	_	OA	_	_
4	immer	_	immer	_	ADV	_	_	-1	2	_	MO	_	_
5	,	_	--	_	$,	_	_	-1	4	_	--	_	_
6	daß	_	daß	_	KOUS	_	_	-1	11	_	CP	_	_
7	ich	_	ich	_	PPER	_	nom|sg|*|1	-1	11	_	SB	_	_
8	nicht	_	nicht	_	PTKNEG	_	_	-1	11	_	NG	_	_
9	Nägel	_	Nägel	_	NN	_	sg|1|pres|ind	-1	10	_	OA	_	_
10	beißen	_	beißen	_	VVINF	_	_	-1	11	_	OC	_	_
11	soll	_	sollen	_	VMFIN	_	sg|3|pres|ind	-1	2	_	OC	_	_
12	und	_	und	_	KON	_	_	-1	11	_	CD	_	_
13	eine	_	ein	_	ART	_	nom|sg|fem	-1	15	_	NK	_	_
14	gute	_	gut	_	ADJA	_	nom|sg|fem|pos	-1	15	_	NK	_	_
15	Aussprache	_	Aussprache	_	NN	_	nom|sg|fem	-1	16	_	OA	_	_
16	habe	_	haben	_	VAFIN	_	sg|3|pres|subj	-1	12	_	CJ	_	_
17	.	_	--	_	$.	_	_	-1	16	_	--	_	_

1	Dann	_	dann	_	ADV	_	_	-1	2	_	MO	_	_
2	war	_	sein	_	VAFIN	_	sg|3|past|ind	-1	0	_	--	_	_
3	noch	_	noch	_	ADV	_	_	-1	5	_	MO	_	_
4	eine	_	ein	_	ART	_	nom|sg|fem	-1	5	_	NK	_	_
5	Tochter	_	Tochter	_	NN	_	nom|sg|fem	-1	2	_	SB	_	_
6	da	_	da	_	PTKVZ	_	_	-1	2	_	PD	_	_
7	.	_	--	_	$.	_	_	-1	6	_	--	_	_

1	Die	_	der	_	PDS	_	nom|sg|fem	-1	2	_	SB	_	_
2	war	_	sein	_	VAFIN	_	sg|3|past|ind	-1	0	_	--	_	_
3	sehr	_	sehr	_	ADV	_	_	-1	4	_	MO	_	_
4	schön	_	schön	_	ADJD	_	pos	-1	2	_	PD	_	_
5	und	_	und	_	KON	_	_	-1	4	_	CD	_	_
6	roch	_	roch	_	ADJD	_	pos	-1	5	_	CJ	_	_
7	so	_	so	_	ADV	_	_	-1	8	_	MO	_	_
8	gut	_	gut	_	ADJD	_	pos	-1	2	_	PD	_	_
9	.	_	--	_	$.	_	_	-1	8	_	--	_	_

1	Sie	_	sie	_	PPER	_	nom|sg|fem|3	-1	2	_	SB	_	_
2	gab	_	geben	_	VVFIN	_	sg|3|past|ind	-1	0	_	--	_	_
3	nicht	_	nicht	_	PTKNEG	_	_	-1	4	_	NG	_	_
4	acht	_	acht	_	CARD	_	_	-1	2	_	OA	_	_
5	auf	_	auf	_	APPR	_	_	-1	2	_	MO	_	_
6	mich	_	mich	_	PPER	_	acc|sg|*|1	-1	5	_	NK	_	_
7	,	_	--	_	$,	_	_	-1	6	_	--	_	_
8	weil	_	weil	_	KOUS	_	_	-1	14	_	CP	_	_
9	ich	_	ich	_	PPER	_	nom|sg|*|1	-1	14	_	SB	_	_
10	erst	_	erst	_	ADV	_	_	-1	14	_	MO	_	_
11	vierzehn	_	vierzehn	_	CARD	_	_	-1	12	_	NK	_	_
12	Jahre	_	Jahr	_	NN	_	acc|pl|neut	-1	13	_	AMS	_	_
13	alt	_	alt	_	ADJD	_	pos	-1	14	_	PD	_	_
14	war	_	sein	_	VAFIN	_	sg|3|past|ind	-1	2	_	MO	_	_
15	,	_	--	_	$,	_	_	-1	14	_	--	_	_
16	und	_	und	_	KON	_	_	-1	2	_	CD	_	_
17	redete	_	reden	_	VVFIN	_	sg|3|past|ind	-1	16	_	CJ	_	_
18	immer	_	immer	_	ADV	_	_	-1	17	_	MO	_	_
19	von	_	von	_	APPR	_	_	-1	17	_	OP	_	_
20	Tanzen	_	Tanze	_	NN	_	dat|pl|fem	-1	19	_	NK	_	_
21	und	_	und	_	KON	_	_	-1	20	_	CD	_	_
22	Konzert	_	Konzert	_	NN	_	dat|sg|masc	-1	21	_	CJ	_	_
23	und	_	und	_	KON	_	_	-1	22	_	CD	_	_
24	einem	_	ein	_	ART	_	dat|sg|masc	-1	26	_	NK	_	_
25	gottvollen	_	gottvoll	_	ADJA	_	dat|sg|masc|pos	-1	26	_	NK	_	_
26	Sänger	_	Sänger	_	NN	_	dat|sg|masc	-1	23	_	CJ	_	_
27	.	_	--	_	$.	_	_	-1	26	_	--	_	_

1	Dazwischen	_	dazwischen	_	PROAV	_	_	-1	2	_	MO	_	_
2	erzählte	_	erzählen	_	VVFIN	_	sg|3|past|ind	-1	0	_	--	_	_
3	sie	_	sie	_	PPER	_	nom|sg|fem|3	-1	2	_	SB	_	_
4	,	_	--	_	$,	_	_	-1	3	_	--	_	_
5	was	_	was	_	PWS	_	nom|sg|neut	-1	10	_	SB	_	_
6	in	_	in	_	APPR	_	_	-1	9	_	MO	_	_
7	der	_	der	_	ART	_	dat|sg|fem	-1	8	_	NK	_	_
8	Kriegsschule	_	Kriegsschule	_	NN	_	dat|sg|fem	-1	6	_	NK	_	_
9	passiert	_	passieren	_	VVPP	_	_	-1	10	_	OC	_	_
10	war	_	sein	_	VAFIN	_	sg|3|past|ind	-1	1	_	RE	_	_
11	.	_	--	_	$.	_	_	-1	10	_	--	_	_

1	Das	_	der	_	PDS	_	nom|sg|neut	-1	2	_	SB	_	_
2	hatte	_	haben	_	VAFIN	_	sg|3|past|ind	-1	0	_	--	_	_
3	sie	_	sie	_	PPER	_	nom|sg|fem|3	-1	7	_	OA	_	_
4	von	_	von	_	APPR	_	_	-1	7	_	OP	_	_
5	den	_	der	_	ART	_	dat|pl|masc	-1	6	_	NK	_	_
6	Fähnrichen	_	Fähnrich	_	NN	_	dat|pl|masc	-1	4	_	NK	_	_
7	gehört	_	gehören	_	VVFIN	_	sg|3|pres|ind	-1	2	_	OC	_	_
8	,	_	--	_	$,	_	_	-1	7	_	--	_	_
9	die	_	der	_	PRELS	_	nom|pl|masc	-1	13	_	SB	_	_
10	immer	_	immer	_	ADV	_	_	-1	13	_	MO	_	_
11	zu	_	zu	_	APPR	_	_	-1	13	_	MO	_	_
12	Besuch	_	Besuch	_	NN	_	dat|sg|neut	-1	11	_	NK	_	_
13	kamen	_	kommen	_	VVFIN	_	pl|3|past|ind	-1	6	_	RC	_	_
14	und	_	und	_	KON	_	_	-1	13	_	CD	_	_
15	mit	_	mit	_	APPR	_	_	-1	21	_	MO	_	_
16	den	_	der	_	ART	_	dat|pl|neut	-1	17	_	NK	_	_
17	Säbeln	_	Säbel	_	NN	_	dat|pl|neut	-1	15	_	NK	_	_
18	über	_	über	_	APPR	_	_	-1	17	_	MNR	_	_
19	die	_	der	_	ART	_	acc|sg|fem	-1	20	_	NK	_	_
20	Stiege	_	Stiege	_	NN	_	acc|sg|fem	-1	18	_	NK	_	_
21	rasselten	_	rasseln	_	VVFIN	_	pl|3|past|ind	-1	14	_	CJ	_	_
22	.	_	--	_	$.	_	_	-1	21	_	--	_	_
23	 	_	 	_	XY	_	_	-1	0	_	--	_	_

1	Ich	_	ich	_	PPER	_	nom|sg|*|1	-1	2	_	SB	_	_
2	dachte	_	denken	_	VVFIN	_	sg|1|pres|ind	-1	0	_	--	_	_
3	oft	_	oft	_	ADV	_	_	-1	2	_	MO	_	_
4	,	_	--	_	$,	_	_	-1	3	_	--	_	_
5	wenn	_	wenn	_	KOUS	_	_	-1	12	_	CP	_	_
6	ich	_	ich	_	PPER	_	nom|sg|*|1	-1	12	_	SB	_	_
7	nur	_	nur	_	ADV	_	_	-1	12	_	MO	_	_
8	auch	_	auch	_	ADV	_	_	-1	12	_	MO	_	_
9	schon	_	schon	_	ADV	_	_	-1	12	_	MO	_	_
10	ein	_	ein	_	ART	_	nom|sg|masc	-1	11	_	NK	_	_
11	Offizier	_	Offizier	_	NN	_	nom|sg|masc	-1	12	_	PD	_	_
12	wäre	_	sein	_	VAFIN	_	sg|3|past|subj	-1	3	_	RE	_	_
13	,	_	--	_	$,	_	_	-1	12	_	--	_	_
14	weil	_	weil	_	KOUS	_	_	-1	20	_	CP	_	_
15	ich	_	ich	_	PPER	_	nom|sg|*|1	-1	20	_	SB	_	_
16	ihr	_	ihr	_	PPER	_	dat|sg|fem|3	-1	19	_	DA	_	_
17	dann	_	dann	_	ADV	_	_	-1	19	_	MO	_	_
18	vielleicht	_	vielleicht	_	ADV	_	_	-1	19	_	MO	_	_
19	gefallen	_	fallen	_	VVPP	_	_	-1	20	_	OC	_	_
20	hätte	_	haben	_	VAFIN	_	sg|3|past|subj	-1	12	_	MO	_	_
21	,	_	--	_	$,	_	_	-1	20	_	--	_	_
22	aber	_	aber	_	KON	_	_	-1	20	_	CD	_	_
23	so	_	so	_	ADV	_	_	-1	24	_	MO	_	_
24	behandelte	_	behandeln	_	VVFIN	_	sg|3|past|ind	-1	22	_	CJ	_	_
25	sie	_	sie	_	PPER	_	nom|sg|fem|3	-1	24	_	SB	_	_
26	mich	_	mich	_	PPER	_	acc|sg|*|1	-1	24	_	OA	_	_
27	wie	_	wie	_	KOKOM	_	_	-1	30	_	CM	_	_
28	einen	_	ein	_	ART	_	acc|sg|masc	-1	30	_	NK	_	_
29	dummen	_	dumm	_	ADJA	_	acc|sg|masc|pos	-1	30	_	NK	_	_
30	Buben	_	Bube	_	NN	_	acc|sg|masc	-1	24	_	MO	_	_
31	und	_	und	_	KON	_	_	-1	24	_	CD	_	_
32	lachte	_	lachen	_	VVFIN	_	sg|3|past|ind	-1	31	_	CJ	_	_
33	immer	_	immer	_	ADV	_	_	-1	34	_	MO	_	_
34	dreckig	_	dreckig	_	ADJD	_	pos	-1	32	_	MO	_	_
35	,	_	--	_	$,	_	_	-1	34	_	--	_	_
36	wenn	_	wenn	_	KOUS	_	_	-1	43	_	CP	_	_
37	ich	_	ich	_	PPER	_	nom|sg|*|1	-1	43	_	SB	_	_
38	eine	_	ein	_	ART	_	acc|sg|fem	-1	39	_	NK	_	_
39	Zigarre	_	Zigarre	_	NN	_	acc|sg|fem	-1	43	_	OA	_	_
40	von	_	von	_	APPR	_	_	-1	43	_	MO	_	_
41	ihrem	_	ihr	_	PPOSAT	_	dat|sg|masc	-1	42	_	NK	_	_
42	Papa	_	Papa	_	NN	_	dat|sg|masc	-1	40	_	NK	_	_
43	rauchte	_	rauchen	_	VVFIN	_	sg|3|past|ind	-1	32	_	MO	_	_
44	.	_	--	_	$.	_	_	-1	43	_	--	_	_
45	 	_	 	_	XY	_	_	-1	0	_	--	_	_

1	Das	_	der	_	PDS	_	nom|sg|neut	-1	2	_	SB	_	_
2	ärgerte	_	ärgern	_	VVFIN	_	sg|3|past|ind	-1	0	_	--	_	_
3	mich	_	mich	_	PPER	_	acc|sg|*|1	-1	2	_	OA	_	_
4	oft	_	oft	_	ADV	_	_	-1	2	_	MO	_	_
5	,	_	--	_	$,	_	_	-1	4	_	--	_	_
6	und	_	und	_	KON	_	_	-1	2	_	CD	_	_
7	ich	_	ich	_	PPER	_	nom|sg|*|1	-1	8	_	SB	_	_
8	unterdrückte	_	unterdrücken	_	VVFIN	_	sg|1|past|ind	-1	6	_	CJ	_	_
9	meine	_	mein	_	PPOSAT	_	acc|sg|fem	-1	10	_	NK	_	_
10	Liebe	_	Liebe	_	NN	_	acc|sg|fem	-1	8	_	OA	_	_
11	zu	_	zu	_	APPR	_	_	-1	8	_	MO	_	_
12	ihr	_	ihr	_	PPER	_	dat|sg|fem|3	-1	11	_	NK	_	_
13	und	_	und	_	KON	_	_	-1	8	_	CD	_	_
14	dachte	_	denken	_	VVFIN	_	sg|3|past|ind	-1	13	_	CJ	_	_
15	,	_	--	_	$,	_	_	-1	14	_	--	_	_
16	wenn	_	wenn	_	KOUS	_	_	-1	19	_	CP	_	_
17	ich	_	ich	_	PPER	_	nom|sg|*|1	-1	19	_	SB	_	_
18	größer	_	groß	_	ADJD	_	comp	-1	19	_	PD	_	_
19	bin	_	sein	_	VAFIN	_	sg|1|pres|ind	-1	14	_	MO	_	_
20	und	_	und	_	KON	_	_	-1	19	_	CD	_	_
21	als	_	als	_	APPR	_	_	-1	26	_	MO	_	_
22	Offizier	_	Offizier	_	NN	_	acc|sg|masc	-1	21	_	NK	_	_
23	nach	_	nach	_	APPR	_	_	-1	26	_	MO	_	_
24	einem	_	ein	_	ART	_	dat|sg|masc	-1	25	_	NK	_	_
25	Kriege	_	Krieg	_	NN	_	dat|sg|masc	-1	23	_	NK	_	_
26	heimkomme	_	heimkommen	_	VVFIN	_	sg|3|pres|subj	-1	20	_	CJ	_	_
27	,	_	--	_	$,	_	_	-1	26	_	--	_	_
28	würde	_	werden	_	VAFIN	_	sg|3|past|subj	-1	1	_	RE	_	_
29	sie	_	sie	_	PPER	_	nom|sg|fem|3	-1	28	_	SB	_	_
30	vielleicht	_	vielleicht	_	ADV	_	_	-1	32	_	MO	_	_
31	froh	_	froh	_	ADJD	_	pos	-1	32	_	PD	_	_
32	sein	_	sein	_	VAINF	_	_	-1	28	_	OC	_	_
33	.	_	--	_	$.	_	_	-1	32	_	--	_	_

1	Aber	_	aber	_	KON	_	_	-1	3	_	JU	_	_
2	dann	_	dann	_	ADV	_	_	-1	3	_	MO	_	_
3	möchte	_	möchten	_	VMFIN	_	sg|1|pres|ind	-1	0	_	--	_	_
4	ich	_	ich	_	PPER	_	nom|sg|*|1	-1	3	_	SB	_	_
5	nicht	_	nicht	_	PTKNEG	_	_	-1	3	_	NG	_	_
6	mehr	_	mehr	_	ADV	_	_	-1	5	_	MO	_	_
7	.	_	--	_	$.	_	_	-1	6	_	--	_	_

1	Sonst	_	sonst	_	ADV	_	_	-1	2	_	MO	_	_
2	war	_	sein	_	VAFIN	_	sg|3|past|ind	-1	0	_	--	_	_
3	es	_	es	_	PPER	_	nom|sg|neut|3	-1	2	_	SB	_	_
4	aber	_	aber	_	ADV	_	_	-1	2	_	MO	_	_
5	sehr	_	sehr	_	ADV	_	_	-1	6	_	MO	_	_
6	nett	_	nett	_	ADJD	_	pos	-1	2	_	MO	_	_
7	bei	_	bei	_	APPR	_	_	-1	2	_	MO	_	_
8	Herrn	_	Herr	_	NN	_	dat|sg|masc	-1	7	_	NK	_	_
9	von	_	von	_	APPR	_	_	-1	8	_	PG	_	_
10	Rupp	_	Rupp	_	NE	_	dat|sg|neut	-1	9	_	NK	_	_
11	,	_	--	_	$,	_	_	-1	10	_	--	_	_
12	und	_	und	_	KON	_	_	-1	2	_	CD	_	_
13	ich	_	ich	_	PPER	_	nom|sg|*|1	-1	14	_	SB	_	_
14	freute	_	freuen	_	VVFIN	_	sg|1|past|ind	-1	12	_	CJ	_	_
15	mich	_	mich	_	PPER	_	acc|sg|1	-1	14	_	OA	_	_
16	furchtbar	_	furchtbar	_	ADJD	_	pos	-1	14	_	MO	_	_
17	auf	_	auf	_	APPR	_	_	-1	14	_	OP	_	_
18	jeden	_	jeder	_	PIAT	_	acc|sg|masc	-1	19	_	NK	_	_
19	Sonntag	_	Sonntag	_	NN	_	acc|sg|masc	-1	17	_	NK	_	_
20	und	_	und	_	KON	_	_	-1	17	_	CD	_	_
21	auf	_	auf	_	APPR	_	_	-1	20	_	CJ	_	_
22	das	_	der	_	ART	_	acc|sg|neut	-1	23	_	NK	_	_
23	Essen	_	Essen	_	NN	_	acc|sg|neut	-1	21	_	NK	_	_
24	und	_	und	_	KON	_	_	-1	21	_	CD	_	_
25	auf	_	auf	_	APPR	_	_	-1	24	_	CJ	_	_
26	die	_	der	_	ART	_	acc|sg|fem	-1	27	_	NK	_	_
27	Zigarre	_	Zigarre	_	NN	_	acc|sg|fem	-1	25	_	NK	_	_
28	.	_	--	_	$.	_	_	-1	27	_	--	_	_
29	 	_	 	_	XY	_	_	-1	21	_	NK	_	_

1	Der	_	der	_	ART	_	nom|sg|masc	-1	2	_	NK	_	_
2	Herr	_	Herr	_	NN	_	nom|sg|masc	-1	5	_	SB	_	_
3	von	_	von	_	APPR	_	_	-1	2	_	PG	_	_
4	Rupp	_	Rupp	_	NE	_	dat|sg|neut	-1	3	_	NK	_	_
5	kannte	_	kennen	_	VVFIN	_	sg|3|past|ind	-1	0	_	--	_	_
6	auch	_	auch	_	ADV	_	_	-1	8	_	MO	_	_
7	unsern	_	unsern	_	PPOSAT	_	nom|sg|masc	-1	8	_	NK	_	_
8	Rektor	_	Rektor	_	NN	_	nom|sg|masc	-1	5	_	SB	_	_
9	und	_	und	_	KON	_	_	-1	5	_	CD	_	_
10	sprach	_	sprechen	_	VVFIN	_	sg|3|past|ind	-1	9	_	CJ	_	_
11	öfter	_	öfter	_	ADV	_	_	-1	10	_	MO	_	_
12	mit	_	mit	_	APPR	_	_	-1	10	_	MO	_	_
13	ihm	_	ihm	_	PPER	_	dat|sg|masc|3	-1	12	_	NK	_	_
14	,	_	--	_	$,	_	_	-1	13	_	--	_	_
15	daß	_	daß	_	KOUS	_	_	-1	22	_	CP	_	_
16	er	_	er	_	PPER	_	nom|sg|masc|3	-1	22	_	SB	_	_
17	mich	_	mich	_	PPER	_	acc|sg|*|1	-1	22	_	OA	_	_
18	gern	_	gern	_	ADV	_	_	-1	22	_	MO	_	_
19	in	_	in	_	APPR	_	_	-1	22	_	MO	_	_
20	seiner	_	sein	_	PPOSAT	_	dat|sg|fem	-1	21	_	NK	_	_
21	Familie	_	Familie	_	NN	_	dat|sg|fem	-1	19	_	NK	_	_
22	habe	_	haben	_	VAFIN	_	sg|3|pres|subj	-1	13	_	RE	_	_
23	,	_	--	_	$,	_	_	-1	22	_	--	_	_
24	und	_	und	_	KON	_	_	-1	22	_	CD	_	_
25	daß	_	daß	_	KOUS	_	_	-1	32	_	CP	_	_
26	ich	_	ich	_	PPER	_	nom|sg|*|1	-1	32	_	SB	_	_
27	schon	_	schon	_	ADV	_	_	-1	32	_	MO	_	_
28	noch	_	noch	_	ADV	_	_	-1	31	_	MO	_	_
29	ein	_	ein	_	ART	_	nom|sg|masc	-1	31	_	NK	_	_
30	ordentlicher	_	ordentlich	_	ADJA	_	nom|sg|masc|pos	-1	31	_	NK	_	_
31	Jägersmann	_	Jägersmann	_	NN	_	nom|sg|masc	-1	32	_	PD	_	_
32	werde	_	werden	_	VAFIN	_	sg|3|pres|subj	-1	24	_	CJ	_	_
33	,	_	--	_	$,	_	_	-1	32	_	--	_	_
34	wie	_	wie	_	PWAV	_	_	-1	36	_	CM	_	_
35	mein	_	mein	_	PPOSAT	_	nom|sg|masc	-1	36	_	NK	_	_
36	Vater	_	Vater	_	NN	_	nom|sg|masc	-1	32	_	MO	_	_
37	.	_	--	_	$.	_	_	-1	36	_	--	_	_

1	Der	_	der	_	ART	_	nom|sg|masc	-1	2	_	NK	_	_
2	Rektor	_	Rektor	_	NN	_	nom|sg|masc	-1	3	_	SB	_	_
3	muß	_	müssen	_	VMFIN	_	sg|3|pres|ind	-1	0	_	--	_	_
4	mich	_	mich	_	PRF	_	pos	-1	7	_	OA	_	_
5	aber	_	aber	_	ADV	_	_	-1	7	_	MO	_	_
6	nicht	_	nicht	_	PTKNEG	_	_	-1	7	_	NG	_	_
7	gelobt	_	loben	_	VVPP	_	_	-1	8	_	OC	_	_
8	haben	_	haben	_	VAINF	_	_	-1	3	_	OC	_	_
9	,	_	--	_	$,	_	_	-1	8	_	--	_	_
10	denn	_	denn	_	KON	_	_	-1	3	_	CD	_	_
11	Herr	_	Herr	_	NN	_	nom|sg|masc	-1	14	_	SB	_	_
12	von	_	von	_	APPR	_	_	-1	11	_	PG	_	_
13	Rupp	_	Rupp	_	NE	_	dat|sg|neut	-1	12	_	NK	_	_
14	sagte	_	sagen	_	VVFIN	_	sg|3|past|ind	-1	10	_	CJ	_	_
15	öfter	_	öfter	_	ADV	_	_	-1	14	_	MO	_	_
16	zu	_	zu	_	APPR	_	_	-1	14	_	MO	_	_
17	mir	_	sich	_	PPER	_	dat|sg|*|1	-1	16	_	NK	_	_
18	:	_	--	_	$.	_	_	-1	17	_	--	_	_

1	»	_	»	_	XY	_	_	-1	0	_	--	_	_
2	Weiß	_	weiße	_	NN	_	nom|sg|neut	-1	0	_	--	_	_
3	der	_	der	_	ART	_	gen|sg|fem	-1	4	_	NK	_	_
4	Teufel	_	Teufel	_	NN	_	gen|sg|fem	-1	2	_	AG	_	_
5	,	_	--	_	$,	_	_	-1	4	_	--	_	_
6	was	_	was	_	PRELS	_	acc|sg|neut	-1	8	_	OA	_	_
7	du	_	du	_	PPER	_	nom|sg|*|2	-1	8	_	SB	_	_
8	treibst	_	treibst	_	VVFIN	_	sg|3|pres|ind	-1	2	_	RC	_	_
9	.	_	--	_	$.	_	_	-1	8	_	--	_	_

1	Du	_	du	_	PPER	_	nom|sg|*|2	-1	2	_	SB	_	_
2	mußt	_	mußt	_	VVFIN	_	sg|3|pres|ind	-1	0	_	--	_	_
3	ein	_	ein	_	ART	_	nom|sg|masc	-1	5	_	NK	_	_
4	verdammter	_	verdammt	_	ADJA	_	nom|sg|masc|pos	-1	5	_	NK	_	_
5	Holzfuchs	_	Holzfuch	_	NN	_	nom|sg|masc	-1	6	_	PD	_	_
6	sein	_	sein	_	VAINF	_	_	-1	2	_	OC	_	_
7	,	_	--	_	$,	_	_	-1	6	_	--	_	_
8	daß	_	daß	_	KOUS	_	_	-1	14	_	CP	_	_
9	deine	_	dein	_	PPOSAT	_	nom|pl|masc	-1	10	_	NK	_	_
10	Professoren	_	Professor	_	NN	_	nom|pl|masc	-1	14	_	SB	_	_
11	so	_	so	_	ADV	_	_	-1	14	_	MO	_	_
12	auf	_	auf	_	APPR	_	_	-1	14	_	OP	_	_
13	dich	_	dich	_	PPER	_	acc|sg|*|2	-1	12	_	NK	_	_
14	loshacken	_	loshacken	_	VVINF	_	_	-1	6	_	MO	_	_
15	.	_	--	_	$.	_	_	-1	14	_	--	_	_

1	Mach	_	mach	_	VVFIN	_	sg|3|past|ind	-1	0	_	--	_	_
2	es	_	es	_	PPER	_	nom|sg|neut|3	-1	1	_	EP	_	_
3	nur	_	nur	_	ADV	_	_	-1	4	_	MO	_	_
4	nicht	_	nicht	_	PTKNEG	_	_	-1	1	_	NG	_	_
5	zu	_	zu	_	PTKA	_	_	-1	6	_	MO	_	_
6	arg	_	arg	_	ADJD	_	pos	-1	1	_	MO	_	_
7	.	_	--	_	$.	_	_	-1	6	_	--	_	_

1	«	_	«	_	XY	_	_	-1	9	_	PNC	_	_
2	Da	_	da	_	ADV	_	_	-1	7	_	MO	_	_
3	ist	_	sein	_	VAFIN	_	sg|3|pres|ind	-1	0	_	--	_	_
4	auf	_	auf	_	APPR	_	_	-1	7	_	MO	_	_
5	einmal	_	einmal	_	ADV	_	_	-1	4	_	NK	_	_
6	etwas	_	etwas	_	PIS	_	*|*|neut	-1	4	_	NK	_	_
7	passiert	_	passieren	_	VVFIN	_	sg|3|pres|ind	-1	3	_	SB	_	_
8	.	_	--	_	$.	_	_	-1	7	_	--	_	_
9	 	_	 	_	XY	_	_	-1	0	_	--	_	_

1	Das	_	der	_	PDS	_	nom|sg|neut	-1	2	_	SB	_	_
2	war	_	sein	_	VAFIN	_	sg|3|past|ind	-1	0	_	--	_	_
3	so	_	so	_	ADV	_	_	-1	2	_	MO	_	_
4	.	_	--	_	$.	_	_	-1	3	_	--	_	_

1	Immer	_	immer	_	ADV	_	_	-1	11	_	MO	_	_
2	wenn	_	wenn	_	KOUS	_	_	-1	11	_	CP	_	_
3	ich	_	ich	_	PPER	_	nom|sg|*|1	-1	11	_	SB	_	_
4	um	_	um	_	APPR	_	_	-1	11	_	MO	_	_
5	acht	_	acht	_	CARD	_	_	-1	6	_	NK	_	_
6	Uhr	_	Uhr	_	NN	_	acc|sg|fem	-1	4	_	NK	_	_
7	früh	_	früh	_	ADJD	_	pos	-1	11	_	MO	_	_
8	in	_	in	_	APPR	_	_	-1	11	_	MO	_	_
9	die	_	der	_	ART	_	acc|sg|fem	-1	10	_	NK	_	_
10	Klasse	_	Klasse	_	NN	_	acc|sg|fem	-1	8	_	NK	_	_
11	ging	_	gehen	_	VVFIN	_	sg|3|past|ind	-1	13	_	MO	_	_
12	,	_	--	_	$,	_	_	-1	11	_	--	_	_
13	kam	_	kommen	_	VVFIN	_	sg|3|past|ind	-1	0	_	--	_	_
14	die	_	der	_	ART	_	nom|sg|fem	-1	15	_	NK	_	_
15	Tochter	_	Tochter	_	NN	_	nom|sg|fem	-1	13	_	SB	_	_
16	von	_	von	_	APPR	_	_	-1	13	_	MO	_	_
17	unserem	_	unser	_	PPOSAT	_	dat|sg|masc	-1	18	_	NK	_	_
18	Hausmeister	_	Hausmeister	_	NN	_	dat|sg|masc	-1	16	_	NK	_	_
19	,	_	--	_	$,	_	_	-1	18	_	--	_	_
20	weil	_	weil	_	KOUS	_	_	-1	25	_	CP	_	_
21	sie	_	sie	_	PPER	_	nom|sg|fem|3	-1	25	_	SB	_	_
22	in	_	in	_	APPR	_	_	-1	25	_	MO	_	_
23	das	_	der	_	ART	_	acc|sg|neut	-1	24	_	NK	_	_
24	Institut	_	Institut	_	NN	_	acc|sg|neut	-1	22	_	NK	_	_
25	mußte	_	müssen	_	VMFIN	_	sg|3|past|ind	-1	13	_	MO	_	_
26	.	_	--	_	$.	_	_	-1	25	_	--	_	_
27	 	_	 	_	XY	_	_	-1	0	_	--	_	_

1	Sie	_	sie	_	PPER	_	nom|sg|fem|3	-1	2	_	SB	_	_
2	war	_	sein	_	VAFIN	_	sg|3|past|ind	-1	0	_	--	_	_
3	sehr	_	sehr	_	ADV	_	_	-1	4	_	MO	_	_
4	hübsch	_	hübsch	_	ADJD	_	pos	-1	2	_	PD	_	_
5	und	_	und	_	KON	_	_	-1	2	_	CD	_	_
6	hatte	_	haben	_	VAFIN	_	sg|3|past|ind	-1	5	_	CJ	_	_
7	zwei	_	zwei	_	CARD	_	_	-1	9	_	NK	_	_
8	große	_	groß	_	ADJA	_	acc|pl|masc|pos	-1	9	_	NK	_	_
9	Zöpfe	_	Zopf	_	NN	_	acc|pl|masc	-1	6	_	OA	_	_
10	mit	_	mit	_	APPR	_	_	-1	9	_	MNR	_	_
11	roten	_	rot	_	ADJA	_	dat|pl|neut|pos	-1	12	_	NK	_	_
12	Bändern	_	Band	_	NN	_	dat|pl|neut	-1	10	_	NK	_	_
13	daran	_	daran	_	PROAV	_	_	-1	9	_	OP	_	_
14	und	_	und	_	KON	_	_	-1	6	_	CD	_	_
15	schon	_	schon	_	ADV	_	_	-1	17	_	MO	_	_
16	einen	_	ein	_	ART	_	acc|sg|masc	-1	17	_	NK	_	_
17	Busen	_	Busen	_	NN	_	acc|sg|masc	-1	14	_	CJ	_	_
18	.	_	--	_	$.	_	_	-1	17	_	--	_	_

1	Mein	_	mein	_	PPOSAT	_	nom|sg|masc	-1	2	_	NK	_	_
2	Freund	_	Freund	_	NN	_	nom|sg|masc	-1	4	_	SB	_	_
3	Raithel	_	Raithel	_	NE	_	nom|sg|masc	-1	2	_	NK	_	_
4	sagte	_	sagen	_	VVFIN	_	sg|3|past|ind	-1	0	_	--	_	_
5	auch	_	auch	_	ADV	_	_	-1	4	_	MO	_	_
6	immer	_	immer	_	ADV	_	_	-1	4	_	MO	_	_
7	,	_	--	_	$,	_	_	-1	6	_	--	_	_
8	daß	_	daß	_	KOUS	_	_	-1	12	_	CP	_	_
9	sie	_	sie	_	PPER	_	nom|sg|fem|3	-1	12	_	SB	_	_
10	gute	_	gut	_	ADJA	_	acc|pl|fem|pos	-1	11	_	NK	_	_
11	Potenzen	_	Potenz	_	NN	_	acc|pl|fem	-1	12	_	OA	_	_
12	habe	_	haben	_	VAFIN	_	sg|3|pres|subj	-1	4	_	OC	_	_
13	und	_	und	_	KON	_	_	-1	12	_	CD	_	_
14	ein	_	ein	_	ART	_	nom|sg|masc	-1	16	_	NK	_	_
15	feiner	_	fein	_	ADJA	_	nom|sg|masc|pos	-1	16	_	NK	_	_
16	Backfisch	_	Backfisch	_	NN	_	nom|sg|masc	-1	17	_	PD	_	_
17	sei	_	sein	_	VAFIN	_	sg|3|pres|subj	-1	13	_	CJ	_	_
18	.	_	--	_	$.	_	_	-1	17	_	--	_	_
19	 	_	 	_	XY	_	_	-1	0	_	--	_	_

1	Zuerst	_	zuerst	_	ADV	_	_	-1	2	_	MO	_	_
2	traute	_	trauen	_	VVFIN	_	sg|1|past|ind	-1	0	_	--	_	_
3	ich	_	ich	_	PPER	_	nom|sg|*|1	-1	2	_	SB	_	_
4	mich	_	mich	_	PRF	_	acc|sg|1	-1	2	_	OA	_	_
5	nicht	_	nicht	_	PTKNEG	_	_	-1	2	_	NG	_	_
6	,	_	--	_	$,	_	_	-1	5	_	--	_	_
7	sie	_	sie	_	PPER	_	nom|sg|fem|3	-1	9	_	OA	_	_
8	zu	_	zu	_	PTKZU	_	_	-1	9	_	PM	_	_
9	grüßen	_	grüßen	_	VVINF	_	_	-1	2	_	OC	_	_
10	;	_	--	_	$.	_	_	-1	9	_	--	_	_

1	aber	_	aber	_	ADV	_	_	-1	2	_	MO	_	_
2	einmal	_	einmal	_	ADV	_	_	-1	3	_	MO	_	_
3	traute	_	trauen	_	VVFIN	_	sg|1|past|ind	-1	0	_	--	_	_
4	ich	_	ich	_	PPER	_	nom|sg|*|1	-1	3	_	SB	_	_
5	mich	_	mich	_	PRF	_	acc|sg|1	-1	3	_	OA	_	_
6	doch	_	doch	_	ADV	_	_	-1	3	_	MO	_	_
7	,	_	--	_	$,	_	_	-1	6	_	--	_	_
8	und	_	und	_	KON	_	_	-1	3	_	CD	_	_
9	sie	_	sie	_	PPER	_	nom|sg|fem|3	-1	10	_	SB	_	_
10	wurde	_	werden	_	VAFIN	_	sg|3|past|ind	-1	8	_	CJ	_	_
11	ganz	_	ganz	_	ADV	_	_	-1	12	_	MO	_	_
12	rot	_	rot	_	ADJD	_	pos	-1	10	_	PD	_	_
13	.	_	--	_	$.	_	_	-1	12	_	--	_	_

1	Ich	_	ich	_	PPER	_	nom|sg|*|1	-1	2	_	SB	_	_
2	merkte	_	merken	_	VVFIN	_	sg|1|pres|ind	-1	0	_	--	_	_
3	auch	_	auch	_	ADV	_	_	-1	2	_	MO	_	_
4	,	_	--	_	$,	_	_	-1	3	_	--	_	_
5	daß	_	daß	_	KOUS	_	_	-1	9	_	CP	_	_
6	sie	_	sie	_	PPER	_	nom|sg|fem|3	-1	9	_	SB	_	_
7	auf	_	auf	_	APPR	_	_	-1	9	_	OP	_	_
8	mich	_	mich	_	PPER	_	acc|sg|*|1	-1	7	_	NK	_	_
9	wartete	_	warten	_	VVFIN	_	sg|3|past|ind	-1	2	_	OC	_	_
10	,	_	--	_	$,	_	_	-1	9	_	--	_	_
11	wenn	_	wenn	_	KOUS	_	_	-1	15	_	CP	_	_
12	ich	_	ich	_	PPER	_	nom|sg|*|1	-1	15	_	SB	_	_
13	später	_	spät	_	ADJD	_	comp	-1	15	_	MO	_	_
14	daran	_	daran	_	PROAV	_	_	-1	15	_	MO	_	_
15	war	_	sein	_	VAFIN	_	sg|3|past|ind	-1	9	_	MO	_	_
16	.	_	--	_	$.	_	_	-1	15	_	--	_	_

1	Sie	_	sie	_	PPER	_	nom|sg|fem|3	-1	2	_	SB	_	_
2	blieb	_	bleiben	_	VVFIN	_	sg|3|past|ind	-1	0	_	--	_	_
3	vor	_	vor	_	APPR	_	_	-1	6	_	MO	_	_
4	dem	_	der	_	ART	_	dat|sg|neut	-1	5	_	NK	_	_
5	Hause	_	Haus	_	NN	_	dat|sg|neut	-1	3	_	NK	_	_
6	stehen	_	stehen	_	VVFIN	_	pl|3|pres|ind	-1	2	_	OC	_	_
7	und	_	und	_	KON	_	_	-1	2	_	CD	_	_
8	schaute	_	schauen	_	VVFIN	_	sg|3|past|ind	-1	7	_	CJ	_	_
9	in	_	in	_	APPR	_	_	-1	8	_	MO	_	_
10	den	_	der	_	ART	_	dat|pl|masc	-1	11	_	NK	_	_
11	Buchbinderladen	_	Buchbinderlade	_	NN	_	dat|pl|masc	-1	9	_	NK	_	_
12	hinein	_	hinein	_	PTKVZ	_	_	-1	8	_	SVP	_	_
13	,	_	--	_	$,	_	_	-1	12	_	--	_	_
14	bis	_	bis	_	KOUS	_	_	-1	16	_	CP	_	_
15	ich	_	ich	_	PPER	_	nom|sg|*|1	-1	16	_	SB	_	_
16	kam	_	kommen	_	VVFIN	_	sg|1|past|ind	-1	8	_	MO	_	_
17	.	_	--	_	$.	_	_	-1	16	_	--	_	_

1	Dann	_	dann	_	ADV	_	_	-1	2	_	MO	_	_
2	lachte	_	lachen	_	VVFIN	_	sg|3|past|ind	-1	0	_	--	_	_
3	sie	_	sie	_	PPER	_	nom|sg|fem|3	-1	2	_	SB	_	_
4	freundlich	_	freundlich	_	ADJD	_	pos	-1	2	_	MO	_	_
5	,	_	--	_	$,	_	_	-1	4	_	--	_	_
6	und	_	und	_	KON	_	_	-1	2	_	CD	_	_
7	ich	_	ich	_	PPER	_	nom|sg|*|1	-1	8	_	SB	_	_
8	nahm	_	nehmen	_	VVFIN	_	sg|3|past|ind	-1	6	_	CJ	_	_
9	mir	_	sich	_	PPER	_	dat|sg|*|1	-1	8	_	DA	_	_
10	vor	_	vor	_	PTKVZ	_	_	-1	8	_	SVP	_	_
11	,	_	--	_	$,	_	_	-1	10	_	--	_	_
12	sie	_	sie	_	PPER	_	nom|pl|*|3	-1	13	_	OA	_	_
13	anzureden	_	anreden	_	VVIZU	_	_	-1	8	_	OC	_	_
14	.	_	--	_	$.	_	_	-1	13	_	--	_	_
15	 	_	 	_	XY	_	_	-1	0	_	--	_	_

1	Ich	_	ich	_	PPER	_	nom|sg|*|1	-1	2	_	SB	_	_
2	brachte	_	bringen	_	VVFIN	_	sg|3|past|ind	-1	0	_	--	_	_
3	es	_	es	_	PPER	_	acc|sg|neut|3	-1	2	_	OA	_	_
4	aber	_	aber	_	ADV	_	_	-1	2	_	MO	_	_
5	nicht	_	nicht	_	PTKNEG	_	_	-1	6	_	NG	_	_
6	fertig	_	fertig	_	ADJD	_	pos	-1	2	_	MO	_	_
7	vor	_	vor	_	APPR	_	_	-1	2	_	MO	_	_
8	lauter	_	laut	_	PIAT	_	*|*|*	-1	9	_	NK	_	_
9	Herzklopfen	_	Herzklopfen	_	NN	_	nom|pl|fem	-1	7	_	NK	_	_
10	;	_	--	_	$.	_	_	-1	9	_	--	_	_

1	einmal	_	einmal	_	ADV	_	_	-1	8	_	MO	_	_
2	bin	_	sein	_	VAFIN	_	sg|1|pres|ind	-1	16	_	OC	_	_
3	ich	_	ich	_	PPER	_	nom|sg|*|1	-1	2	_	SB	_	_
4	ganz	_	ganz	_	ADV	_	_	-1	5	_	MO	_	_
5	nahe	_	nahe	_	ADJD	_	pos	-1	8	_	MO	_	_
6	an	_	an	_	APPR	_	_	-1	8	_	MO	_	_
7	sie	_	sie	_	PPER	_	acc|sg|fem|3	-1	6	_	NK	_	_
8	hingegangen	_	hingehen	_	VVPP	_	_	-1	2	_	OC	_	_
9	,	_	--	_	$,	_	_	-1	8	_	--	_	_
10	aber	_	aber	_	KON	_	_	-1	2	_	CD	_	_
11	wie	_	wie	_	PWAV	_	_	-1	14	_	MO	_	_
12	ich	_	ich	_	PPER	_	nom|sg|*|1	-1	14	_	SB	_	_
13	dort	_	dort	_	ADV	_	_	-1	14	_	MO	_	_
14	war	_	sein	_	VAFIN	_	sg|1|past|ind	-1	10	_	CJ	_	_
15	,	_	--	_	$,	_	_	-1	14	_	--	_	_
16	räusperte	_	räuspern	_	VVFIN	_	sg|1|past|ind	-1	0	_	--	_	_
17	ich	_	ich	_	PPER	_	nom|sg|*|1	-1	16	_	SB	_	_
18	bloß	_	bloß	_	ADV	_	_	-1	16	_	MO	_	_
19	und	_	und	_	KON	_	_	-1	16	_	CD	_	_
20	grüßte	_	grüßen	_	VVFIN	_	sg|3|past|ind	-1	19	_	CJ	_	_
21	.	_	--	_	$.	_	_	-1	20	_	--	_	_

1	Ich	_	ich	_	PPER	_	nom|sg|*|1	-1	2	_	SB	_	_
2	war	_	sein	_	VAFIN	_	sg|1|past|ind	-1	0	_	--	_	_
3	ganz	_	ganz	_	ADV	_	_	-1	4	_	MO	_	_
4	heiser	_	heiser	_	ADJD	_	comp	-1	5	_	PD	_	_
5	geworden	_	werden	_	VAPP	_	_	-1	2	_	OC	_	_
6	und	_	und	_	KON	_	_	-1	2	_	CD	_	_
7	konnte	_	können	_	VMFIN	_	sg|3|past|ind	-1	6	_	CJ	_	_
8	nicht	_	nicht	_	PTKNEG	_	_	-1	7	_	NG	_	_
9	reden	_	reden	_	VVINF	_	_	-1	7	_	OC	_	_
10	.	_	--	_	$.	_	_	-1	9	_	--	_	_
11	 	_	 	_	XY	_	_	-1	0	_	--	_	_

1	Der	_	der	_	ART	_	nom|sg|masc	-1	2	_	NK	_	_
2	Raithel	_	Raithel	_	NE	_	nom|sg|masc	-1	3	_	SB	_	_
3	lachte	_	lachten	_	VVFIN	_	sg|3|past|ind	-1	0	_	--	_	_
4	mich	_	mich	_	PPER	_	acc|sg|*|1	-1	3	_	OA	_	_
5	aus	_	aus	_	PTKVZ	_	_	-1	3	_	SVP	_	_
6	und	_	und	_	KON	_	_	-1	3	_	CD	_	_
7	sagte	_	sagen	_	VVFIN	_	sg|3|past|ind	-1	6	_	CJ	_	_
8	,	_	--	_	$,	_	_	-1	7	_	--	_	_
9	es	_	es	_	PPER	_	nom|sg|neut|3	-1	10	_	SB	_	_
10	sei	_	sein	_	VAFIN	_	sg|3|pres|subj	-1	7	_	OC	_	_
11	doch	_	doch	_	ADV	_	_	-1	10	_	MO	_	_
12	gar	_	gar	_	ADV	_	_	-1	13	_	MO	_	_
13	nichts	_	nichts	_	PIS	_	*|*|neut	-1	10	_	SB	_	_
14	dabei	_	dabei	_	PROAV	_	_	-1	10	_	MO	_	_
15	,	_	--	_	$,	_	_	-1	14	_	--	_	_
16	mit	_	mit	_	APPR	_	_	-1	19	_	MO	_	_
17	einem	_	ein	_	ART	_	dat|sg|masc	-1	18	_	NK	_	_
18	Backfisch	_	Backfisch	_	NN	_	dat|sg|masc	-1	16	_	NK	_	_
19	anzubinden	_	anbinden	_	VVIZU	_	_	-1	9	_	RE	_	_
20	.	_	--	_	$.	_	_	-1	19	_	--	_	_

1	Er	_	er	_	PPER	_	nom|sg|masc|3	-1	2	_	SB	_	_
2	könnte	_	können	_	VMFIN	_	sg|3|past|subj	-1	0	_	--	_	_
3	jeden	_	jeder	_	PIAT	_	acc|sg|masc	-1	4	_	NK	_	_
4	Tag	_	Tag	_	NN	_	acc|sg|masc	-1	6	_	OA	_	_
5	drei	_	drei	_	CARD	_	_	-1	4	_	NK	_	_
6	ansprechen	_	ansprechen	_	VVINF	_	_	-1	2	_	OC	_	_
7	,	_	--	_	$,	_	_	-1	6	_	--	_	_
8	wenn	_	wenn	_	KOUS	_	_	-1	10	_	CP	_	_
9	er	_	er	_	PPER	_	nom|sg|masc|3	-1	10	_	SB	_	_
10	möchte	_	möchten	_	VMFIN	_	sg|3|pres|ind	-1	2	_	MO	_	_
11	,	_	--	_	$,	_	_	-1	10	_	--	_	_
12	aber	_	aber	_	KON	_	_	-1	10	_	CD	_	_
13	sie	_	sie	_	PPER	_	nom|pl|fem|3	-1	14	_	SB	_	_
14	seien	_	sein	_	VAFIN	_	pl|3|pres|subj	-1	12	_	CJ	_	_
15	ihm	_	ihm	_	PPER	_	dat|sg|masc|3	-1	18	_	DA	_	_
16	alle	_	aller	_	PIS	_	nom|pl|*	-1	13	_	NK	_	_
17	zu	_	zu	_	APPR	_	_	-1	18	_	MO	_	_
18	dumm	_	dumm	_	ADJD	_	pos	-1	14	_	PD	_	_
19	.	_	--	_	$.	_	_	-1	18	_	--	_	_
20	 	_	 	_	XY	_	_	-1	17	_	NK	_	_

1	Ich	_	ich	_	PPER	_	nom|sg|*|1	-1	2	_	SB	_	_
2	dachte	_	denken	_	VVFIN	_	sg|1|past|ind	-1	0	_	--	_	_
3	viel	_	viel	_	ADV	_	_	-1	2	_	MO	_	_
4	darüber	_	darüber	_	PROAV	_	_	-1	2	_	OP	_	_
5	nach	_	nach	_	PTKVZ	_	_	-1	2	_	SVP	_	_
6	,	_	--	_	$,	_	_	-1	5	_	--	_	_
7	und	_	und	_	KON	_	_	-1	2	_	CD	_	_
8	wenn	_	wenn	_	KOUS	_	_	-1	13	_	CP	_	_
9	ich	_	ich	_	PPER	_	nom|sg|*|1	-1	13	_	SB	_	_
10	von	_	von	_	APPR	_	_	-1	13	_	MO	_	_
11	ihr	_	ihr	_	PPER	_	dat|sg|fem|3	-1	10	_	NK	_	_
12	weg	_	weg	_	PTKVZ	_	_	-1	13	_	PD	_	_
13	war	_	sein	_	VAFIN	_	sg|3|past|ind	-1	4	_	RE	_	_
14	,	_	--	_	$,	_	_	-1	13	_	--	_	_
15	meinte	_	meinen	_	VVFIN	_	sg|3|past|ind	-1	7	_	CJ	_	_
16	ich	_	ich	_	PPER	_	nom|sg|*|1	-1	15	_	SB	_	_
17	auch	_	auch	_	ADV	_	_	-1	15	_	MO	_	_
18	,	_	--	_	$,	_	_	-1	17	_	--	_	_
19	es	_	es	_	PPER	_	nom|sg|neut|3	-1	20	_	SB	_	_
20	sei	_	sein	_	VAFIN	_	sg|3|pres|subj	-1	15	_	OC	_	_
21	ganz	_	ganz	_	ADV	_	_	-1	22	_	MO	_	_
22	leicht	_	leicht	_	ADJD	_	pos	-1	20	_	PD	_	_
23	.	_	--	_	$.	_	_	-1	22	_	--	_	_

1	Sie	_	sie	_	PPER	_	nom|sg|fem|3	-1	2	_	SB	_	_
2	war	_	sein	_	VAFIN	_	sg|3|past|ind	-1	0	_	--	_	_
3	doch	_	doch	_	ADV	_	_	-1	2	_	MO	_	_
4	bloß	_	bloß	_	ADV	_	_	-1	2	_	MO	_	_
5	die	_	der	_	ART	_	acc|sg|fem	-1	6	_	NK	_	_
6	Tochter	_	Tochter	_	NN	_	acc|sg|fem	-1	2	_	PD	_	_
7	von	_	von	_	APPR	_	_	-1	6	_	MNR	_	_
8	einem	_	ein	_	ART	_	dat|sg|masc	-1	9	_	NK	_	_
9	Hausmeister	_	Hausmeister	_	NN	_	dat|sg|masc	-1	7	_	NK	_	_
10	,	_	--	_	$,	_	_	-1	9	_	--	_	_
11	und	_	und	_	KON	_	_	-1	2	_	CD	_	_
12	ich	_	ich	_	PPER	_	nom|sg|*|1	-1	13	_	SB	_	_
13	war	_	sein	_	VAFIN	_	sg|1|past|ind	-1	11	_	CJ	_	_
14	schon	_	schon	_	ADV	_	_	-1	13	_	MO	_	_
15	in	_	in	_	APPR	_	_	-1	13	_	MO	_	_
16	der	_	der	_	ART	_	dat|sg|fem	-1	18	_	NK	_	_
17	fünften	_	fünfter	_	ADJA	_	dat|sg|fem|pos	-1	18	_	NK	_	_
18	Lateinklasse	_	Lateinklasse	_	NN	_	dat|sg|fem	-1	15	_	NK	_	_
19	.	_	--	_	$.	_	_	-1	18	_	--	_	_

1	Aber	_	aber	_	KON	_	_	-1	7	_	JU	_	_
2	wenn	_	wenn	_	KOUS	_	_	-1	5	_	CP	_	_
3	ich	_	ich	_	PPER	_	nom|sg|*|1	-1	5	_	SB	_	_
4	sie	_	sie	_	PPER	_	acc|sg|fem|3	-1	5	_	OA	_	_
5	sah	_	sehen	_	VVFIN	_	sg|1|past|ind	-1	7	_	MO	_	_
6	,	_	--	_	$,	_	_	-1	5	_	--	_	_
7	war	_	sein	_	VAFIN	_	sg|3|past|ind	-1	0	_	--	_	_
8	es	_	es	_	PPER	_	nom|sg|neut|3	-1	7	_	SB	_	_
9	ganz	_	ganz	_	ADV	_	_	-1	10	_	MO	_	_
10	merkwürdig	_	merkwürdig	_	ADJD	_	pos	-1	7	_	PD	_	_
11	und	_	und	_	KON	_	_	-1	7	_	CD	_	_
12	ging	_	gehen	_	VVFIN	_	sg|3|past|ind	-1	11	_	CJ	_	_
13	nicht	_	nicht	_	PTKNEG	_	_	-1	12	_	NG	_	_
14	.	_	--	_	$.	_	_	-1	13	_	--	_	_

1	Da	_	da	_	ADV	_	_	-1	2	_	MO	_	_
2	kam	_	kommen	_	VVFIN	_	sg|3|past|ind	-1	0	_	--	_	_
3	ich	_	ich	_	PPER	_	nom|sg|*|1	-1	2	_	SB	_	_
4	auf	_	auf	_	APPR	_	_	-1	2	_	MO	_	_
5	eine	_	ein	_	ART	_	acc|sg|fem	-1	7	_	NK	_	_
6	gute	_	gut	_	ADJA	_	acc|sg|fem|pos	-1	7	_	NK	_	_
7	Idee	_	Idee	_	NN	_	acc|sg|fem	-1	4	_	NK	_	_
8	.	_	--	_	$.	_	_	-1	7	_	--	_	_

1	Ich	_	ich	_	PPER	_	nom|sg|*|1	-1	2	_	SB	_	_
2	schrieb	_	schreiben	_	VVFIN	_	sg|3|past|ind	-1	0	_	--	_	_
3	einen	_	ein	_	ART	_	acc|sg|masc	-1	4	_	NK	_	_
4	Brief	_	Brief	_	NN	_	acc|sg|masc	-1	2	_	OA	_	_
5	an	_	an	_	APPR	_	_	-1	2	_	MO	_	_
6	sie	_	sie	_	PPER	_	acc|pl|*|3	-1	5	_	NK	_	_
7	,	_	--	_	$,	_	_	-1	6	_	--	_	_
8	daß	_	daß	_	KOUS	_	_	-1	11	_	CP	_	_
9	ich	_	ich	_	PPER	_	nom|sg|*|1	-1	11	_	SB	_	_
10	sie	_	sie	_	PPER	_	acc|sg|fem|3	-1	11	_	OA	_	_
11	liebte	_	lieben	_	VVFIN	_	sg|1|past|ind	-1	2	_	OC	_	_
12	,	_	--	_	$,	_	_	-1	11	_	--	_	_
13	aber	_	aber	_	KON	_	_	-1	2	_	CD	_	_
14	daß	_	daß	_	KOUS	_	_	-1	16	_	CP	_	_
15	ich	_	ich	_	PPER	_	nom|sg|*|1	-1	16	_	SB	_	_
16	fürchte	_	fürchen	_	VVFIN	_	sg|1|past|ind	-1	13	_	CJ	_	_
17	,	_	--	_	$,	_	_	-1	16	_	--	_	_
18	sie	_	sie	_	PPER	_	nom|sg|fem|3	-1	19	_	SB	_	_
19	wäre	_	sein	_	VAFIN	_	sg|3|past|subj	-1	16	_	OC	_	_
20	beleidigt	_	beleidigen	_	VVPP	_	_	-1	19	_	OC	_	_
21	,	_	--	_	$,	_	_	-1	20	_	--	_	_
22	wenn	_	wenn	_	KOUS	_	_	-1	25	_	CP	_	_
23	ich	_	ich	_	PPER	_	nom|sg|*|1	-1	25	_	SB	_	_
24	sie	_	sie	_	PPER	_	acc|sg|fem|3	-1	25	_	OA	_	_
25	anspreche	_	ansprechen	_	VVFIN	_	sg|3|pres|subj	-1	20	_	MO	_	_
26	und	_	und	_	KON	_	_	-1	25	_	CD	_	_
27	es	_	es	_	PPER	_	nom|sg|neut|3	-1	29	_	SB	_	_
28	ihr	_	ihr	_	PPER	_	dat|sg|fem|3	-1	29	_	DA	_	_
29	gestehe	_	gestehen	_	VVFIN	_	sg|3|pres|subj	-1	26	_	CJ	_	_
30	.	_	--	_	$.	_	_	-1	29	_	--	_	_

1	Und	_	und	_	KON	_	_	-1	3	_	JU	_	_
2	sie	_	sie	_	PPER	_	nom|sg|fem|3	-1	3	_	SB	_	_
3	sollte	_	sollen	_	VMFIN	_	sg|3|past|ind	-1	0	_	--	_	_
4	ihr	_	ihr	_	PPOSAT	_	nom|sg|masc	-1	5	_	NK	_	_
5	Sacktuch	_	Sacktuch	_	NN	_	nom|sg|masc	-1	9	_	OA	_	_
6	in	_	in	_	APPR	_	_	-1	9	_	MO	_	_
7	der	_	der	_	ART	_	dat|sg|fem	-1	8	_	NK	_	_
8	Hand	_	Hand	_	NN	_	dat|sg|fem	-1	6	_	NK	_	_
9	tragen	_	tragen	_	VVFIN	_	pl|3|pres|ind	-1	3	_	OC	_	_
10	und	_	und	_	KON	_	_	-1	9	_	CD	_	_
11	an	_	an	_	APPR	_	_	-1	14	_	MO	_	_
12	den	_	der	_	ART	_	acc|sg|masc	-1	13	_	NK	_	_
13	Mund	_	Mund	_	NN	_	acc|sg|masc	-1	11	_	NK	_	_
14	führen	_	führen	_	VVINF	_	_	-1	10	_	CJ	_	_
15	,	_	--	_	$,	_	_	-1	14	_	--	_	_
16	wenn	_	wenn	_	KOUS	_	_	-1	20	_	CP	_	_
17	es	_	es	_	PPER	_	nom|sg|neut|3	-1	20	_	SB	_	_
18	ihr	_	ihr	_	PPER	_	dat|sg|fem|3	-1	19	_	DA	_	_
19	recht	_	recht	_	ADJD	_	pos	-1	20	_	PD	_	_
20	wäre	_	sein	_	VAFIN	_	sg|3|past|subj	-1	14	_	MO	_	_
21	.	_	--	_	$.	_	_	-1	20	_	--	_	_
22	 	_	 	_	XY	_	_	-1	0	_	--	_	_

1	Den	_	der	_	ART	_	acc|sg|masc	-1	2	_	NK	_	_
2	Brief	_	Brief	_	NN	_	acc|sg|masc	-1	3	_	OA	_	_
3	steckte	_	stecken	_	VVFIN	_	sg|1|pres|ind	-1	0	_	--	_	_
4	ich	_	ich	_	PPER	_	nom|sg|*|1	-1	3	_	SB	_	_
5	in	_	in	_	APPR	_	_	-1	3	_	MO	_	_
6	meinen	_	mein	_	PPOSAT	_	dat|pl|neut	-1	7	_	NK	_	_
7	Caesar	_	Caesar	_	NN	_	dat|pl|neut	-1	5	_	NK	_	_
8	,	_	--	_	$,	_	_	-1	7	_	--	_	_
9	De	_	De	_	NE	_	*|*|*	-1	11	_	PNC	_	_
10	bello	_	bello	_	NE	_	dat|sg|neut	-1	11	_	PNC	_	_
11	gallico	_	gallico	_	NE	_	dat|sg|neut	-1	7	_	APP	_	_
12	,	_	--	_	$,	_	_	-1	11	_	--	_	_
13	und	_	und	_	KON	_	_	-1	3	_	CD	_	_
14	ich	_	ich	_	PPER	_	nom|sg|*|1	-1	15	_	SB	_	_
15	wollte	_	wollen	_	VMFIN	_	sg|1|past|ind	-1	13	_	CJ	_	_
16	ihn	_	ihn	_	PPER	_	acc|sg|masc|3	-1	17	_	OA	_	_
17	hergeben	_	hergeben	_	VVINF	_	_	-1	15	_	OC	_	_
18	,	_	--	_	$,	_	_	-1	17	_	--	_	_
19	wenn	_	wenn	_	KOUS	_	_	-1	26	_	CP	_	_
20	ich	_	ich	_	PPER	_	nom|sg|*|1	-1	26	_	SB	_	_
21	sie	_	sie	_	PPER	_	acc|sg|fem|3	-1	26	_	OA	_	_
22	in	_	in	_	APPR	_	_	-1	26	_	MO	_	_
23	der	_	der	_	ART	_	dat|sg|fem	-1	24	_	NK	_	_
24	Frühe	_	Frühe	_	NN	_	dat|sg|fem	-1	22	_	NK	_	_
25	wieder	_	wieder	_	ADV	_	_	-1	26	_	MO	_	_
26	sah	_	sehen	_	VVFIN	_	sg|3|past|ind	-1	15	_	MO	_	_
27	.	_	--	_	$.	_	_	-1	26	_	--	_	_
28	 	_	 	_	XY	_	_	-1	0	_	--	_	_

1	Aber	_	aber	_	KON	_	_	-1	3	_	JU	_	_
2	das	_	der	_	PDS	_	nom|sg|neut	-1	3	_	SB	_	_
3	war	_	sein	_	VAFIN	_	sg|3|past|ind	-1	0	_	--	_	_
4	noch	_	noch	_	ADV	_	_	-1	3	_	MO	_	_
5	schwerer	_	schwer	_	ADJD	_	comp	-1	3	_	PD	_	_
6	.	_	--	_	$.	_	_	-1	5	_	--	_	_
7	 	_	 	_	XY	_	_	-1	0	_	--	_	_

1	Am	_	an	_	APPRART	_	dat|sg|masc	-1	4	_	MO	_	_
2	ersten	_	erster	_	ADJA	_	dat|sg|masc|pos	-1	3	_	NK	_	_
3	Tag	_	Tag	_	NN	_	dat|sg|masc	-1	1	_	NK	_	_
4	probierte	_	probieren	_	VVFIN	_	sg|1|past|ind	-1	0	_	--	_	_
5	ich	_	ich	_	PPER	_	nom|sg|*|1	-1	4	_	SB	_	_
6	es	_	es	_	PPER	_	acc|sg|neut|3	-1	4	_	OA	_	_
7	gar	_	gar	_	ADV	_	_	-1	8	_	MO	_	_
8	nicht	_	nicht	_	PTKNEG	_	_	-1	4	_	NG	_	_
9	;	_	--	_	$.	_	_	-1	8	_	--	_	_

1	dann	_	dann	_	ADV	_	_	-1	2	_	MO	_	_
2	am	_	an	_	APPRART	_	dat|sg|masc	-1	5	_	MO	_	_
3	nächsten	_	nächster	_	ADJA	_	dat|sg|masc|pos	-1	4	_	NK	_	_
4	Tag	_	Tag	_	NN	_	dat|sg|masc	-1	2	_	NK	_	_
5	hatte	_	haben	_	VAFIN	_	sg|1|past|ind	-1	19	_	OC	_	_
6	ich	_	ich	_	PPER	_	nom|sg|*|1	-1	5	_	SB	_	_
7	den	_	der	_	ART	_	acc|sg|masc	-1	8	_	NK	_	_
8	Brief	_	Brief	_	NN	_	acc|sg|masc	-1	5	_	OA	_	_
9	schon	_	schon	_	ADV	_	_	-1	10	_	MO	_	_
10	in	_	in	_	APPR	_	_	-1	8	_	MNR	_	_
11	der	_	der	_	ART	_	dat|sg|fem	-1	12	_	NK	_	_
12	Hand	_	Hand	_	NN	_	dat|sg|fem	-1	10	_	NK	_	_
13	,	_	--	_	$,	_	_	-1	12	_	--	_	_
14	aber	_	aber	_	KON	_	_	-1	5	_	CD	_	_
15	wie	_	wie	_	PWAV	_	_	-1	17	_	MO	_	_
16	sie	_	sie	_	PPER	_	nom|pl|fem|3	-1	17	_	SB	_	_
17	kam	_	kommen	_	VVFIN	_	sg|3|past|ind	-1	14	_	CJ	_	_
18	,	_	--	_	$,	_	_	-1	17	_	--	_	_
19	steckte	_	stecken	_	VVFIN	_	sg|1|past|ind	-1	0	_	--	_	_
20	ich	_	ich	_	PPER	_	nom|sg|*|1	-1	19	_	SB	_	_
21	ihn	_	ihn	_	PPER	_	acc|sg|masc|3	-1	19	_	OA	_	_
22	schnell	_	schnell	_	ADJD	_	pos	-1	19	_	MO	_	_
23	in	_	in	_	APPR	_	_	-1	19	_	MO	_	_
24	die	_	der	_	ART	_	acc|sg|fem	-1	25	_	NK	_	_
25	Tasche	_	Tasche	_	NN	_	acc|sg|fem	-1	23	_	NK	_	_
26	.	_	--	_	$.	_	_	-1	25	_	--	_	_
27	 	_	 	_	XY	_	_	-1	0	_	--	_	_

1	Raithel	_	Raithel	_	NE	_	nom|sg|*	-1	2	_	SB	_	_
2	sagte	_	sagen	_	VVFIN	_	sg|3|past|ind	-1	0	_	--	_	_
3	mir	_	sich	_	PPER	_	dat|sg|*|1	-1	2	_	DA	_	_
4	,	_	--	_	$,	_	_	-1	3	_	--	_	_
5	ich	_	ich	_	PPER	_	nom|sg|*|1	-1	6	_	SB	_	_
6	solle	_	sollen	_	VMFIN	_	sg|3|pres|subj	-1	2	_	OC	_	_
7	ihn	_	ihn	_	PPER	_	acc|sg|masc|3	-1	9	_	OA	_	_
8	einfach	_	einfach	_	ADV	_	_	-1	6	_	MO	_	_
9	hergeben	_	hergeben	_	VVINF	_	_	-1	6	_	OC	_	_
10	und	_	und	_	KON	_	_	-1	9	_	CD	_	_
11	fragen	_	fragen	_	VVINF	_	_	-1	10	_	CJ	_	_
12	,	_	--	_	$,	_	_	-1	11	_	--	_	_
13	ob	_	ob	_	KOUS	_	_	-1	17	_	CP	_	_
14	sie	_	sie	_	PPER	_	nom|sg|fem|3	-1	17	_	SB	_	_
15	ihn	_	ihn	_	PPER	_	acc|sg|masc|3	-1	16	_	OA	_	_
16	verloren	_	verlieren	_	VVPP	_	_	-1	17	_	OC	_	_
17	habe	_	haben	_	VAFIN	_	sg|3|pres|subj	-1	11	_	OC	_	_
18	.	_	--	_	$.	_	_	-1	17	_	--	_	_

1	Das	_	der	_	PDS	_	acc|sg|neut	-1	2	_	OA	_	_
2	nahm	_	nehmen	_	VVFIN	_	sg|3|past|ind	-1	0	_	--	_	_
3	ich	_	ich	_	PPER	_	nom|sg|*|1	-1	2	_	SB	_	_
4	mir	_	sich	_	PPER	_	dat|sg|*|1	-1	2	_	DA	_	_
5	fest	_	fest	_	ADJD	_	pos	-1	2	_	MO	_	_
6	vor	_	vor	_	PTKVZ	_	_	-1	2	_	SVP	_	_
7	,	_	--	_	$,	_	_	-1	6	_	--	_	_
8	aber	_	aber	_	ADV	_	_	-1	9	_	MO	_	_
9	am	_	an	_	APPRART	_	dat|sg|masc	-1	12	_	MO	_	_
10	nächsten	_	nächster	_	ADJA	_	dat|sg|masc|pos	-1	11	_	NK	_	_
11	Tag	_	Tag	_	NN	_	dat|sg|masc	-1	9	_	NK	_	_
12	war	_	sein	_	VAFIN	_	sg|3|past|ind	-1	2	_	MO	_	_
13	ihre	_	ihr	_	PPOSAT	_	nom|sg|fem	-1	14	_	NK	_	_
14	Freundin	_	Freundin	_	NN	_	nom|sg|fem	-1	12	_	SB	_	_
15	dabei	_	dabei	_	PROAV	_	_	-1	12	_	MO	_	_
16	,	_	--	_	$,	_	_	-1	15	_	--	_	_
17	und	_	und	_	KON	_	_	-1	2	_	CD	_	_
18	da	_	da	_	ADV	_	_	-1	19	_	MO	_	_
19	ging	_	gehen	_	VVFIN	_	sg|3|past|ind	-1	17	_	CJ	_	_
20	es	_	es	_	PPER	_	nom|sg|neut|3	-1	19	_	EP	_	_
21	wieder	_	wieder	_	ADV	_	_	-1	19	_	MO	_	_
22	nicht	_	nicht	_	PTKNEG	_	_	-1	19	_	NG	_	_
23	.	_	--	_	$.	_	_	-1	22	_	--	_	_
24	 	_	 	_	XY	_	_	-1	0	_	--	_	_

1	Ich	_	ich	_	PPER	_	nom|sg|*|1	-1	2	_	SB	_	_
2	war	_	sein	_	VAFIN	_	sg|1|past|ind	-1	0	_	--	_	_
3	ganz	_	ganz	_	ADV	_	_	-1	4	_	MO	_	_
4	unglücklich	_	unglücklich	_	ADJD	_	pos	-1	2	_	PD	_	_
5	und	_	und	_	KON	_	_	-1	2	_	CD	_	_
6	steckte	_	stecken	_	VVFIN	_	sg|3|past|ind	-1	5	_	CJ	_	_
7	den	_	der	_	ART	_	acc|sg|masc	-1	8	_	NK	_	_
8	Brief	_	Brief	_	NN	_	acc|sg|masc	-1	6	_	OA	_	_
9	wieder	_	wieder	_	ADV	_	_	-1	6	_	MO	_	_
10	in	_	in	_	APPR	_	_	-1	6	_	MO	_	_
11	meinen	_	meinen	_	PPOSAT	_	dat|pl|neut	-1	12	_	NK	_	_
12	Cäsar	_	Cäsar	_	NN	_	dat|pl|neut	-1	10	_	NK	_	_
13	.	_	--	_	$.	_	_	-1	12	_	--	_	_
14	 	_	 	_	XY	_	_	-1	0	_	--	_	_

1	Zur	_	zu	_	APPRART	_	dat|sg|fem	-1	10	_	MO	_	_
2	Strafe	_	Strafe	_	NN	_	dat|sg|fem	-1	1	_	NK	_	_
3	,	_	--	_	$,	_	_	-1	2	_	--	_	_
4	weil	_	weil	_	KOUS	_	_	-1	8	_	CP	_	_
5	ich	_	ich	_	PPER	_	nom|sg|*|1	-1	8	_	SB	_	_
6	so	_	so	_	ADV	_	_	-1	7	_	MO	_	_
7	furchtsam	_	furchtsam	_	ADJD	_	pos	-1	8	_	PD	_	_
8	war	_	sein	_	VAFIN	_	sg|3|past|ind	-1	1	_	MO	_	_
9	,	_	--	_	$,	_	_	-1	8	_	--	_	_
10	gab	_	geben	_	VVFIN	_	sg|3|past|ind	-1	0	_	--	_	_
11	ich	_	ich	_	PPER	_	nom|sg|*|1	-1	10	_	SB	_	_
12	mir	_	sich	_	PRF	_	dat|sg|1	-1	10	_	DA	_	_
13	das	_	der	_	ART	_	acc|sg|neut	-1	14	_	NK	_	_
14	Ehrenwort	_	Ehrenwort	_	NN	_	acc|sg|neut	-1	10	_	OA	_	_
15	,	_	--	_	$,	_	_	-1	14	_	--	_	_
16	daß	_	daß	_	KOUS	_	_	-1	31	_	CP	_	_
17	ich	_	ich	_	PPER	_	nom|sg|*|1	-1	31	_	SB	_	_
18	sie	_	sie	_	PPER	_	nom|sg|fem|3	-1	20	_	OA	_	_
19	jetzt	_	jetzt	_	ADV	_	_	-1	20	_	MO	_	_
20	anreden	_	anreden	_	VVINF	_	_	-1	31	_	OC	_	_
21	und	_	und	_	KON	_	_	-1	20	_	CD	_	_
22	ihr	_	ihr	_	PPOSAT	_	acc|sg|neut	-1	24	_	DA	_	_
23	alles	_	alle	_	PIS	_	acc|sg|neut	-1	24	_	OA	_	_
24	sagen	_	sagen	_	VVFIN	_	pl|3|pres|ind	-1	21	_	CJ	_	_
25	und	_	und	_	KON	_	_	-1	24	_	CD	_	_
26	noch	_	noch	_	ADV	_	_	-1	27	_	MO	_	_
27	dazu	_	dazu	_	PROAV	_	_	-1	30	_	MO	_	_
28	den	_	der	_	ART	_	acc|sg|masc	-1	29	_	NK	_	_
29	Brief	_	Brief	_	NN	_	acc|sg|masc	-1	30	_	OA	_	_
30	geben	_	geben	_	VVINF	_	_	-1	25	_	CJ	_	_
31	wolle	_	wollen	_	VMFIN	_	sg|3|pres|subj	-1	6	_	CC	_	_
32	.	_	--	_	$.	_	_	-1	31	_	--	_	_
33	 	_	 	_	XY	_	_	-1	0	_	--	_	_

1	Raithel	_	Raithel	_	NE	_	nom|sg|*	-1	2	_	SB	_	_
2	sagte	_	sagen	_	VVFIN	_	sg|3|past|ind	-1	0	_	--	_	_
3	,	_	--	_	$,	_	_	-1	2	_	--	_	_
4	ich	_	ich	_	PPER	_	nom|sg|*|1	-1	5	_	SB	_	_
5	müsse	_	müssen	_	VMFIN	_	sg|1|pres|ind	-1	2	_	OC	_	_
6	jetzt	_	jetzt	_	ADV	_	_	-1	5	_	MO	_	_
7	,	_	--	_	$,	_	_	-1	6	_	--	_	_
8	weil	_	weil	_	KOUS	_	_	-1	13	_	CP	_	_
9	ich	_	ich	_	PPER	_	nom|sg|*|1	-1	13	_	SB	_	_
10	sonst	_	sonst	_	ADV	_	_	-1	13	_	MO	_	_
11	ein	_	ein	_	ART	_	acc|sg|neut	-1	12	_	NK	_	_
12	Schuft	_	Schuft	_	NN	_	acc|sg|neut	-1	13	_	PD	_	_
13	wäre	_	sein	_	VAFIN	_	sg|3|past|subj	-1	5	_	MO	_	_
14	.	_	--	_	$.	_	_	-1	13	_	--	_	_

1	Ich	_	ich	_	PPER	_	nom|sg|*|1	-1	2	_	SB	_	_
2	sah	_	sehen	_	VVFIN	_	sg|1|pres|ind	-1	0	_	--	_	_
3	es	_	es	_	PPER	_	acc|sg|neut|3	-1	2	_	OA	_	_
4	ein	_	ein	_	PTKVZ	_	_	-1	2	_	SVP	_	_
5	und	_	und	_	KON	_	_	-1	2	_	CD	_	_
6	war	_	sein	_	VAFIN	_	sg|3|past|ind	-1	5	_	CJ	_	_
7	fest	_	fest	_	ADJD	_	_	-1	8	_	MO	_	_
8	entschlossen	_	entschließen	_	VVPP	_	_	-1	6	_	OC	_	_
9	.	_	--	_	$.	_	_	-1	8	_	--	_	_
10	 	_	 	_	XY	_	_	-1	0	_	--	_	_

1	Auf	_	auf	_	APPR	_	_	-1	5	_	MO	_	_
2	einmal	_	einmal	_	ADV	_	_	-1	1	_	NK	_	_
3	wurde	_	werden	_	VAFIN	_	sg|3|past|ind	-1	0	_	--	_	_
4	ich	_	ich	_	PPER	_	nom|sg|*|1	-1	3	_	SB	_	_
5	aufgerufen	_	aufrufen	_	VVPP	_	_	-1	3	_	OC	_	_
6	und	_	und	_	KON	_	_	-1	3	_	CD	_	_
7	sollte	_	sollen	_	VMFIN	_	sg|3|past|ind	-1	6	_	CJ	_	_
8	weiterfahren	_	weiterfahren	_	VVINF	_	_	-1	7	_	OC	_	_
9	.	_	--	_	$.	_	_	-1	8	_	--	_	_

1	Weil	_	weil	_	KOUS	_	_	-1	8	_	CP	_	_
2	ich	_	ich	_	PPER	_	nom|sg|*|1	-1	8	_	SB	_	_
3	aber	_	aber	_	ADV	_	_	-1	7	_	MO	_	_
4	an	_	an	_	APPR	_	_	-1	7	_	OP	_	_
5	die	_	der	_	ART	_	acc|sg|fem	-1	6	_	NK	_	_
6	Marie	_	Marie	_	NN	_	acc|sg|fem	-1	4	_	NK	_	_
7	gedacht	_	denken	_	VVPP	_	_	-1	8	_	OC	_	_
8	hatte	_	haben	_	VAFIN	_	sg|3|past|ind	-1	10	_	MO	_	_
9	,	_	--	_	$,	_	_	-1	8	_	--	_	_
10	wußte	_	wissen	_	VVFIN	_	sg|3|past|ind	-1	0	_	--	_	_
11	ich	_	ich	_	PPER	_	nom|sg|*|1	-1	10	_	SB	_	_
12	nicht	_	nicht	_	PTKNEG	_	_	-1	10	_	NG	_	_
13	einmal	_	einmal	_	ADV	_	_	-1	12	_	MO	_	_
14	das	_	der	_	ART	_	acc|sg|neut	-1	15	_	NK	_	_
15	Kapitel	_	Kapitel	_	NN	_	acc|sg|neut	-1	10	_	OA	_	_
16	,	_	--	_	$,	_	_	-1	15	_	--	_	_
17	wo	_	wo	_	PWAV	_	_	-1	19	_	MO	_	_
18	wir	_	wir	_	PPER	_	nom|pl|*|1	-1	19	_	SB	_	_
19	standen	_	stehen	_	VVFIN	_	pl|1|past|ind	-1	10	_	RC	_	_
20	,	_	--	_	$,	_	_	-1	19	_	--	_	_
21	und	_	und	_	KON	_	_	-1	10	_	CD	_	_
22	da	_	da	_	ADV	_	_	-1	23	_	MO	_	_
23	kriegte	_	kriegen	_	VVFIN	_	sg|1|past|ind	-1	21	_	CJ	_	_
24	ich	_	ich	_	PPER	_	nom|sg|*|1	-1	23	_	SB	_	_
25	einen	_	ein	_	ART	_	acc|sg|masc	-1	27	_	NK	_	_
26	brennroten	_	brennrot	_	ADJA	_	acc|sg|masc|pos	-1	27	_	NK	_	_
27	Kopf	_	Kopf	_	NN	_	acc|sg|masc	-1	23	_	OA	_	_
28	.	_	--	_	$.	_	_	-1	27	_	--	_	_

1	Dem	_	der	_	ART	_	dat|sg|masc	-1	2	_	NK	_	_
2	Professor	_	Professor	_	NN	_	dat|sg|masc	-1	3	_	DA	_	_
3	fiel	_	fallen	_	VVFIN	_	sg|3|past|ind	-1	0	_	--	_	_
4	das	_	der	_	PDS	_	nom|sg|neut	-1	3	_	SB	_	_
5	auf	_	auf	_	PTKVZ	_	_	-1	3	_	SVP	_	_
6	,	_	--	_	$,	_	_	-1	5	_	--	_	_
7	da	_	da	_	KOUS	_	_	-1	13	_	CP	_	_
8	er	_	er	_	PPER	_	nom|sg|masc|3	-1	13	_	SB	_	_
9	immer	_	immer	_	ADV	_	_	-1	13	_	MO	_	_
10	Verdacht	_	Verdacht	_	NN	_	acc|sg|fem	-1	13	_	OA	_	_
11	gegen	_	gegen	_	APPR	_	_	-1	10	_	MNR	_	_
12	mich	_	mich	_	PPER	_	acc|sg|*|1	-1	11	_	NK	_	_
13	hatte	_	haben	_	VAFIN	_	sg|3|past|ind	-1	3	_	MO	_	_
14	,	_	--	_	$,	_	_	-1	13	_	--	_	_
15	und	_	und	_	KON	_	_	-1	3	_	CD	_	_
16	er	_	er	_	PPER	_	nom|sg|masc|3	-1	17	_	SB	_	_
17	ging	_	gehen	_	VVFIN	_	sg|3|past|ind	-1	15	_	CJ	_	_
18	auf	_	auf	_	APPR	_	_	-1	17	_	MO	_	_
19	mich	_	mich	_	PPER	_	acc|sg|*|1	-1	18	_	NK	_	_
20	zu	_	zu	_	PTKVZ	_	_	-1	17	_	SVP	_	_
21	.	_	--	_	$.	_	_	-1	20	_	--	_	_
22	 	_	 	_	XY	_	_	-1	0	_	--	_	_

1	Ich	_	ich	_	PPER	_	nom|sg|*|1	-1	2	_	SB	_	_
2	blätterte	_	blättern	_	VVFIN	_	sg|1|pres|ind	-1	0	_	--	_	_
3	hastig	_	hastig	_	ADJD	_	pos	-1	2	_	MO	_	_
4	herum	_	herum	_	PTKVZ	_	_	-1	2	_	SVP	_	_
5	und	_	und	_	KON	_	_	-1	2	_	CD	_	_
6	gab	_	geben	_	VVFIN	_	sg|3|past|ind	-1	5	_	CJ	_	_
7	meinem	_	mein	_	PPOSAT	_	dat|sg|masc	-1	8	_	NK	_	_
8	Nachbar	_	Nachbar	_	NN	_	dat|sg|masc	-1	6	_	DA	_	_
9	einen	_	ein	_	ART	_	acc|sg|masc	-1	10	_	NK	_	_
10	Tritt	_	Tritt	_	NN	_	acc|sg|masc	-1	6	_	OA	_	_
11	.	_	--	_	$.	_	_	-1	10	_	--	_	_
12	»	_	»	_	XY	_	_	-1	0	_	--	_	_

1	Wo	_	wo	_	PWAV	_	_	-1	2	_	MO	_	_
2	stehen	_	stehen	_	VVFIN	_	pl|1|pres|ind	-1	0	_	--	_	_
3	wir	_	wir	_	PPER	_	nom|pl|*|1	-1	2	_	SB	_	_
4	?	_	--	_	$.	_	_	-1	3	_	--	_	_

1	Herrgottsakrament	_	Herrgottsakrament	_	NN	_	nom|sg|neut	-1	0	_	--	_	_
2	!	_	--	_	$.	_	_	-1	1	_	--	_	_

1	«	_	«	_	XY	_	nom|sg|masc	-1	0	_	--	_	_
2	Der	_	der	_	ART	_	nom|sg|masc	-1	4	_	NK	_	_
3	dumme	_	dumm	_	ADJA	_	nom|sg|masc|pos	-1	4	_	NK	_	_
4	Kerl	_	Kerl	_	NN	_	nom|sg|masc	-1	5	_	SB	_	_
5	flüsterte	_	flüstern	_	VVFIN	_	sg|3|past|ind	-1	0	_	--	_	_
6	so	_	so	_	ADV	_	_	-1	7	_	MO	_	_
7	leis	_	leis	_	ADJD	_	pos	-1	5	_	MO	_	_
8	,	_	--	_	$,	_	_	-1	7	_	--	_	_
9	daß	_	daß	_	KOUS	_	_	-1	14	_	CP	_	_
10	ich	_	ich	_	PPER	_	nom|sg|*|1	-1	14	_	SB	_	_
11	es	_	es	_	PPER	_	acc|sg|neut|3	-1	13	_	OA	_	_
12	nicht	_	nicht	_	PTKNEG	_	_	-1	14	_	NG	_	_
13	verstehen	_	verstehen	_	VVINF	_	_	-1	14	_	OC	_	_
14	konnte	_	können	_	VMFIN	_	sg|3|past|ind	-1	6	_	CC	_	_
15	,	_	--	_	$,	_	_	-1	14	_	--	_	_
16	und	_	und	_	KON	_	_	-1	5	_	CD	_	_
17	der	_	der	_	ART	_	nom|sg|masc	-1	18	_	NK	_	_
18	Professor	_	Professor	_	NN	_	nom|sg|masc	-1	19	_	SB	_	_
19	war	_	sein	_	VAFIN	_	sg|3|past|ind	-1	16	_	CJ	_	_
20	schon	_	schon	_	ADV	_	_	-1	21	_	MO	_	_
21	an	_	an	_	APPR	_	_	-1	19	_	MO	_	_
22	meinem	_	mein	_	PPOSAT	_	dat|sg|masc	-1	23	_	NK	_	_
23	Platz	_	Platz	_	NN	_	dat|sg|masc	-1	21	_	NK	_	_
24	.	_	--	_	$.	_	_	-1	23	_	--	_	_

1	Da	_	da	_	ADV	_	_	-1	2	_	MO	_	_
2	fiel	_	fallen	_	VVFIN	_	sg|3|past|ind	-1	0	_	--	_	_
3	auf	_	auf	_	APPR	_	_	-1	2	_	MO	_	_
4	einmal	_	einmal	_	ADV	_	_	-1	3	_	NK	_	_
5	der	_	der	_	ART	_	nom|sg|masc	-1	6	_	NK	_	_
6	Brief	_	Brief	_	NN	_	nom|sg|masc	-1	2	_	SB	_	_
7	aus	_	aus	_	APPR	_	_	-1	2	_	MO	_	_
8	meinem	_	mein	_	PPOSAT	_	dat|sg|neut	-1	9	_	NK	_	_
9	Cäsar	_	Cäsar	_	NN	_	dat|sg|neut	-1	7	_	NK	_	_
10	und	_	und	_	KON	_	_	-1	2	_	CD	_	_
11	lag	_	liegen	_	VVFIN	_	sg|3|past|ind	-1	10	_	CJ	_	_
12	am	_	an	_	APPRART	_	dat|sg|masc	-1	11	_	MO	_	_
13	Boden	_	Boden	_	NN	_	dat|sg|masc	-1	12	_	NK	_	_
14	.	_	--	_	$.	_	_	-1	13	_	--	_	_
15	 	_	 	_	XY	_	_	-1	0	_	--	_	_

1	Er	_	er	_	PPER	_	nom|sg|masc|3	-1	2	_	SB	_	_
2	war	_	sein	_	VAFIN	_	sg|3|past|ind	-1	0	_	--	_	_
3	auf	_	auf	_	APPR	_	_	-1	5	_	MO	_	_
4	Rosapapier	_	Rosapapier	_	NN	_	acc|pl|masc	-1	3	_	NK	_	_
5	geschrieben	_	schreiben	_	VVPP	_	_	-1	2	_	OC	_	_
6	und	_	und	_	KON	_	_	-1	5	_	CD	_	_
7	mit	_	mit	_	APPR	_	_	-1	11	_	MO	_	_
8	einem	_	ein	_	ART	_	dat|sg|masc	-1	10	_	NK	_	_
9	wohlriechenden	_	wohlriechend	_	ADJA	_	dat|sg|masc|pos	-1	10	_	NK	_	_
10	Pulver	_	Pulver	_	NN	_	dat|sg|masc	-1	7	_	NK	_	_
11	bestreut	_	bestreuen	_	VVPP	_	_	-1	6	_	CJ	_	_
12	.	_	--	_	$.	_	_	-1	11	_	--	_	_
13	 	_	 	_	XY	_	_	-1	0	_	--	_	_

1	Ich	_	ich	_	PPER	_	nom|sg|*|1	-1	2	_	SB	_	_
2	wollte	_	wollen	_	VMFIN	_	sg|1|past|ind	-1	0	_	--	_	_
3	schnell	_	schnell	_	ADJD	_	pos	-1	8	_	MO	_	_
4	mit	_	mit	_	APPR	_	_	-1	8	_	MO	_	_
5	dem	_	der	_	ART	_	dat|sg|masc	-1	6	_	NK	_	_
6	Fuße	_	Fuß	_	NN	_	dat|sg|masc	-1	4	_	NK	_	_
7	darauf	_	darauf	_	PROAV	_	_	-1	8	_	MO	_	_
8	treten	_	treten	_	VVINF	_	_	-1	2	_	OC	_	_
9	,	_	--	_	$,	_	_	-1	8	_	--	_	_
10	aber	_	aber	_	KON	_	_	-1	2	_	CD	_	_
11	es	_	es	_	PPER	_	nom|sg|neut|3	-1	12	_	EP	_	_
12	ging	_	gehen	_	VVFIN	_	sg|3|past|ind	-1	10	_	CJ	_	_
13	nicht	_	nicht	_	PTKNEG	_	_	-1	12	_	NG	_	_
14	mehr	_	mehr	_	ADV	_	_	-1	13	_	MO	_	_
15	.	_	--	_	$.	_	_	-1	14	_	--	_	_

1	Der	_	der	_	ART	_	nom|sg|masc	-1	2	_	NK	_	_
2	Professor	_	Professor	_	NN	_	nom|sg|masc	-1	3	_	SB	_	_
3	bückte	_	bücken	_	VVFIN	_	sg|3|past|ind	-1	0	_	--	_	_
4	sich	_	sich	_	PRF	_	acc|sg|3	-1	3	_	OA	_	_
5	und	_	und	_	KON	_	_	-1	3	_	CD	_	_
6	hob	_	heben	_	VVFIN	_	sg|3|past|ind	-1	5	_	CJ	_	_
7	ihn	_	ihn	_	PPER	_	acc|sg|masc|3	-1	6	_	OA	_	_
8	auf	_	auf	_	PTKVZ	_	_	-1	6	_	SVP	_	_
9	.	_	--	_	$.	_	_	-1	8	_	--	_	_
10	 	_	 	_	XY	_	_	-1	0	_	--	_	_

1	Zuerst	_	zuerst	_	ADV	_	_	-1	2	_	MO	_	_
2	sah	_	sehen	_	VVFIN	_	sg|3|past|ind	-1	0	_	--	_	_
3	er	_	er	_	PPER	_	nom|sg|masc|3	-1	2	_	SB	_	_
4	mich	_	mich	_	PRF	_	acc|sg|1	-1	2	_	OA	_	_
5	an	_	an	_	PTKVZ	_	_	-1	2	_	SVP	_	_
6	und	_	und	_	KON	_	_	-1	2	_	CD	_	_
7	ließ	_	lassen	_	VVFIN	_	sg|3|past|ind	-1	6	_	CJ	_	_
8	seine	_	sein	_	PPOSAT	_	acc|pl|fem	-1	9	_	NK	_	_
9	Augen	_	Auge	_	NN	_	acc|pl|fem	-1	7	_	OA	_	_
10	so	_	so	_	ADV	_	_	-1	11	_	MO	_	_
11	weit	_	weit	_	ADJD	_	pos	-1	12	_	MO	_	_
12	heraushängen	_	heraushängen	_	VVINF	_	_	-1	7	_	OC	_	_
13	,	_	--	_	$,	_	_	-1	12	_	--	_	_
14	daß	_	daß	_	KOUS	_	_	-1	20	_	CP	_	_
15	man	_	man	_	PIS	_	nom|sg|*	-1	20	_	SB	_	_
16	sie	_	sie	_	PPER	_	acc|pl|fem|3	-1	21	_	OA	_	_
17	mit	_	mit	_	APPR	_	_	-1	21	_	MO	_	_
18	einer	_	ein	_	ART	_	dat|sg|fem	-1	19	_	NK	_	_
19	Schere	_	Schere	_	NN	_	dat|sg|fem	-1	17	_	NK	_	_
20	hätte	_	haben	_	VAFIN	_	sg|3|past|subj	-1	12	_	OC	_	_
21	abschneiden	_	abschneiden	_	VVINF	_	_	-1	22	_	OC	_	_
22	können	_	können	_	VMINF	_	_	-1	20	_	OC	_	_
23	.	_	--	_	$.	_	_	-1	22	_	--	_	_

1	Dann	_	dann	_	ADV	_	_	-1	2	_	MO	_	_
2	sah	_	sehen	_	VVFIN	_	sg|3|past|ind	-1	0	_	--	_	_
3	er	_	er	_	PPER	_	nom|sg|masc|3	-1	2	_	SB	_	_
4	den	_	der	_	ART	_	acc|sg|masc	-1	5	_	NK	_	_
5	Brief	_	Brief	_	NN	_	acc|sg|masc	-1	2	_	OA	_	_
6	an	_	an	_	PTKVZ	_	_	-1	2	_	SVP	_	_
7	und	_	und	_	KON	_	_	-1	2	_	CD	_	_
8	roch	_	roch	_	VVFIN	_	pl|2|imp	-1	7	_	CJ	_	_
9	daran	_	daran	_	PROAV	_	_	-1	8	_	MO	_	_
10	,	_	--	_	$,	_	_	-1	9	_	--	_	_
11	und	_	und	_	KON	_	_	-1	2	_	CD	_	_
12	dann	_	dann	_	ADV	_	_	-1	13	_	MO	_	_
13	nahm	_	nehmen	_	VVFIN	_	sg|3|past|ind	-1	11	_	CJ	_	_
14	er	_	er	_	PPER	_	nom|sg|masc|3	-1	13	_	SB	_	_
15	ihn	_	ihn	_	PPER	_	acc|sg|masc|3	-1	13	_	OA	_	_
16	langsam	_	langsam	_	ADJD	_	pos	-1	13	_	MO	_	_
17	heraus	_	heraus	_	PTKVZ	_	_	-1	13	_	SVP	_	_
18	.	_	--	_	$.	_	_	-1	17	_	--	_	_

1	Dabei	_	dabei	_	PROAV	_	_	-1	2	_	MO	_	_
2	schaute	_	schauen	_	VVFIN	_	sg|3|past|ind	-1	0	_	--	_	_
3	er	_	er	_	PPER	_	nom|sg|masc|3	-1	2	_	SB	_	_
4	mich	_	mich	_	PPER	_	acc|sg|1	-1	2	_	OA	_	_
5	immer	_	immer	_	ADV	_	_	-1	6	_	MO	_	_
6	durchbohrender	_	durchbohrend	_	ADJD	_	comp	-1	2	_	MO	_	_
7	an	_	an	_	PTKVZ	_	_	-1	2	_	SVP	_	_
8	und	_	und	_	KON	_	_	-1	2	_	CD	_	_
9	man	_	man	_	PIS	_	nom|sg|*	-1	10	_	SB	_	_
10	merkte	_	merken	_	VVFIN	_	sg|3|past|ind	-1	8	_	CJ	_	_
11	,	_	--	_	$,	_	_	-1	10	_	--	_	_
12	wie	_	wie	_	PWAV	_	_	-1	20	_	MO	_	_
13	es	_	es	_	PPER	_	nom|sg|neut|3	-1	15	_	EP	_	_
14	ihn	_	ihn	_	PPER	_	acc|sg|masc|3	-1	15	_	OA	_	_
15	freute	_	freuen	_	VVFIN	_	sg|3|past|ind	-1	10	_	OC	_	_
16	,	_	--	_	$,	_	_	-1	15	_	--	_	_
17	daß	_	daß	_	KOUS	_	_	-1	21	_	CP	_	_
18	er	_	er	_	PPER	_	nom|sg|masc|3	-1	21	_	SB	_	_
19	etwas	_	etwas	_	PIS	_	*|*|neut	-1	20	_	OA	_	_
20	erwischt	_	erwischen	_	VVPP	_	_	-1	21	_	OC	_	_
21	hatte	_	haben	_	VAFIN	_	sg|3|past|ind	-1	13	_	RE	_	_
22	.	_	--	_	$.	_	_	-1	21	_	--	_	_
23	 	_	 	_	XY	_	_	-1	0	_	--	_	_

1	Er	_	er	_	PPER	_	nom|sg|masc|3	-1	2	_	SB	_	_
2	las	_	las	_	VVFIN	_	sg|3|past|ind	-1	0	_	--	_	_
3	zuerst	_	zuerst	_	ADV	_	_	-1	2	_	MO	_	_
4	laut	_	laut	_	ADJD	_	pos	-1	2	_	MO	_	_
5	vor	_	vor	_	APPR	_	_	-1	2	_	MO	_	_
6	der	_	der	_	ART	_	dat|sg|fem	-1	8	_	NK	_	_
7	ganzen	_	ganz	_	ADJA	_	dat|sg|fem|pos	-1	8	_	NK	_	_
8	Klasse	_	Klasse	_	NN	_	dat|sg|fem	-1	5	_	NK	_	_
9	.	_	--	_	$.	_	_	-1	8	_	--	_	_
10	 	_	 	_	XY	_	_	-1	0	_	--	_	_

1	»	_	»	_	XY	_	_	-1	4	_	NK	_	_
2	Innig	_	Innig	_	ADJD	_	pos	-1	3	_	MO	_	_
3	geliebtes	_	geliebt	_	ADJA	_	nom|sg|neut|pos	-1	4	_	NK	_	_
4	Fräulein	_	Fräulein	_	NN	_	nom|sg|neut	-1	0	_	--	_	_
5	!	_	--	_	$.	_	_	-1	4	_	--	_	_

1	Schon	_	schon	_	ADV	_	_	-1	2	_	MO	_	_
2	oft	_	oft	_	ADV	_	_	-1	3	_	MO	_	_
3	wollte	_	wollen	_	VMFIN	_	sg|1|past|ind	-1	0	_	--	_	_
4	ich	_	ich	_	PPER	_	nom|sg|*|1	-1	3	_	SB	_	_
5	mich	_	mich	_	PRF	_	acc|sg|1	-1	7	_	OA	_	_
6	Ihnen	_	ihnen	_	PPER	_	dat|pl|*|3	-1	7	_	DA	_	_
7	nahen	_	nah	_	VVFIN	_	_	-1	3	_	OC	_	_
8	,	_	--	_	$,	_	_	-1	7	_	--	_	_
9	aber	_	aber	_	KON	_	_	-1	3	_	CD	_	_
10	ich	_	ich	_	PPER	_	nom|sg|*|1	-1	11	_	SB	_	_
11	traute	_	trauen	_	VVFIN	_	sg|1|past|ind	-1	9	_	CJ	_	_
12	mich	_	mich	_	PPER	_	acc|sg|*|1	-1	11	_	OA	_	_
13	nicht	_	nicht	_	PTKNEG	_	_	-1	11	_	NG	_	_
14	,	_	--	_	$,	_	_	-1	13	_	--	_	_
15	weil	_	weil	_	KOUS	_	_	-1	17	_	CP	_	_
16	ich	_	ich	_	PPER	_	nom|sg|*|1	-1	17	_	SB	_	_
17	dachte	_	denken	_	VVFIN	_	sg|1|past|ind	-1	11	_	MO	_	_
18	,	_	--	_	$,	_	_	-1	17	_	--	_	_
19	es	_	es	_	PPER	_	nom|sg|neut|3	-1	20	_	SB	_	_
20	könnte	_	können	_	VMFIN	_	sg|3|past|subj	-1	17	_	OC	_	_
21	Sie	_	sie	_	PPER	_	nom|pl|*|3	-1	20	_	SB	_	_
22	beleidigen	_	beleidigen	_	VVINF	_	_	-1	20	_	OC	_	_
23	.	_	--	_	$.	_	_	-1	22	_	--	_	_

1	«	_	«	_	XY	_	_	-1	0	_	--	_	_
2	 	_	 	_	XY	_	_	-1	0	_	--	_	_

1	Dann	_	dann	_	ADV	_	_	-1	2	_	MO	_	_
2	kam	_	kommen	_	VVFIN	_	sg|3|past|ind	-1	0	_	--	_	_
3	er	_	er	_	PPER	_	nom|sg|masc|3	-1	2	_	SB	_	_
4	an	_	an	_	APPR	_	_	-1	2	_	MO	_	_
5	die	_	der	_	ART	_	acc|sg|fem	-1	6	_	NK	_	_
6	Stelle	_	Stelle	_	NN	_	acc|sg|fem	-1	4	_	NK	_	_
7	vom	_	von	_	APPRART	_	dat|sg|masc	-1	6	_	MNR	_	_
8	Sacktuch	_	Sacktuch	_	NN	_	dat|sg|masc	-1	7	_	NK	_	_
9	,	_	--	_	$,	_	_	-1	8	_	--	_	_
10	und	_	und	_	KON	_	_	-1	2	_	CD	_	_
11	da	_	da	_	ADV	_	_	-1	12	_	MO	_	_
12	murmelte	_	murmeln	_	VVFIN	_	sg|3|past|ind	-1	10	_	CJ	_	_
13	er	_	er	_	PPER	_	nom|sg|masc|3	-1	12	_	SB	_	_
14	bloß	_	bloß	_	ADV	_	_	-1	15	_	MO	_	_
15	mehr	_	mehr	_	ADV	_	_	-1	12	_	OA	_	_
16	,	_	--	_	$,	_	_	-1	15	_	--	_	_
17	daß	_	daß	_	KOUS	_	_	-1	23	_	CP	_	_
18	es	_	es	_	PPER	_	nom|sg|neut|3	-1	23	_	SB	_	_
19	die	_	der	_	ART	_	acc|sg|fem	-1	20	_	NK	_	_
20	andern	_	anderer	_	PIS	_	_	-1	22	_	OA	_	_
21	nicht	_	nicht	_	PTKNEG	_	_	-1	23	_	NG	_	_
22	hören	_	hören	_	VVINF	_	_	-1	23	_	OC	_	_
23	konnten	_	können	_	VMFIN	_	pl|3|past|ind	-1	15	_	RE	_	_
24	.	_	--	_	$.	_	_	-1	23	_	--	_	_
25	 	_	 	_	XY	_	_	-1	0	_	--	_	_

1	Und	_	und	_	KON	_	_	-1	3	_	JU	_	_
2	dann	_	dann	_	ADV	_	_	-1	3	_	MO	_	_
3	nickte	_	nicken	_	VVFIN	_	sg|3|past|ind	-1	0	_	--	_	_
4	er	_	er	_	PPER	_	nom|sg|masc|3	-1	3	_	SB	_	_
5	mit	_	mit	_	APPR	_	_	-1	3	_	MO	_	_
6	dem	_	der	_	ART	_	dat|sg|masc	-1	7	_	NK	_	_
7	Kopfe	_	Kopfe	_	NN	_	dat|sg|masc	-1	5	_	NK	_	_
8	auf	_	auf	_	PTKVZ	_	_	-1	3	_	SVP	_	_
9	und	_	und	_	KON	_	_	-1	8	_	CD	_	_
10	ab	_	ab	_	PTKVZ	_	_	-1	9	_	CJ	_	_
11	,	_	--	_	$,	_	_	-1	10	_	--	_	_
12	und	_	und	_	KON	_	_	-1	3	_	CD	_	_
13	dann	_	dann	_	ADV	_	_	-1	14	_	MO	_	_
14	sagte	_	sagen	_	VVFIN	_	sg|3|past|ind	-1	12	_	CJ	_	_
15	er	_	er	_	PPER	_	nom|sg|masc|3	-1	14	_	SB	_	_
16	ganz	_	ganz	_	ADV	_	_	-1	17	_	MO	_	_
17	langsam	_	langsam	_	ADJD	_	pos	-1	14	_	MO	_	_
18	:	_	--	_	$.	_	_	-1	17	_	--	_	_
19	 	_	 	_	XY	_	_	-1	8	_	NK	_	_

1	»	_	»	_	XY	_	nom|pl|masc|pos	-1	0	_	--	_	_
2	Unglücklicher	_	Unglücklicher	_	NN	_	nom|pl|masc	-1	0	_	--	_	_
3	,	_	--	_	$,	_	_	-1	2	_	--	_	_
4	gehe	_	gehen	_	VVFIN	_	sg|3|pres|subj	-1	2	_	PAR	_	_
5	nach	_	nach	_	APPR	_	_	-1	4	_	MO	_	_
6	Hause	_	Haus	_	NN	_	dat|sg|neut	-1	5	_	NK	_	_
7	.	_	--	_	$.	_	_	-1	6	_	--	_	_

1	Du	_	du	_	PPER	_	nom|sg|*|2	-1	2	_	SB	_	_
2	wirst	_	werden	_	VAFIN	_	sg|2|pres|ind	-1	0	_	--	_	_
3	das	_	der	_	ART	_	acc|sg|neut	-1	4	_	NK	_	_
4	Weitere	_	weit	_	NN	_	acc|sg|neut	-1	5	_	OA	_	_
5	hören	_	hören	_	VVINF	_	_	-1	2	_	OC	_	_
6	.	_	--	_	$.	_	_	-1	5	_	--	_	_
7	«	_	«	_	XY	_	_	-1	8	_	PNC	_	_
8	 	_	 	_	XY	_	_	-1	4	_	NK	_	_

1	Ich	_	ich	_	PPER	_	nom|sg|*|1	-1	2	_	SB	_	_
2	war	_	sein	_	VAFIN	_	sg|1|past|ind	-1	0	_	--	_	_
3	so	_	so	_	ADV	_	_	-1	4	_	MO	_	_
4	zornig	_	zornig	_	ADJD	_	pos	-1	2	_	PD	_	_
5	,	_	--	_	$,	_	_	-1	4	_	--	_	_
6	daß	_	daß	_	KOUS	_	_	-1	14	_	CP	_	_
7	ich	_	ich	_	PPER	_	nom|sg|*|1	-1	14	_	SB	_	_
8	meine	_	mein	_	PPOSAT	_	sg|1|pres|ind	-1	9	_	NK	_	_
9	Bücher	_	Buch	_	NN	_	acc|pl|neut	-1	13	_	OA	_	_
10	an	_	an	_	APPR	_	_	-1	13	_	MO	_	_
11	die	_	der	_	ART	_	acc|sg|fem	-1	12	_	NK	_	_
12	Wand	_	Wand	_	NN	_	acc|sg|fem	-1	10	_	NK	_	_
13	schmeißen	_	schmeißen	_	VVINF	_	_	-1	14	_	OC	_	_
14	wollte	_	wollen	_	VMFIN	_	sg|3|past|ind	-1	3	_	CC	_	_
15	,	_	--	_	$,	_	_	-1	14	_	--	_	_
16	weil	_	weil	_	KOUS	_	_	-1	21	_	CP	_	_
17	ich	_	ich	_	PPER	_	nom|sg|*|1	-1	21	_	SB	_	_
18	ein	_	ein	_	ART	_	nom|sg|masc	-1	20	_	NK	_	_
19	solcher	_	solcher	_	PIAT	_	nom|sg|masc	-1	20	_	NK	_	_
20	Esel	_	Esel	_	NN	_	nom|sg|masc	-1	21	_	PD	_	_
21	war	_	sein	_	VAFIN	_	sg|3|past|ind	-1	14	_	MO	_	_
22	.	_	--	_	$.	_	_	-1	21	_	--	_	_

1	Aber	_	aber	_	KON	_	_	-1	3	_	JU	_	_
2	ich	_	ich	_	PPER	_	nom|sg|*|1	-1	3	_	SB	_	_
3	dachte	_	denken	_	VVFIN	_	sg|1|past|ind	-1	0	_	--	_	_
4	,	_	--	_	$,	_	_	-1	3	_	--	_	_
5	daß	_	daß	_	KOUS	_	_	-1	10	_	CP	_	_
6	mir	_	sich	_	PPER	_	dat|sg|*|1	-1	9	_	DA	_	_
7	doch	_	doch	_	ADV	_	_	-1	10	_	MO	_	_
8	nichts	_	nichts	_	PIS	_	*|*|neut	-1	9	_	OA	_	_
9	geschehen	_	geschehen	_	VVINF	_	_	-1	10	_	OC	_	_
10	könnte	_	können	_	VMFIN	_	sg|3|past|subj	-1	3	_	OC	_	_
11	.	_	--	_	$.	_	_	-1	10	_	--	_	_

1	Es	_	es	_	PPER	_	nom|sg|neut|3	-1	2	_	SB	_	_
2	stand	_	stehen	_	VVFIN	_	sg|3|past|ind	-1	0	_	--	_	_
3	nichts	_	nichts	_	PIS	_	*|*|neut	-1	4	_	NK	_	_
4	Schlechtes	_	schlecht	_	NN	_	nom|sg|neut	-1	2	_	SB	_	_
5	in	_	in	_	APPR	_	_	-1	4	_	MNR	_	_
6	dem	_	der	_	ART	_	dat|sg|masc	-1	7	_	NK	_	_
7	Brief	_	Brief	_	NN	_	dat|sg|masc	-1	5	_	NK	_	_
8	;	_	--	_	$.	_	_	-1	7	_	--	_	_

1	bloß	_	bloß	_	ADV	_	_	-1	4	_	MO	_	_
2	daß	_	daß	_	KOUS	_	_	-1	5	_	CP	_	_
3	ich	_	ich	_	PPER	_	nom|sg|*|1	-1	5	_	SB	_	_
4	verliebt	_	verlieben	_	VVPP	_	_	-1	5	_	OC	_	_
5	war	_	sein	_	VAFIN	_	sg|3|past|ind	-1	0	_	--	_	_
6	.	_	--	_	$.	_	_	-1	5	_	--	_	_

1	Das	_	der	_	PDS	_	nom|sg|neut	-1	2	_	SB	_	_
2	geht	_	gehen	_	VVFIN	_	sg|3|pres|ind	-1	0	_	--	_	_
3	doch	_	doch	_	ADV	_	_	-1	2	_	MO	_	_
4	den	_	der	_	ART	_	acc|sg|masc	-1	5	_	NK	_	_
5	Professor	_	Professor	_	NN	_	acc|sg|masc	-1	2	_	DA	_	_
6	nichts	_	nichts	_	PIS	_	*|*|neut	-1	5	_	AG	_	_
7	an	_	an	_	PTKVZ	_	_	-1	2	_	SVP	_	_
8	.	_	--	_	$.	_	_	-1	7	_	--	_	_
9	 	_	 	_	XY	_	_	-1	0	_	--	_	_

1	Aber	_	aber	_	KON	_	_	-1	3	_	JU	_	_
2	es	_	es	_	PPER	_	nom|sg|neut|3	-1	3	_	EP	_	_
3	kam	_	kommen	_	VVFIN	_	sg|3|past|ind	-1	0	_	--	_	_
4	ganz	_	ganz	_	ADV	_	_	-1	5	_	MO	_	_
5	dick	_	dick	_	ADJD	_	pos	-1	3	_	MO	_	_
6	.	_	--	_	$.	_	_	-1	5	_	--	_	_
7	 	_	 	_	XY	_	_	-1	0	_	--	_	_

1	Am	_	an	_	APPRART	_	dat|sg|masc	-1	4	_	MO	_	_
2	nächsten	_	nächster	_	ADJA	_	dat|sg|masc|pos	-1	3	_	NK	_	_
3	Tag	_	Tag	_	NN	_	dat|sg|masc	-1	1	_	NK	_	_
4	mußte	_	müssen	_	VMFIN	_	sg|1|past|ind	-1	0	_	--	_	_
5	ich	_	ich	_	PPER	_	nom|sg|*|1	-1	4	_	SB	_	_
6	gleich	_	gleich	_	ADV	_	_	-1	4	_	MO	_	_
7	zum	_	zu	_	APPRART	_	dat|sg|masc	-1	4	_	MO	_	_
8	Rektor	_	Rektor	_	NN	_	dat|sg|masc	-1	7	_	NK	_	_
9	.	_	--	_	$.	_	_	-1	8	_	--	_	_

1	Der	_	der	_	PDS	_	nom|sg|masc	-1	2	_	SB	_	_
2	hatte	_	haben	_	VAFIN	_	sg|3|past|ind	-1	0	_	--	_	_
3	sein	_	sein	_	PPOSAT	_	acc|sg|neut	-1	5	_	NK	_	_
4	großes	_	groß	_	ADJA	_	acc|sg|neut|pos	-1	5	_	NK	_	_
5	Buch	_	Buch	_	NN	_	acc|sg|neut	-1	2	_	OA	_	_
6	dabei	_	dabei	_	PROAV	_	_	-1	5	_	MNR	_	_
7	,	_	--	_	$,	_	_	-1	6	_	--	_	_
8	wo	_	wo	_	PWAV	_	_	-1	11	_	MO	_	_
9	er	_	er	_	PPER	_	nom|sg|masc|3	-1	11	_	SB	_	_
10	alles	_	alle	_	PIS	_	acc|sg|neut	-1	11	_	OA	_	_
11	hineinstenographierte	_	hineinstenographieren	_	VVFIN	_	sg|3|past|ind	-1	5	_	RC	_	_
12	,	_	--	_	$,	_	_	-1	11	_	--	_	_
13	was	_	was	_	PWS	_	acc|sg|neut	-1	15	_	OA	_	_
14	ich	_	ich	_	PPER	_	nom|sg|*|1	-1	15	_	SB	_	_
15	sagte	_	sagen	_	VVFIN	_	sg|1|past|ind	-1	11	_	OC	_	_
16	.	_	--	_	$.	_	_	-1	15	_	--	_	_

1	Zuerst	_	zuerst	_	ADV	_	_	-1	2	_	MO	_	_
2	fragte	_	fragen	_	VVFIN	_	sg|3|past|ind	-1	0	_	--	_	_
3	er	_	er	_	PPER	_	nom|sg|masc|3	-1	2	_	SB	_	_
4	mich	_	mich	_	PPER	_	acc|sg|*|1	-1	2	_	OA	_	_
5	,	_	--	_	$,	_	_	-1	4	_	--	_	_
6	an	_	an	_	APPR	_	_	-1	10	_	MO	_	_
7	wen	_	wen	_	PWS	_	acc|sg|masc	-1	6	_	NK	_	_
8	der	_	der	_	ART	_	nom|sg|masc	-1	9	_	NK	_	_
9	Brief	_	Brief	_	NN	_	nom|sg|masc	-1	10	_	SB	_	_
10	sei	_	sein	_	VAFIN	_	sg|3|pres|subj	-1	2	_	OC	_	_
11	.	_	--	_	$.	_	_	-1	10	_	--	_	_

1	Ich	_	ich	_	PPER	_	nom|sg|*|1	-1	2	_	SB	_	_
2	sagte	_	sagen	_	VVFIN	_	sg|1|past|ind	-1	0	_	--	_	_
3	,	_	--	_	$,	_	_	-1	2	_	--	_	_
4	er	_	er	_	PPER	_	nom|sg|masc|3	-1	5	_	SB	_	_
5	sei	_	sein	_	VAFIN	_	sg|3|pres|subj	-1	2	_	OC	_	_
6	an	_	an	_	APPR	_	_	-1	5	_	MO	_	_
7	gar	_	gar	_	ADV	_	_	-1	6	_	MO	_	_
8	niemand	_	niemand	_	PIS	_	nom|sg|masc	-1	5	_	PD	_	_
9	.	_	--	_	$.	_	_	-1	8	_	--	_	_

1	Ich	_	ich	_	PPER	_	nom|sg|*|1	-1	2	_	SB	_	_
2	hätte	_	haben	_	VAFIN	_	sg|3|past|subj	-1	0	_	--	_	_
3	es	_	es	_	PPER	_	nom|sg|neut|3	-1	6	_	OA	_	_
4	bloß	_	bloß	_	ADV	_	_	-1	5	_	MO	_	_
5	so	_	so	_	ADV	_	_	-1	6	_	MO	_	_
6	geschrieben	_	schreiben	_	VVPP	_	_	-1	2	_	OC	_	_
7	aus	_	aus	_	APPR	_	_	-1	6	_	MO	_	_
8	Spaß	_	Spaß	_	NN	_	dat|sg|masc	-1	7	_	NK	_	_
9	.	_	--	_	$.	_	_	-1	8	_	--	_	_

1	Da	_	da	_	ADV	_	_	-1	2	_	MO	_	_
2	sagte	_	sagen	_	VVFIN	_	sg|3|past|ind	-1	0	_	--	_	_
3	er	_	er	_	PPER	_	nom|sg|masc|3	-1	2	_	SB	_	_
4	,	_	--	_	$,	_	_	-1	3	_	--	_	_
5	das	_	der	_	PDS	_	nom|sg|neut	-1	6	_	SB	_	_
6	sei	_	sein	_	VAFIN	_	sg|3|pres|subj	-1	2	_	OC	_	_
7	eine	_	ein	_	ART	_	nom|sg|fem	-1	9	_	NK	_	_
8	infame	_	infam	_	ADJA	_	nom|sg|fem|pos	-1	9	_	NK	_	_
9	Lüge	_	Lüge	_	NN	_	nom|sg|fem	-1	6	_	PD	_	_
10	,	_	--	_	$,	_	_	-1	9	_	--	_	_
11	und	_	und	_	KON	_	_	-1	2	_	CD	_	_
12	ich	_	ich	_	PPER	_	nom|sg|*|1	-1	13	_	SB	_	_
13	wäre	_	sein	_	VAFIN	_	sg|3|past|subj	-1	11	_	CJ	_	_
14	nicht	_	nicht	_	PTKNEG	_	_	-1	15	_	NG	_	_
15	bloß	_	bloß	_	ADV	_	_	-1	16	_	MO	_	_
16	schlecht	_	schlecht	_	ADJD	_	pos	-1	13	_	PD	_	_
17	,	_	--	_	$,	_	_	-1	16	_	--	_	_
18	sondern	_	sondern	_	KON	_	_	-1	16	_	CD	_	_
19	auch	_	auch	_	ADV	_	_	-1	20	_	MO	_	_
20	feig	_	feig	_	ADJD	_	pos	-1	18	_	CJ	_	_
21	.	_	--	_	$.	_	_	-1	20	_	--	_	_
22	 	_	 	_	XY	_	_	-1	0	_	--	_	_

1	Da	_	da	_	ADV	_	_	-1	2	_	MO	_	_
2	wurde	_	werden	_	VAFIN	_	sg|3|past|ind	-1	0	_	--	_	_
3	ich	_	ich	_	PPER	_	nom|sg|*|1	-1	2	_	SB	_	_
4	zornig	_	zornig	_	ADJD	_	pos	-1	2	_	PD	_	_
5	und	_	und	_	KON	_	_	-1	2	_	CD	_	_
6	sagte	_	sagen	_	VVFIN	_	sg|3|past|ind	-1	5	_	CJ	_	_
7	,	_	--	_	$,	_	_	-1	6	_	--	_	_
8	daß	_	daß	_	KOUS	_	_	-1	16	_	CP	_	_
9	in	_	in	_	APPR	_	_	-1	16	_	MO	_	_
10	dem	_	der	_	ART	_	dat|sg|masc	-1	11	_	NK	_	_
11	Briefe	_	Brief	_	NN	_	dat|sg|masc	-1	9	_	NK	_	_
12	gar	_	gar	_	ADV	_	_	-1	13	_	MO	_	_
13	nichts	_	nichts	_	PIAT	_	*|*|neut	-1	14	_	NK	_	_
14	Gemeines	_	gemeine	_	NN	_	nom|sg|neut	-1	16	_	PD	_	_
15	darin	_	darin	_	PROAV	_	_	-1	14	_	MNR	_	_
16	sei	_	sein	_	VAFIN	_	sg|3|pres|subj	-1	6	_	OC	_	_
17	,	_	--	_	$,	_	_	-1	16	_	--	_	_
18	und	_	und	_	KON	_	_	-1	16	_	CD	_	_
19	es	_	es	_	PPER	_	nom|sg|neut|3	-1	20	_	SB	_	_
20	wäre	_	sein	_	VAFIN	_	sg|3|past|subj	-1	18	_	CJ	_	_
21	ein	_	ein	_	ART	_	nom|sg|neut	-1	23	_	NK	_	_
22	braves	_	brav	_	ADJA	_	nom|sg|neut|pos	-1	23	_	NK	_	_
23	Mädchen	_	Mädchen	_	NN	_	nom|sg|neut	-1	20	_	PD	_	_
24	.	_	--	_	$.	_	_	-1	23	_	--	_	_

1	Da	_	da	_	ADV	_	_	-1	2	_	MO	_	_
2	lachte	_	lachen	_	VVFIN	_	sg|3|past|ind	-1	0	_	--	_	_
3	er	_	er	_	PPER	_	nom|sg|masc|3	-1	2	_	SB	_	_
4	,	_	--	_	$,	_	_	-1	3	_	--	_	_
5	daß	_	daß	_	KOUS	_	_	-1	11	_	CP	_	_
6	man	_	man	_	PIS	_	nom|sg|*	-1	11	_	SB	_	_
7	seine	_	sein	_	PPOSAT	_	acc|sg|fem	-1	10	_	NK	_	_
8	zwei	_	zwei	_	CARD	_	_	-1	10	_	NK	_	_
9	gelben	_	gelb	_	ADJA	_	dat|sg|fem|pos	-1	10	_	NK	_	_
10	Stockzähne	_	Stockzähne	_	NN	_	dat|sg|fem	-1	11	_	OA	_	_
11	sah	_	sehen	_	VVFIN	_	sg|3|past|ind	-1	2	_	OC	_	_
12	,	_	--	_	$,	_	_	-1	11	_	--	_	_
13	weil	_	weil	_	KOUS	_	_	-1	17	_	CP	_	_
14	ich	_	ich	_	PPER	_	nom|sg|*|1	-1	17	_	SB	_	_
15	mich	_	mich	_	PRF	_	acc|sg|1	-1	16	_	OA	_	_
16	verraten	_	verraten	_	VVPP	_	_	-1	17	_	OC	_	_
17	hatte	_	haben	_	VAFIN	_	sg|3|past|ind	-1	11	_	MO	_	_
18	.	_	--	_	$.	_	_	-1	17	_	--	_	_

1	Und	_	und	_	KON	_	_	-1	3	_	JU	_	_
2	er	_	er	_	PPER	_	nom|sg|masc|3	-1	3	_	SB	_	_
3	fragte	_	fragen	_	VVFIN	_	sg|3|past|ind	-1	0	_	--	_	_
4	immer	_	immer	_	ADV	_	_	-1	3	_	MO	_	_
5	nach	_	nach	_	APPR	_	_	-1	3	_	MO	_	_
6	dem	_	der	_	ART	_	dat|sg|masc	-1	7	_	NK	_	_
7	Namen	_	Name	_	NN	_	dat|sg|masc	-1	5	_	NK	_	_
8	.	_	--	_	$.	_	_	-1	7	_	--	_	_

1	Jetzt	_	jetzt	_	ADV	_	_	-1	2	_	MO	_	_
2	war	_	sein	_	VAFIN	_	sg|3|past|ind	-1	0	_	--	_	_
3	mir	_	sich	_	PPER	_	dat|sg|masc|1	-1	5	_	DA	_	_
4	alles	_	alle	_	PIS	_	nom|sg|neut	-1	2	_	SB	_	_
5	gleich	_	gleich	_	ADJD	_	_	-1	2	_	PD	_	_
6	,	_	--	_	$,	_	_	-1	5	_	--	_	_
7	und	_	und	_	KON	_	_	-1	2	_	CD	_	_
8	ich	_	ich	_	PPER	_	nom|sg|*|1	-1	9	_	SB	_	_
9	sagte	_	sagen	_	VVFIN	_	sg|1|past|ind	-1	7	_	CJ	_	_
10	,	_	--	_	$,	_	_	-1	9	_	--	_	_
11	daß	_	daß	_	KOUS	_	_	-1	17	_	CP	_	_
12	kein	_	kein	_	PIAT	_	nom|sg|masc	-1	14	_	NK	_	_
13	anständiger	_	anständig	_	ADJA	_	nom|sg|masc|pos	-1	14	_	NK	_	_
14	Mann	_	Mann	_	NN	_	nom|sg|masc	-1	17	_	SB	_	_
15	den	_	der	_	ART	_	acc|sg|masc	-1	16	_	NK	_	_
16	Namen	_	Name	_	NN	_	acc|sg|masc	-1	17	_	OA	_	_
17	verrät	_	verraten	_	VVFIN	_	sg|3|pres|ind	-1	9	_	OC	_	_
18	,	_	--	_	$,	_	_	-1	17	_	--	_	_
19	und	_	und	_	KON	_	_	-1	17	_	CD	_	_
20	ich	_	ich	_	PPER	_	nom|sg|*|1	-1	21	_	SB	_	_
21	täte	_	tun	_	VVFIN	_	sg|1|past|ind	-1	19	_	CJ	_	_
22	es	_	es	_	PPER	_	acc|sg|neut|3	-1	21	_	OA	_	_
23	niemals	_	niemals	_	ADV	_	_	-1	21	_	MO	_	_
24	.	_	--	_	$.	_	_	-1	23	_	--	_	_

1	Da	_	da	_	ADV	_	_	-1	2	_	MO	_	_
2	schaute	_	schauen	_	VVFIN	_	sg|3|past|ind	-1	0	_	--	_	_
3	er	_	er	_	PPER	_	nom|sg|masc|3	-1	2	_	SB	_	_
4	mich	_	mich	_	PPER	_	acc|sg|*|1	-1	2	_	OA	_	_
5	recht	_	recht	_	ADV	_	_	-1	6	_	MO	_	_
6	falsch	_	falsch	_	ADJD	_	pos	-1	2	_	MO	_	_
7	an	_	an	_	PTKVZ	_	_	-1	2	_	SVP	_	_
8	und	_	und	_	KON	_	_	-1	2	_	CD	_	_
9	schlug	_	schlagen	_	VVFIN	_	sg|3|past|ind	-1	8	_	CJ	_	_
10	sein	_	sein	_	PPOSAT	_	acc|sg|neut	-1	11	_	NK	_	_
11	Buch	_	Buch	_	NN	_	acc|sg|neut	-1	9	_	OA	_	_
12	zu	_	zu	_	PTKVZ	_	_	-1	9	_	SVP	_	_
13	.	_	--	_	$.	_	_	-1	12	_	--	_	_

1	Dann	_	dann	_	ADV	_	_	-1	2	_	MO	_	_
2	sagte	_	sagen	_	VVFIN	_	sg|3|past|ind	-1	0	_	--	_	_
3	er	_	er	_	PPER	_	nom|sg|masc|3	-1	2	_	SB	_	_
4	:	_	--	_	$.	_	_	-1	3	_	--	_	_
5	»	_	»	_	XY	_	*|*|*	-1	0	_	--	_	_
6	Du	_	du	_	PPER	_	nom|sg|*|2	-1	7	_	SB	_	_
7	bist	_	sein	_	VAFIN	_	sg|2|pres|ind	-1	2	_	OC	_	_
8	eine	_	ein	_	ART	_	nom|sg|fem	-1	10	_	NK	_	_
9	verdorbene	_	verdorben	_	ADJA	_	nom|sg|fem|pos	-1	10	_	NK	_	_
10	Pflanze	_	Pflanze	_	NN	_	nom|sg|fem	-1	7	_	PD	_	_
11	in	_	in	_	APPR	_	_	-1	10	_	MNR	_	_
12	unserem	_	unser	_	PPOSAT	_	dat|sg|neut	-1	13	_	NK	_	_
13	Garten	_	Garten	_	NN	_	dat|sg|neut	-1	11	_	NK	_	_
14	.	_	--	_	$.	_	_	-1	13	_	--	_	_

1	Wir	_	wir	_	PPER	_	nom|pl|*|1	-1	2	_	SB	_	_
2	werden	_	werden	_	VAFIN	_	pl|1|pres|ind	-1	0	_	--	_	_
3	dich	_	dich	_	PRF	_	acc|sg|2	-1	4	_	OA	_	_
4	ausreißen	_	ausreißen	_	VVINF	_	_	-1	2	_	OC	_	_
5	.	_	--	_	$.	_	_	-1	4	_	--	_	_

1	Dein	_	dein	_	PPOSAT	_	nom|sg|neut	-1	2	_	NK	_	_
2	Lügen	_	Lüge	_	NN	_	nom|sg|neut	-1	3	_	SB	_	_
3	hilft	_	helfen	_	VVFIN	_	sg|3|pres|ind	-1	0	_	--	_	_
4	dir	_	dir	_	PPER	_	dat|sg|*|2	-1	3	_	DA	_	_
5	gar	_	gar	_	ADV	_	_	-1	3	_	MO	_	_
6	nichts	_	nichts	_	PIS	_	*|*|neut	-1	3	_	OA	_	_
7	;	_	--	_	$.	_	_	-1	6	_	--	_	_

1	ich	_	ich	_	PPER	_	nom|sg|*|1	-1	2	_	SB	_	_
2	weiß	_	weiß	_	VVFIN	_	sg|1|pres|ind	-1	0	_	--	_	_
3	recht	_	recht	_	ADV	_	_	-1	2	_	MO	_	_
4	wohl	_	wohl	_	ADV	_	_	-1	2	_	MO	_	_
5	,	_	--	_	$,	_	_	-1	4	_	--	_	_
6	an	_	an	_	APPR	_	_	-1	10	_	MO	_	_
7	wen	_	wen	_	PWS	_	acc|sg|masc	-1	6	_	NK	_	_
8	der	_	der	_	ART	_	nom|sg|masc	-1	9	_	NK	_	_
9	Brief	_	Brief	_	NN	_	nom|sg|masc	-1	10	_	SB	_	_
10	ist	_	sein	_	VAFIN	_	sg|3|pres|ind	-1	2	_	OC	_	_
11	.	_	--	_	$.	_	_	-1	10	_	--	_	_

1	Hinaus	_	hinaus	_	ADV	_	_	-1	0	_	--	_	_

1	!	_	--	_	$.	_	_	-1	0	_	--	_	_

1	«	_	«	_	XY	_	_	-1	0	_	--	_	_
2	 	_	 	_	XY	_	_	-1	0	_	--	_	_

1	Ich	_	ich	_	PPER	_	nom|sg|*|1	-1	2	_	SB	_	_
2	mußte	_	müssen	_	VMFIN	_	sg|1|past|ind	-1	0	_	--	_	_
3	in	_	in	_	APPR	_	_	-1	2	_	MO	_	_
4	die	_	der	_	ART	_	acc|sg|fem	-1	5	_	NK	_	_
5	Klasse	_	Klasse	_	NN	_	acc|sg|fem	-1	3	_	NK	_	_
6	zurückgehen	_	zurückgehen	_	VVFIN	_	pl|3|pres|ind	-1	2	_	OC	_	_
7	,	_	--	_	$,	_	_	-1	6	_	--	_	_
8	und	_	und	_	KON	_	_	-1	2	_	CD	_	_
9	am	_	an	_	APPRART	_	dat|sg|masc	-1	11	_	MO	_	_
10	Nachmittag	_	Nachmittag	_	NN	_	dat|sg|masc	-1	9	_	NK	_	_
11	war	_	sein	_	VAFIN	_	sg|3|past|ind	-1	8	_	CJ	_	_
12	Konferenz	_	Konferenz	_	NN	_	nom|sg|fem	-1	11	_	PD	_	_
13	.	_	--	_	$.	_	_	-1	12	_	--	_	_

1	Der	_	der	_	ART	_	nom|sg|masc	-1	2	_	NK	_	_
2	Rektor	_	Rektor	_	NN	_	nom|sg|masc	-1	6	_	SB	_	_
3	und	_	und	_	KON	_	_	-1	2	_	CD	_	_
4	der	_	der	_	ART	_	nom|sg|masc	-1	5	_	NK	_	_
5	Religionslehrer	_	Religionslehrer	_	NN	_	nom|sg|masc	-1	3	_	CJ	_	_
6	wollten	_	wollen	_	VMFIN	_	pl|3|past|ind	-1	0	_	--	_	_
7	mich	_	mich	_	PPER	_	acc|sg|*|1	-1	8	_	OA	_	_
8	dimittieren	_	dimittieren	_	VVINF	_	_	-1	6	_	OC	_	_
9	.	_	--	_	$.	_	_	-1	8	_	--	_	_

1	Das	_	der	_	PDS	_	nom|sg|neut	-1	2	_	SB	_	_
2	hat	_	haben	_	VAFIN	_	sg|3|pres|ind	-1	0	_	--	_	_
3	mir	_	sich	_	PPER	_	dat|sg|*|1	-1	6	_	DA	_	_
4	der	_	der	_	ART	_	nom|sg|masc	-1	5	_	NK	_	_
5	Pedell	_	Pedell	_	NN	_	nom|sg|masc	-1	2	_	SB	_	_
6	gesagt	_	sagen	_	VVPP	_	_	-1	2	_	OC	_	_
7	.	_	--	_	$.	_	_	-1	6	_	--	_	_

1	Aber	_	aber	_	KON	_	_	-1	4	_	JU	_	_
2	die	_	der	_	ART	_	nom|pl|masc	-1	3	_	NK	_	_
3	andern	_	anderer	_	PIS	_	pl|3|pres|ind	-1	4	_	SB	_	_
4	halfen	_	helfen	_	VVFIN	_	pl|3|past|ind	-1	0	_	--	_	_
5	mir	_	sich	_	PPER	_	dat|sg|*|1	-1	4	_	DA	_	_
6	,	_	--	_	$,	_	_	-1	5	_	--	_	_
7	und	_	und	_	KON	_	_	-1	4	_	CD	_	_
8	ich	_	ich	_	PPER	_	nom|sg|*|1	-1	9	_	SB	_	_
9	bekam	_	bekommen	_	VVFIN	_	sg|1|past|ind	-1	7	_	CJ	_	_
10	acht	_	acht	_	CARD	_	_	-1	11	_	NK	_	_
11	Stunden	_	Stunde	_	NN	_	acc|pl|masc	-1	9	_	OA	_	_
12	Karzer	_	Karzer	_	NN	_	acc|pl|masc	-1	11	_	NK	_	_
13	.	_	--	_	$.	_	_	-1	12	_	--	_	_

1	Das	_	der	_	PDS	_	nom|sg|neut	-1	2	_	SB	_	_
2	hätte	_	haben	_	VAFIN	_	sg|3|past|subj	-1	0	_	--	_	_
3	mir	_	sich	_	PPER	_	dat|sg|*|1	-1	6	_	DA	_	_
4	gar	_	gar	_	ADV	_	_	-1	5	_	MO	_	_
5	nichts	_	nichts	_	PIS	_	*|*|neut	-1	6	_	OA	_	_
6	gemacht	_	machen	_	VVPP	_	_	-1	2	_	OC	_	_
7	,	_	--	_	$,	_	_	-1	6	_	--	_	_
8	wenn	_	wenn	_	KOUS	_	_	-1	13	_	CP	_	_
9	nicht	_	nicht	_	PTKNEG	_	_	-1	13	_	NG	_	_
10	das	_	der	_	ART	_	nom|sg|neut	-1	11	_	NK	_	_
11	andere	_	anderer	_	PIS	_	nom|sg|neut	-1	12	_	PD	_	_
12	gewesen	_	sein	_	VAPP	_	_	-1	13	_	OC	_	_
13	wäre	_	sein	_	VAFIN	_	sg|3|past|subj	-1	6	_	MO	_	_
14	.	_	--	_	$.	_	_	-1	13	_	--	_	_
15	 	_	 	_	XY	_	_	-1	0	_	--	_	_

1	Ich	_	ich	_	PPER	_	nom|sg|*|1	-1	2	_	SB	_	_
2	kriegte	_	kriegen	_	VVFIN	_	sg|1|pres|ind	-1	0	_	--	_	_
3	einige	_	einiger	_	PIAT	_	acc|pl|masc	-1	4	_	NK	_	_
4	Tage	_	Tag	_	NN	_	acc|pl|masc	-1	2	_	OA	_	_
5	darauf	_	darauf	_	PROAV	_	_	-1	2	_	MO	_	_
6	einen	_	ein	_	ART	_	acc|sg|masc	-1	7	_	NK	_	_
7	Brief	_	Brief	_	NN	_	acc|sg|masc	-1	2	_	OA	_	_
8	von	_	von	_	APPR	_	_	-1	7	_	MNR	_	_
9	meiner	_	mein	_	PPOSAT	_	dat|sg|fem	-1	10	_	NK	_	_
10	Mama	_	--	_	NN	_	dat|sg|fem	-1	8	_	NK	_	_
11	.	_	--	_	$.	_	_	-1	10	_	--	_	_

1	Da	_	da	_	ADV	_	_	-1	2	_	MO	_	_
2	lag	_	liegen	_	VVFIN	_	sg|3|past|ind	-1	0	_	--	_	_
3	ein	_	ein	_	ART	_	nom|sg|masc	-1	4	_	NK	_	_
4	Brief	_	Brief	_	NN	_	nom|sg|masc	-1	2	_	SB	_	_
5	von	_	von	_	APPR	_	_	-1	4	_	PG	_	_
6	Herrn	_	Herr	_	NN	_	dat|sg|masc	-1	5	_	NK	_	_
7	von	_	von	_	APPR	_	_	-1	6	_	PG	_	_
8	Rupp	_	Rupp	_	NE	_	dat|sg|neut	-1	7	_	NK	_	_
9	bei	_	bei	_	PTKVZ	_	_	-1	2	_	SVP	_	_
10	,	_	--	_	$,	_	_	-1	9	_	--	_	_
11	daß	_	daß	_	KOUS	_	_	-1	15	_	CP	_	_
12	es	_	es	_	PPER	_	nom|sg|neut|3	-1	15	_	SB	_	_
13	ihm	_	ihm	_	PPER	_	dat|sg|masc|3	-1	15	_	DA	_	_
14	leid	_	leid	_	ADJD	_	pos	-1	15	_	MO	_	_
15	täte	_	tun	_	VVFIN	_	sg|3|past|subj	-1	2	_	OC	_	_
16	,	_	--	_	$,	_	_	-1	15	_	--	_	_
17	aber	_	aber	_	KON	_	_	-1	2	_	CD	_	_
18	er	_	er	_	PPER	_	nom|sg|masc|3	-1	19	_	SB	_	_
19	könne	_	können	_	VMFIN	_	sg|3|pres|subj	-1	17	_	CJ	_	_
20	mich	_	mich	_	PPER	_	acc|sg|*|1	-1	23	_	OA	_	_
21	nicht	_	nicht	_	PTKNEG	_	_	-1	19	_	NG	_	_
22	mehr	_	mehr	_	ADV	_	_	-1	21	_	MO	_	_
23	einladen	_	einladen	_	VVINF	_	_	-1	19	_	OC	_	_
24	,	_	--	_	$,	_	_	-1	23	_	--	_	_
25	weil	_	weil	_	KOUS	_	_	-1	29	_	CP	_	_
26	ihm	_	ihm	_	PPER	_	dat|sg|masc|3	-1	29	_	DA	_	_
27	der	_	der	_	ART	_	nom|sg|masc	-1	28	_	NK	_	_
28	Rektor	_	Rektor	_	NN	_	nom|sg|masc	-1	29	_	SB	_	_
29	mitteilte	_	mitteilen	_	VVFIN	_	sg|3|past|ind	-1	19	_	MO	_	_
30	,	_	--	_	$,	_	_	-1	29	_	--	_	_
31	daß	_	daß	_	KOUS	_	_	-1	40	_	CP	_	_
32	ich	_	ich	_	PPER	_	nom|sg|*|1	-1	40	_	SB	_	_
33	einen	_	ein	_	ART	_	acc|sg|masc	-1	35	_	NK	_	_
34	dummen	_	dumm	_	ADJA	_	acc|sg|masc|pos	-1	35	_	NK	_	_
35	Liebesbrief	_	Liebesbrief	_	NN	_	acc|sg|masc	-1	39	_	OA	_	_
36	an	_	an	_	APPR	_	_	-1	39	_	MO	_	_
37	seine	_	sein	_	PPOSAT	_	acc|pl|neut	-1	38	_	NK	_	_
38	Tochter	_	Tochter	_	NN	_	acc|pl|neut	-1	36	_	NK	_	_
39	geschrieben	_	schreiben	_	VVPP	_	_	-1	40	_	OC	_	_
40	habe	_	haben	_	VAFIN	_	sg|3|pres|subj	-1	29	_	OC	_	_
41	.	_	--	_	$.	_	_	-1	40	_	--	_	_

1	Er	_	er	_	PPER	_	nom|sg|masc|3	-1	2	_	SB	_	_
2	mache	_	machen	_	VVFIN	_	sg|3|pres|subj	-1	0	_	--	_	_
3	sich	_	sich	_	PRF	_	acc|sg|3	-1	2	_	OA	_	_
4	nichts	_	nichts	_	PIS	_	*|*|neut	-1	2	_	OA	_	_
5	daraus	_	daraus	_	PROAV	_	_	-1	2	_	MO	_	_
6	,	_	--	_	$,	_	_	-1	5	_	--	_	_
7	aber	_	aber	_	KON	_	_	-1	2	_	CD	_	_
8	ich	_	ich	_	PPER	_	nom|sg|*|1	-1	9	_	SB	_	_
9	hätte	_	haben	_	VAFIN	_	sg|3|past|subj	-1	7	_	CJ	_	_
10	sie	_	sie	_	PPER	_	nom|sg|fem|3	-1	12	_	OA	_	_
11	doch	_	doch	_	ADV	_	_	-1	12	_	MO	_	_
12	kompromittiert	_	kompromittieren	_	VVPP	_	_	-1	9	_	OC	_	_
13	.	_	--	_	$.	_	_	-1	12	_	--	_	_

1	Und	_	und	_	KON	_	_	-1	4	_	JU	_	_
2	meine	_	mein	_	PPOSAT	_	nom|sg|fem	-1	3	_	NK	_	_
3	Mama	_	--	_	NN	_	nom|sg|fem	-1	4	_	SB	_	_
4	schrieb	_	schreiben	_	VVFIN	_	sg|3|past|ind	-1	0	_	--	_	_
5	,	_	--	_	$,	_	_	-1	4	_	--	_	_
6	sie	_	sie	_	PPER	_	nom|sg|fem|3	-1	7	_	SB	_	_
7	wüßte	_	wissen	_	VVFIN	_	sg|1|past|subj	-1	4	_	OC	_	_
8	nicht	_	nicht	_	PTKNEG	_	_	-1	7	_	NG	_	_
9	,	_	--	_	$,	_	_	-1	8	_	--	_	_
10	was	_	was	_	PWS	_	nom|sg|neut	-1	14	_	SB	_	_
11	noch	_	noch	_	ADV	_	_	-1	14	_	MO	_	_
12	aus	_	aus	_	APPR	_	_	-1	14	_	MO	_	_
13	mir	_	sich	_	PPER	_	dat|sg|*|1	-1	12	_	NK	_	_
14	wird	_	werden	_	VAFIN	_	sg|3|pres|ind	-1	7	_	OC	_	_
15	.	_	--	_	$.	_	_	-1	14	_	--	_	_
16	 	_	 	_	XY	_	_	-1	0	_	--	_	_

1	Ich	_	ich	_	PPER	_	nom|sg|*|1	-1	2	_	SB	_	_
2	war	_	sein	_	VAFIN	_	sg|1|past|ind	-1	0	_	--	_	_
3	ganz	_	ganz	_	ADV	_	_	-1	2	_	MO	_	_
4	außer	_	außer	_	APPR	_	_	-1	2	_	MO	_	_
5	mir	_	sich	_	PPER	_	dat|sg|*|1	-1	4	_	NK	_	_
6	über	_	über	_	APPR	_	_	-1	2	_	MO	_	_
7	die	_	der	_	ART	_	acc|sg|fem	-1	8	_	NK	_	_
8	Schufterei	_	Schufterei	_	NN	_	acc|sg|fem	-1	6	_	NK	_	_
9	;	_	--	_	$.	_	_	-1	8	_	--	_	_

1	zuerst	_	zuerst	_	ADV	_	_	-1	2	_	MO	_	_
2	weinte	_	weinen	_	VVFIN	_	sg|1|past|ind	-1	0	_	--	_	_
3	ich	_	ich	_	PPER	_	nom|sg|*|1	-1	2	_	SB	_	_
4	,	_	--	_	$,	_	_	-1	3	_	--	_	_
5	und	_	und	_	KON	_	_	-1	2	_	CD	_	_
6	dann	_	dann	_	ADV	_	_	-1	7	_	MO	_	_
7	wollte	_	wollen	_	VMFIN	_	sg|1|past|ind	-1	5	_	CJ	_	_
8	ich	_	ich	_	PPER	_	nom|sg|*|1	-1	7	_	SB	_	_
9	den	_	der	_	ART	_	acc|sg|masc	-1	10	_	NK	_	_
10	Rektor	_	Rektor	_	NN	_	acc|sg|masc	-1	13	_	OA	_	_
11	zur	_	zu	_	APPRART	_	dat|sg|fem	-1	13	_	CVC	_	_
12	Rede	_	Rede	_	NN	_	dat|sg|fem	-1	11	_	NK	_	_
13	stellen	_	stellen	_	VVINF	_	_	-1	7	_	OC	_	_
14	;	_	--	_	$.	_	_	-1	13	_	--	_	_

1	aber	_	aber	_	KON	_	_	-1	3	_	JU	_	_
2	dann	_	dann	_	ADV	_	_	-1	3	_	MO	_	_
3	überlegte	_	überlegen	_	VVFIN	_	sg|1|past|ind	-1	0	_	--	_	_
4	ich	_	ich	_	PPER	_	nom|sg|*|1	-1	3	_	SB	_	_
5	es	_	es	_	PPER	_	acc|sg|neut|3	-1	3	_	OA	_	_
6	und	_	und	_	KON	_	_	-1	3	_	CD	_	_
7	ging	_	gehen	_	VVFIN	_	sg|3|past|ind	-1	6	_	CJ	_	_
8	zu	_	zu	_	APPR	_	_	-1	7	_	MO	_	_
9	Herrn	_	Herr	_	NN	_	dat|sg|masc	-1	8	_	NK	_	_
10	von	_	von	_	APPR	_	_	-1	9	_	PG	_	_
11	Rupp	_	Rupp	_	NE	_	dat|sg|neut	-1	10	_	NK	_	_
12	.	_	--	_	$.	_	_	-1	11	_	--	_	_
13	 	_	 	_	XY	_	_	-1	9	_	NK	_	_

1	Das	_	der	_	ART	_	nom|sg|neut	-1	2	_	NK	_	_
2	Mädchen	_	Mädchen	_	NN	_	nom|sg|neut	-1	3	_	SB	_	_
3	sagte	_	sagen	_	VVFIN	_	sg|3|past|ind	-1	0	_	--	_	_
4	,	_	--	_	$,	_	_	-1	3	_	--	_	_
5	es	_	es	_	PPER	_	nom|sg|neut|3	-1	6	_	SB	_	_
6	sei	_	sein	_	VAFIN	_	sg|3|pres|subj	-1	3	_	OC	_	_
7	niemand	_	niemand	_	PIS	_	nom|sg|masc	-1	6	_	SB	_	_
8	zu	_	zu	_	APPR	_	_	-1	7	_	MNR	_	_
9	Hause	_	Haus	_	NN	_	dat|sg|neut	-1	8	_	NK	_	_
10	,	_	--	_	$,	_	_	-1	9	_	--	_	_
11	aber	_	aber	_	KON	_	_	-1	6	_	CD	_	_
12	das	_	der	_	PDS	_	nom|sg|neut	-1	13	_	SB	_	_
13	war	_	sein	_	VAFIN	_	sg|3|past|ind	-1	11	_	CJ	_	_
14	nicht	_	nicht	_	PTKNEG	_	_	-1	13	_	NG	_	_
15	wahr	_	wahr	_	ADJD	_	pos	-1	13	_	PD	_	_
16	,	_	--	_	$,	_	_	-1	15	_	--	_	_
17	weil	_	weil	_	KOUS	_	_	-1	27	_	CP	_	_
18	ich	_	ich	_	PPER	_	nom|sg|*|1	-1	27	_	SB	_	_
19	heraußen	_	heraußen	_	VVFIN	_	pl|3|pres|ind	-1	26	_	OC	_	_
20	die	_	der	_	ART	_	acc|sg|fem	-1	21	_	NK	_	_
21	Stimme	_	Stimme	_	NN	_	acc|sg|fem	-1	19	_	OA	_	_
22	der	_	der	_	ART	_	gen|sg|fem	-1	23	_	NK	_	_
23	Frau	_	Frau	_	NN	_	gen|sg|fem	-1	21	_	AG	_	_
24	von	_	von	_	APPR	_	_	-1	23	_	PG	_	_
25	Rupp	_	Rupp	_	NE	_	dat|sg|*	-1	24	_	NK	_	_
26	gehört	_	gehören	_	VVPP	_	_	-1	27	_	OC	_	_
27	habe	_	haben	_	VAFIN	_	sg|3|pres|subj	-1	13	_	MO	_	_
28	.	_	--	_	$.	_	_	-1	27	_	--	_	_

1	Ich	_	ich	_	PPER	_	nom|sg|*|1	-1	2	_	SB	_	_
2	kam	_	kommen	_	VVFIN	_	sg|1|past|ind	-1	0	_	--	_	_
3	noch	_	noch	_	ADV	_	_	-1	2	_	MO	_	_
4	einmal	_	einmal	_	ADV	_	_	-1	3	_	MO	_	_
5	,	_	--	_	$,	_	_	-1	4	_	--	_	_
6	und	_	und	_	KON	_	_	-1	2	_	CD	_	_
7	da	_	da	_	ADV	_	_	-1	8	_	MO	_	_
8	war	_	sein	_	VAFIN	_	sg|3|past|ind	-1	6	_	CJ	_	_
9	Herr	_	Herr	_	NN	_	nom|sg|masc	-1	8	_	SB	_	_
10	von	_	von	_	APPR	_	_	-1	11	_	PNC	_	_
11	Rupp	_	Rupp	_	NE	_	nom|sg|masc	-1	9	_	NK	_	_
12	da	_	da	_	PTKVZ	_	_	-1	8	_	PD	_	_
13	.	_	--	_	$.	_	_	-1	12	_	--	_	_

1	Ich	_	ich	_	PPER	_	nom|sg|*|1	-1	2	_	SB	_	_
2	erzählte	_	erzählen	_	VVFIN	_	sg|1|pres|ind	-1	14	_	OC	_	_
3	ihm	_	ihm	_	PPER	_	dat|sg|masc|3	-1	2	_	DA	_	_
4	alles	_	alle	_	PIS	_	acc|sg|neut	-1	2	_	OA	_	_
5	ganz	_	ganz	_	ADV	_	_	-1	6	_	MO	_	_
6	genau	_	genau	_	ADJD	_	pos	-1	12	_	PD	_	_
7	,	_	--	_	$,	_	_	-1	6	_	--	_	_
8	aber	_	aber	_	KON	_	_	-1	6	_	CD	_	_
9	wie	_	wie	_	KOKOM	_	_	-1	8	_	CJ	_	_
10	ich	_	ich	_	PPER	_	nom|sg|*|1	-1	12	_	SB	_	_
11	fertig	_	fertig	_	ADJD	_	pos	-1	12	_	PD	_	_
12	war	_	sein	_	VAFIN	_	sg|3|past|ind	-1	4	_	RC	_	_
13	,	_	--	_	$,	_	_	-1	12	_	--	_	_
14	drückte	_	drücken	_	VVFIN	_	sg|3|past|ind	-1	0	_	--	_	_
15	er	_	er	_	PPER	_	nom|sg|masc|3	-1	14	_	SB	_	_
16	das	_	der	_	ART	_	acc|sg|neut	-1	18	_	NK	_	_
17	linke	_	linke	_	ADJA	_	acc|pl|masc|pos	-1	18	_	NK	_	_
18	Auge	_	Auge	_	NN	_	acc|pl|masc	-1	14	_	OA	_	_
19	zu	_	zu	_	PTKVZ	_	_	-1	14	_	SVP	_	_
20	und	_	und	_	KON	_	_	-1	14	_	CD	_	_
21	sagte	_	sagen	_	VVFIN	_	sg|3|past|ind	-1	20	_	CJ	_	_
22	:	_	--	_	$.	_	_	-1	21	_	--	_	_
23	»	_	»	_	XY	_	_	-1	0	_	--	_	_
24	Du	_	du	_	PPER	_	nom|sg|*|2	-1	25	_	SB	_	_
25	bist	_	sein	_	VAFIN	_	sg|2|pres|ind	-1	21	_	OC	_	_
26	schon	_	schon	_	ADV	_	_	-1	25	_	MO	_	_
27	ein	_	ein	_	ART	_	nom|sg|masc	-1	29	_	NK	_	_
28	verdammter	_	verdammt	_	ADJA	_	nom|sg|masc|pos	-1	29	_	NK	_	_
29	Holzfuchs	_	Holzfuch	_	NN	_	nom|sg|masc	-1	25	_	PD	_	_
30	.	_	--	_	$.	_	_	-1	29	_	--	_	_

1	Es	_	es	_	PPER	_	nom|sg|neut|3	-1	2	_	SB	_	_
2	liegt	_	liegen	_	VVFIN	_	sg|3|pres|ind	-1	0	_	--	_	_
3	mir	_	sich	_	PPER	_	dat|sg|*|1	-1	2	_	DA	_	_
4	ja	_	ja	_	ADV	_	_	-1	2	_	MO	_	_
5	gar	_	gar	_	ADV	_	_	-1	6	_	MO	_	_
6	nichts	_	nichts	_	PIS	_	*|*|neut	-1	2	_	OA	_	_
7	daran	_	daran	_	PROAV	_	_	-1	2	_	MO	_	_
8	,	_	--	_	$,	_	_	-1	7	_	--	_	_
9	aber	_	aber	_	KON	_	_	-1	7	_	CD	_	_
10	meiner	_	mein	_	PPOSAT	_	nom|sg|masc	-1	11	_	NK	_	_
11	Frau	_	Frau	_	NN	_	nom|sg|masc	-1	9	_	CJ	_	_
12	.	_	--	_	$.	_	_	-1	11	_	--	_	_
13	«	_	«	_	XY	_	_	-1	7	_	NK	_	_

1	Und	_	und	_	KON	_	_	-1	3	_	JU	_	_
2	dann	_	dann	_	ADV	_	_	-1	3	_	MO	_	_
3	gab	_	geben	_	VVFIN	_	sg|3|past|ind	-1	0	_	--	_	_
4	er	_	er	_	PPER	_	nom|sg|masc|3	-1	3	_	SB	_	_
5	mir	_	sich	_	PPER	_	dat|sg|*|1	-1	3	_	DA	_	_
6	eine	_	ein	_	ART	_	acc|sg|fem	-1	7	_	NK	_	_
7	Zigarre	_	Zigarre	_	NN	_	acc|sg|fem	-1	3	_	OA	_	_
8	und	_	und	_	KON	_	_	-1	3	_	CD	_	_
9	sagte	_	sagen	_	VVFIN	_	sg|3|past|ind	-1	8	_	CJ	_	_
10	,	_	--	_	$,	_	_	-1	9	_	--	_	_
11	ich	_	ich	_	PPER	_	nom|sg|*|1	-1	12	_	SB	_	_
12	solle	_	sollen	_	VMFIN	_	sg|3|pres|subj	-1	9	_	OC	_	_
13	nun	_	nun	_	ADV	_	_	-1	12	_	MO	_	_
14	ganz	_	ganz	_	ADV	_	_	-1	15	_	MO	_	_
15	ruhig	_	ruhig	_	ADJD	_	pos	-1	16	_	MO	_	_
16	heimgehen	_	heimgehen	_	VVINF	_	_	-1	12	_	OC	_	_
17	.	_	--	_	$.	_	_	-1	16	_	--	_	_
18	 	_	 	_	XY	_	_	-1	0	_	--	_	_

1	Er	_	er	_	PPER	_	nom|sg|masc|3	-1	2	_	SB	_	_
2	hat	_	haben	_	VAFIN	_	sg|3|pres|ind	-1	0	_	--	_	_
3	mir	_	sich	_	PPER	_	dat|sg|*|1	-1	6	_	DA	_	_
4	kein	_	kein	_	PIAT	_	acc|sg|neut	-1	5	_	NK	_	_
5	Wort	_	Wort	_	NN	_	acc|sg|neut	-1	6	_	OA	_	_
6	geglaubt	_	glauben	_	VVPP	_	_	-1	2	_	OC	_	_
7	und	_	und	_	KON	_	_	-1	2	_	CD	_	_
8	hat	_	haben	_	VAFIN	_	sg|3|pres|ind	-1	7	_	CJ	_	_
9	mich	_	mich	_	PPER	_	acc|sg|*|1	-1	12	_	OA	_	_
10	nicht	_	nicht	_	PTKNEG	_	_	-1	12	_	NG	_	_
11	mehr	_	mehr	_	ADV	_	_	-1	10	_	MO	_	_
12	eingeladen	_	einladen	_	VVPP	_	_	-1	8	_	OC	_	_
13	,	_	--	_	$,	_	_	-1	12	_	--	_	_
14	weil	_	weil	_	KOUS	_	_	-1	20	_	CP	_	_
15	man	_	man	_	PIS	_	nom|sg|*	-1	20	_	SB	_	_
16	es	_	es	_	PPER	_	acc|sg|neut|3	-1	20	_	OA	_	_
17	nicht	_	nicht	_	PTKNEG	_	_	-1	20	_	NG	_	_
18	für	_	für	_	APPR	_	_	-1	20	_	MO	_	_
19	möglich	_	möglich	_	ADJD	_	pos	-1	18	_	NK	_	_
20	hält	_	halten	_	VVFIN	_	sg|3|pres|ind	-1	12	_	MO	_	_
21	,	_	--	_	$,	_	_	-1	20	_	--	_	_
22	daß	_	daß	_	KOUS	_	_	-1	25	_	CP	_	_
23	ein	_	ein	_	ART	_	nom|sg|masc	-1	24	_	NK	_	_
24	Rektor	_	Rektor	_	NN	_	nom|sg|masc	-1	25	_	SB	_	_
25	lügt	_	lügen	_	VVFIN	_	sg|3|pres|ind	-1	16	_	RE	_	_
26	.	_	--	_	$.	_	_	-1	25	_	--	_	_
27	 	_	 	_	XY	_	_	-1	12	_	OA	_	_

1	Man	_	man	_	PIS	_	nom|sg|*	-1	2	_	SB	_	_
2	meint	_	meinen	_	VVFIN	_	sg|3|pres|ind	-1	0	_	--	_	_
3	immer	_	immer	_	ADV	_	_	-1	2	_	MO	_	_
4	,	_	--	_	$,	_	_	-1	3	_	--	_	_
5	der	_	der	_	ART	_	nom|sg|masc	-1	6	_	NK	_	_
6	Schüler	_	Schüler	_	NN	_	nom|sg|masc	-1	7	_	SB	_	_
7	lügt	_	lügen	_	VVFIN	_	sg|3|pres|ind	-1	2	_	OC	_	_
8	.	_	--	_	$.	_	_	-1	7	_	--	_	_
9	 	_	 	_	XY	_	_	-1	0	_	--	_	_

1	Ich	_	ich	_	PPER	_	nom|sg|*|1	-1	2	_	SB	_	_
2	habe	_	haben	_	VAFIN	_	sg|1|pres|ind	-1	0	_	--	_	_
3	mir	_	sich	_	PRF	_	dat|sg|1	-1	6	_	DA	_	_
4	das	_	der	_	ART	_	acc|sg|neut	-1	5	_	NK	_	_
5	Ehrenwort	_	Ehrenwort	_	NN	_	acc|sg|neut	-1	6	_	OA	_	_
6	gegeben	_	geben	_	VVPP	_	_	-1	2	_	OC	_	_
7	,	_	--	_	$,	_	_	-1	6	_	--	_	_
8	daß	_	daß	_	KOUS	_	_	-1	11	_	CP	_	_
9	ich	_	ich	_	PPER	_	nom|sg|*|1	-1	11	_	SB	_	_
10	ihn	_	ihn	_	PPER	_	acc|sg|masc|3	-1	11	_	OA	_	_
11	durchhaue	_	durchhauen	_	VVFIN	_	sg|1|pres|ind	-1	6	_	OC	_	_
12	,	_	--	_	$,	_	_	-1	11	_	--	_	_
13	wenn	_	wenn	_	KOUS	_	_	-1	18	_	CP	_	_
14	ich	_	ich	_	PPER	_	nom|sg|*|1	-1	18	_	SB	_	_
15	auf	_	auf	_	APPR	_	_	-1	18	_	MO	_	_
16	die	_	der	_	ART	_	acc|sg|fem	-1	17	_	NK	_	_
17	Universität	_	Universität	_	NN	_	acc|sg|fem	-1	15	_	NK	_	_
18	komme	_	kommen	_	VVFIN	_	sg|3|pres|subj	-1	11	_	MO	_	_
19	,	_	--	_	$,	_	_	-1	18	_	--	_	_
20	den	_	der	_	ART	_	acc|sg|masc	-1	22	_	NK	_	_
21	kommunen	_	kommun	_	ADJA	_	acc|sg|masc|pos	-1	22	_	NK	_	_
22	Schuften	_	Schuft	_	NN	_	acc|sg|masc	-1	6	_	OA	_	_
23	.	_	--	_	$.	_	_	-1	22	_	--	_	_
24	 	_	 	_	XY	_	_	-1	6	_	OA	_	_

1	Ich	_	ich	_	PPER	_	nom|sg|*|1	-1	2	_	SB	_	_
2	bin	_	sein	_	VAFIN	_	sg|1|pres|ind	-1	0	_	--	_	_
3	lange	_	lange	_	ADV	_	_	-1	7	_	MO	_	_
4	nicht	_	nicht	_	PTKNEG	_	_	-1	7	_	NG	_	_
5	mehr	_	mehr	_	ADV	_	_	-1	4	_	MO	_	_
6	lustig	_	lustig	_	ADJD	_	pos	-1	7	_	PD	_	_
7	gewesen	_	sein	_	VAPP	_	_	-1	2	_	OC	_	_
8	.	_	--	_	$.	_	_	-1	7	_	--	_	_

1	Und	_	und	_	KON	_	_	-1	3	_	JU	_	_
2	einmal	_	einmal	_	ADV	_	_	-1	3	_	MO	_	_
3	bin	_	sein	_	VAFIN	_	sg|1|pres|ind	-1	0	_	--	_	_
4	ich	_	ich	_	PPER	_	nom|sg|*|1	-1	3	_	SB	_	_
5	dem	_	der	_	ART	_	dat|sg|neut	-1	6	_	NK	_	_
6	Fräulein	_	Fräulein	_	NN	_	dat|sg|neut	-1	9	_	DA	_	_
7	von	_	von	_	APPR	_	_	-1	6	_	PG	_	_
8	Rupp	_	Rupp	_	NE	_	dat|sg|neut	-1	7	_	NK	_	_
9	begegnet	_	begegnen	_	VVFIN	_	sg|3|pres|ind	-1	3	_	OC	_	_
10	.	_	--	_	$.	_	_	-1	9	_	--	_	_

1	Sie	_	sie	_	PPER	_	nom|sg|fem|3	-1	2	_	SB	_	_
2	ist	_	sein	_	VAFIN	_	sg|3|pres|ind	-1	0	_	--	_	_
3	mit	_	mit	_	APPR	_	_	-1	7	_	MO	_	_
4	ein	_	ein	_	ART	_	*|*|*	-1	5	_	NK	_	_
5	paar	_	paar	_	PIAT	_	*|*|*	-1	6	_	NK	_	_
6	Freundinnen	_	Freundin	_	NN	_	acc|pl|fem	-1	3	_	NK	_	_
7	gegangen	_	gehen	_	VVPP	_	_	-1	2	_	OC	_	_
8	,	_	--	_	$,	_	_	-1	7	_	--	_	_
9	und	_	und	_	KON	_	_	-1	2	_	CD	_	_
10	da	_	da	_	ADV	_	_	-1	17	_	MO	_	_
11	haben	_	haben	_	VAFIN	_	pl|3|pres|ind	-1	9	_	CJ	_	_
12	sie	_	sie	_	PPER	_	nom|pl|*|3	-1	11	_	SB	_	_
13	sich	_	sich	_	PRF	_	acc|pl|3	-1	17	_	OA	_	_
14	mit	_	mit	_	APPR	_	_	-1	17	_	MO	_	_
15	den	_	der	_	ART	_	dat|pl|neut	-1	16	_	NK	_	_
16	Ellenbogen	_	Ellenbogen	_	NN	_	dat|pl|neut	-1	14	_	NK	_	_
17	angestoßen	_	anstoßen	_	VVPP	_	_	-1	11	_	OC	_	_
18	und	_	und	_	KON	_	_	-1	11	_	CD	_	_
19	haben	_	haben	_	VAFIN	_	pl|3|pres|ind	-1	18	_	CJ	_	_
20	gelacht	_	lachen	_	VVPP	_	_	-1	19	_	OC	_	_
21	.	_	--	_	$.	_	_	-1	20	_	--	_	_

1	Und	_	und	_	KON	_	_	-1	3	_	JU	_	_
2	sie	_	sie	_	PPER	_	nom|pl|*|3	-1	3	_	SB	_	_
3	haben	_	haben	_	VAFIN	_	pl|3|pres|ind	-1	0	_	--	_	_
4	sich	_	sich	_	PRF	_	acc|pl|3	-1	6	_	OA	_	_
5	noch	_	noch	_	ADV	_	_	-1	6	_	MO	_	_
6	umgedreht	_	umgedehen	_	VVPP	_	_	-1	3	_	OC	_	_
7	und	_	und	_	KON	_	_	-1	6	_	CD	_	_
8	immer	_	immer	_	ADV	_	_	-1	9	_	MO	_	_
9	wieder	_	wieder	_	ADV	_	_	-1	10	_	MO	_	_
10	gelacht	_	lachen	_	VVPP	_	_	-1	7	_	CJ	_	_
11	.	_	--	_	$.	_	_	-1	10	_	--	_	_
12	 	_	 	_	XY	_	_	-1	10	_	OA	_	_

1	Wenn	_	wenn	_	KOUS	_	_	-1	6	_	CP	_	_
2	ich	_	ich	_	PPER	_	nom|sg|*|1	-1	6	_	SB	_	_
3	auf	_	auf	_	APPR	_	_	-1	6	_	MO	_	_
4	die	_	der	_	ART	_	acc|sg|fem	-1	5	_	NK	_	_
5	Universität	_	Universität	_	NN	_	acc|sg|fem	-1	3	_	NK	_	_
6	komme	_	kommen	_	VVFIN	_	sg|3|pres|subj	-1	24	_	MO	_	_
7	und	_	und	_	KON	_	_	-1	6	_	CD	_	_
8	Korpsstudent	_	Korpsstudent	_	NN	_	pos	-1	9	_	PD	_	_
9	bin	_	sein	_	VAFIN	_	sg|1|pres|ind	-1	7	_	CJ	_	_
10	,	_	--	_	$,	_	_	-1	9	_	--	_	_
11	und	_	und	_	KON	_	_	-1	6	_	CD	_	_
12	wenn	_	wenn	_	KOUS	_	_	-1	17	_	CP	_	_
13	sie	_	sie	_	PPER	_	nom|pl|masc|3	-1	17	_	SB	_	_
14	mit	_	mit	_	APPR	_	_	-1	16	_	MO	_	_
15	mir	_	sich	_	PPER	_	dat|sg|*|1	-1	14	_	NK	_	_
16	tanzen	_	tanzen	_	VVINF	_	_	-1	17	_	OC	_	_
17	wollen	_	wollen	_	VMFIN	_	pl|3|pres|ind	-1	19	_	MO	_	_
18	,	_	--	_	$,	_	_	-1	17	_	--	_	_
19	lasse	_	lassen	_	VVFIN	_	sg|3|pres|subj	-1	11	_	CJ	_	_
20	ich	_	ich	_	PPER	_	nom|sg|*|1	-1	19	_	SB	_	_
21	die	_	der	_	ART	_	acc|sg|fem	-1	22	_	NK	_	_
22	Schneegänse	_	Schneegänse	_	NN	_	acc|sg|fem	-1	19	_	OA	_	_
23	einfach	_	einfach	_	ADV	_	_	-1	24	_	MO	_	_
24	sitzen	_	sitzen	_	VVINF	_	_	-1	26	_	OC	_	_
25	.	_	--	_	$.	_	_	-1	24	_	--	_	_
26	 	_	 	_	XY	_	_	-1	0	_	--	_	_

1	Das	_	der	_	PDS	_	nom|sg|neut	-1	2	_	SB	_	_
2	ist	_	sein	_	VAFIN	_	sg|3|pres|ind	-1	0	_	--	_	_
3	mir	_	sich	_	PPER	_	dat|sg|*|1	-1	5	_	DA	_	_
4	ganz	_	ganz	_	ADV	_	_	-1	5	_	MO	_	_
5	wurscht	_	wurschen	_	VVPP	_	_	-1	2	_	PD	_	_
6	.	_	--	_	$.	_	_	-1	5	_	--	_	_
7	 	_	 	_	XY	_	_	-1	0	_	--	_	_

