              P         R         F
GI     0.703704  0.467213  0.561576
micro  0.703704  0.467213  0.561576
macro  0.703704  0.467213  0.561576
binar  0.703704  0.467213  0.561576

          GI  untagged
GI        57        65
untagged  24      1467
