              P         R         F
ALL    0.864407  0.796875  0.829268
BARE   0.822222  0.611570  0.701422
DIV    0.944444  0.894737  0.918919
EXIST  1.000000  1.000000  1.000000
MEIST  1.000000  1.000000  1.000000
NEG    0.942308  0.890909  0.915888
micro  0.876106  0.744361  0.804878
macro  0.928897  0.865682  0.894249
binar  0.897778  0.765152  0.826176

          ALL  BARE  DIV  EXIST  MEIST  NEG  untagged  multiple
ALL        50     4    0      0      0    0         9         0
BARE        1    74    0      0      0    0        46         0
DIV         0     0   16      0      0    0         2         0
EXIST       0     0    0      2      0    0         0         0
MEIST       0     0    0      0      4    0         0         0
NEG         0     0    0      0      0   49         5         0
untagged    7    12    1      0      0    3      1306         0
multiple    1     0    0      0      0    0         0         1
