              P         R         F
GI     0.613445  0.276515  0.381201
micro  0.613445  0.276515  0.381201
macro  0.613445  0.276515  0.381201
binar  0.613445  0.276515  0.381201

          GI  untagged
GI        73       191
untagged  46      1283
