              P     R         F
GI     0.814815  0.44  0.571429
micro  0.814815  0.44  0.571429
macro  0.814815  0.44  0.571429
binar  0.814815  0.44  0.571429

          GI  untagged
GI        44        56
untagged  10       716
