             P         R         F
GI     0.82906  0.436937  0.572271
micro  0.82906  0.436937  0.572271
macro  0.82906  0.436937  0.572271
binar  0.82906  0.436937  0.572271

           GI  untagged
GI        291       375
untagged   60      1085
