              P         R         F
ALL    0.200000  0.666667  0.307692
BARE   0.009709  0.428571  0.018987
DIV    0.142857  0.100000  0.117647
EXIST  0.500000  1.000000  0.666667
MEIST  0.000000  0.000000  0.000000
NEG    0.116279  0.384615  0.178571
micro  0.047030  0.431818  0.084821
macro  0.161474  0.429976  0.214927
binar  0.049505  0.454545  0.089286

          ALL  BARE  DIV  EXIST  MEIST  NEG  untagged  multiple
ALL         8     0    0      0      0    0         4         0
BARE        0     3    0      0      0    0         4         0
DIV         0     1    1      0      0    0         8         0
EXIST       0     0    0      2      0    0         0         0
MEIST       0     0    0      0      0    0         0         0
NEG         0     0    0      0      0    5         8         0
untagged   32   305    6      2      1   38       523         0
multiple    0     0    0      0      0    0         0         0
