              P         R        F
GI     0.759305  0.530329  0.62449
micro  0.759305  0.530329  0.62449
macro  0.759305  0.530329  0.62449
binar  0.759305  0.530329  0.62449

           GI  untagged
GI        306       271
untagged   97       501
