              P         R         F
ALL    0.250000  0.343750  0.289474
BARE   0.233333  0.090323  0.130233
DIV    0.526316  0.142857  0.224719
EXIST  1.000000  1.000000  1.000000
MEIST  0.000000  0.000000  0.000000
NEG    0.384615  0.051546  0.090909
micro  0.291971  0.111732  0.161616
macro  0.399044  0.271413  0.289222
binar  0.430657  0.166197  0.239837

          ALL  BARE  DIV  EXIST  MEIST  NEG  untagged  multiple
ALL        11     4    0      0      0    0        16         0
BARE        4    13    2      0      0    1       133         0
DIV         0     2   10      0      0    0        56         0
EXIST       0     0    0      0      0    0         0         0
MEIST       0     0    0      0      0    0         4         0
NEG         1     3    1      0      0    5        86         0
untagged   28    36    6      0      1    7       756         0
multiple    0     2    0      0      0    0         1         0
