              P         R         F
ALL    0.583333  0.736842  0.651163
BARE   0.666667  0.461538  0.545455
DIV    0.666667  0.500000  0.571429
EXIST  1.000000  1.000000  1.000000
MEIST  1.000000  1.000000  1.000000
NEG    1.000000  0.444444  0.615385
micro  0.692308  0.534653  0.603352
macro  0.819444  0.690471  0.730572
binar  0.884615  0.690000  0.775281

          ALL  BARE  DIV  EXIST  MEIST  NEG  untagged  multiple
ALL        14     0    0      0      0    0         5         0
BARE        6    24    2      0      0    0        20         0
DIV         0     0    4      0      0    0         3         0
EXIST       0     0    0      3      0    0         0         0
MEIST       0     0    0      0      1    0         0         0
NEG         3     3    0      0      0    8         3         0
untagged    1     8    0      0      0    0       717         0
multiple    0     1    0      0      0    0         0         0
