              P         R         F
ALL    0.538462  0.608696  0.571429
BARE   0.387500  0.442857  0.413333
DIV    0.500000  0.405405  0.447761
EXIST  0.500000  0.333333  0.400000
MEIST  0.000000  0.000000  0.000000
NEG    0.448980  0.594595  0.511628
micro  0.441489  0.485380  0.462396
macro  0.395824  0.397481  0.390692
binar  0.622340  0.688235  0.653631

          ALL  BARE  DIV  EXIST  MEIST  NEG  untagged  multiple
ALL        14     2    0      0      0    0         7         0
BARE        3    31    1      0      0   10        25         0
DIV         2     2   15      0      0    7        10         0
EXIST       0     1    0      1      0    0         1         0
MEIST       0     1    0      0      0    0         0         0
NEG         0     5    0      0      0   22         9         0
untagged    7    38   14      1      1   10       773         0
multiple    0     0    0      0      0    0         1         0
