              P         R         F
ALL    0.066667  0.111111  0.083333
BARE   0.311688  0.252632  0.279070
DIV    0.300000  0.428571  0.352941
EXIST  0.600000  1.000000  0.750000
MEIST  0.600000  0.500000  0.545455
NEG    0.181818  0.064516  0.095238
micro  0.292683  0.238411  0.262774
macro  0.343362  0.392805  0.351006
binar  0.355372  0.292517  0.320896

          ALL  BARE  DIV  EXIST  MEIST  NEG  untagged  multiple
ALL         1     1    0      0      0    0         7         0
BARE        4    24    0      0      0    0        66         0
DIV         0     1    1      0      0    0         2         0
EXIST       0     0    0      0      0    0         0         0
MEIST       0     0    0      0      3    1         2         0
NEG         1     1    0      0      0    2        26         0
untagged    9    50    7      2      2    8       748         0
multiple    0     0    0      1      0    0         1         2
