text,spans,annotators,condition,units,measure,value,std
Dahn__Kampf_um_Rom_ab_Kapitel_2,[0:206],"{A2,A5}",multi,tokens,kappa,0.29389607620745534,0.0
Dahn__Kampf_um_Rom_ab_Kapitel_2,[0:206],"{A2,A5}",multi,tokens,alpha,0.29748872093300693,0.0
Dahn__Kampf_um_Rom_ab_Kapitel_2,[0:206],"{A2,A5}",multi,tokens,gamma,0.15530237855538276,0.0
Dahn__Kampf_um_Rom_ab_Kapitel_2,[0:206],"{A2,A5}",multi,tokens,P,0.77181344355095,0.11013366109056172
Dahn__Kampf_um_Rom_ab_Kapitel_2,[0:206],"{A2,A5}",multi,tokens,R,0.5689045131773006,0.09880891074887979
Dahn__Kampf_um_Rom_ab_Kapitel_2,[0:206],"{A2,A5}",multi,tokens,F,0.6327721916033542,0.10967203801276926
Dahn__Kampf_um_Rom_ab_Kapitel_2,[0:206],"{A2,A5}",multi,clauses,kappa,0.2809561506825509,0.0
Dahn__Kampf_um_Rom_ab_Kapitel_2,[0:206],"{A2,A5}",multi,clauses,alpha,0.2867348612533218,0.0
Dahn__Kampf_um_Rom_ab_Kapitel_2,[0:206],"{A2,A5}",multi,clauses,gamma,0.12395995773020485,0.0
Dahn__Kampf_um_Rom_ab_Kapitel_2,[0:206],"{A2,A5}",multi,clauses,P,0.7869000496349408,0.1152004754963421
Dahn__Kampf_um_Rom_ab_Kapitel_2,[0:206],"{A2,A5}",multi,clauses,R,0.5616697559468644,0.09827772628977444
Dahn__Kampf_um_Rom_ab_Kapitel_2,[0:206],"{A2,A5}",multi,clauses,F,0.6279683195488057,0.11218337331224665
Dahn__Kampf_um_Rom_ab_Kapitel_2,[0:206],"{A2,A5}",binary,tokens,kappa,0.28216964126284966,0.0
Dahn__Kampf_um_Rom_ab_Kapitel_2,[0:206],"{A2,A5}",binary,tokens,alpha,0.2822692845663948,0.0
Dahn__Kampf_um_Rom_ab_Kapitel_2,[0:206],"{A2,A5}",binary,tokens,gamma,0.1494587033561443,0.0
Dahn__Kampf_um_Rom_ab_Kapitel_2,[0:206],"{A2,A5}",binary,tokens,P,0.8061235021519471,0.049314163630546304
Dahn__Kampf_um_Rom_ab_Kapitel_2,[0:206],"{A2,A5}",binary,tokens,R,0.4223856209150327,0.10457516339869283
Dahn__Kampf_um_Rom_ab_Kapitel_2,[0:206],"{A2,A5}",binary,tokens,F,0.5499074398358933,0.10226647320758495
Dahn__Kampf_um_Rom_ab_Kapitel_2,[0:206],"{A2,A5}",binary,clauses,kappa,0.27272727272727265,0.0
Dahn__Kampf_um_Rom_ab_Kapitel_2,[0:206],"{A2,A5}",binary,clauses,alpha,0.2736549165120593,0.0
Dahn__Kampf_um_Rom_ab_Kapitel_2,[0:206],"{A2,A5}",binary,clauses,gamma,0.08240478757141556,0.0
Dahn__Kampf_um_Rom_ab_Kapitel_2,[0:206],"{A2,A5}",binary,clauses,P,0.8404103479036574,0.04380017841213202
Dahn__Kampf_um_Rom_ab_Kapitel_2,[0:206],"{A2,A5}",binary,clauses,R,0.4171974522292994,0.1178343949044586
Dahn__Kampf_um_Rom_ab_Kapitel_2,[0:206],"{A2,A5}",binary,clauses,F,0.5509259259259258,0.11574074074074076
Fontane__Der_Stechlin,[0:580],"{A1,A4}",multi,tokens,kappa,0.23738324607524947,0.0
Fontane__Der_Stechlin,[0:580],"{A1,A4}",multi,tokens,alpha,0.2363594970060212,0.0
Fontane__Der_Stechlin,[0:580],"{A1,A4}",multi,tokens,gamma,0.26810873382660116,0.0
Fontane__Der_Stechlin,[0:580],"{A1,A4}",multi,tokens,P,0.7366928405445683,0.07697061832234603
Fontane__Der_Stechlin,[0:580],"{A1,A4}",multi,tokens,R,0.4507935363369997,0.07517500282372933
Fontane__Der_Stechlin,[0:580],"{A1,A4}",multi,tokens,F,0.508061685952134,0.09985778312457524
Fontane__Der_Stechlin,[0:580],"{A1,A4}",multi,clauses,kappa,0.2544558564451539,0.0
Fontane__Der_Stechlin,[0:580],"{A1,A4}",multi,clauses,alpha,0.2532889706995535,0.0
Fontane__Der_Stechlin,[0:580],"{A1,A4}",multi,clauses,gamma,0.28549048742741956,0.0
Fontane__Der_Stechlin,[0:580],"{A1,A4}",multi,clauses,P,0.7298942860966144,0.06322761942994787
Fontane__Der_Stechlin,[0:580],"{A1,A4}",multi,clauses,R,0.45430107526881724,0.0800872387908298
Fontane__Der_Stechlin,[0:580],"{A1,A4}",multi,clauses,F,0.5096245654570679,0.1034621004710736
Fontane__Der_Stechlin,[0:580],"{A4,A6}",binary,tokens,kappa,-0.14103054477897378,0.0
Fontane__Der_Stechlin,[0:580],"{A4,A6}",binary,tokens,alpha,-0.1409759029561226,0.0
Fontane__Der_Stechlin,[0:580],"{A4,A6}",binary,tokens,gamma,-0.15553258618641008,0.0
Fontane__Der_Stechlin,[0:580],"{A4,A6}",binary,tokens,P,0.8571854806592927,0.023678716871571526
Fontane__Der_Stechlin,[0:580],"{A4,A6}",binary,tokens,R,0.4242193450114242,0.11919268849961917
Fontane__Der_Stechlin,[0:580],"{A4,A6}",binary,tokens,F,0.5593874015932081,0.11277463326312717
Fontane__Der_Stechlin,[0:580],"{A4,A6}",binary,clauses,kappa,-0.1599616858237548,0.0
Fontane__Der_Stechlin,[0:580],"{A4,A6}",binary,clauses,alpha,-0.1594827586206895,0.0
Fontane__Der_Stechlin,[0:580],"{A4,A6}",binary,clauses,gamma,-0.1659226239715108,0.0
Fontane__Der_Stechlin,[0:580],"{A4,A6}",binary,clauses,P,0.8534728472847285,0.027715271527152696
Fontane__Der_Stechlin,[0:580],"{A4,A6}",binary,clauses,R,0.4283582089552239,0.10298507462686571
Fontane__Der_Stechlin,[0:580],"{A4,A6}",binary,clauses,F,0.5648758468611805,0.09806642501963886
Gellert__Das_Leben_der_schwedischen_Gräfin_von_G,[0:210],"{A1,A4}",multi,tokens,kappa,0.6188344342703238,0.0
Gellert__Das_Leben_der_schwedischen_Gräfin_von_G,[0:210],"{A1,A4}",multi,tokens,alpha,0.6188820799660399,0.0
Gellert__Das_Leben_der_schwedischen_Gräfin_von_G,[0:210],"{A1,A4}",multi,tokens,gamma,0.5390073056922784,0.0
Gellert__Das_Leben_der_schwedischen_Gräfin_von_G,[0:210],"{A1,A4}",multi,tokens,P,0.5542026271247674,0.11595556639265173
Gellert__Das_Leben_der_schwedischen_Gräfin_von_G,[0:210],"{A1,A4}",multi,tokens,R,0.3719306741841384,0.0005979286594250954
Gellert__Das_Leben_der_schwedischen_Gräfin_von_G,[0:210],"{A1,A4}",multi,tokens,F,0.3928620442890594,0.02551699146735109
Gellert__Das_Leben_der_schwedischen_Gräfin_von_G,[0:210],"{A1,A4}",multi,clauses,kappa,0.6055159458651754,0.0
Gellert__Das_Leben_der_schwedischen_Gräfin_von_G,[0:210],"{A1,A4}",multi,clauses,alpha,0.6059072990934835,0.0
Gellert__Das_Leben_der_schwedischen_Gräfin_von_G,[0:210],"{A1,A4}",multi,clauses,gamma,0.5392394756536436,0.0
Gellert__Das_Leben_der_schwedischen_Gräfin_von_G,[0:210],"{A1,A4}",multi,clauses,P,0.5540781085839226,0.09770760570179177
Gellert__Das_Leben_der_schwedischen_Gräfin_von_G,[0:210],"{A1,A4}",multi,clauses,R,0.3723499831645064,0.0016229730537697107
Gellert__Das_Leben_der_schwedischen_Gräfin_von_G,[0:210],"{A1,A4}",multi,clauses,F,0.3969172954096869,0.024789235146033456
Gellert__Das_Leben_der_schwedischen_Gräfin_von_G,[0:210],"{A1,A4}",binary,tokens,kappa,0.5996871841281689,0.0
Gellert__Das_Leben_der_schwedischen_Gräfin_von_G,[0:210],"{A1,A4}",binary,tokens,alpha,0.5997372232301528,0.0
Gellert__Das_Leben_der_schwedischen_Gräfin_von_G,[0:210],"{A1,A4}",binary,tokens,gamma,0.578917299363767,0.0
Gellert__Das_Leben_der_schwedischen_Gräfin_von_G,[0:210],"{A1,A4}",binary,tokens,P,0.8574151654796816,0.11401340594888981
Gellert__Das_Leben_der_schwedischen_Gräfin_von_G,[0:210],"{A1,A4}",binary,tokens,R,0.3596851471594798,0.01266255989048598
Gellert__Das_Leben_der_schwedischen_Gräfin_von_G,[0:210],"{A1,A4}",binary,tokens,F,0.505757904115975,0.03258944867967076
Gellert__Das_Leben_der_schwedischen_Gräfin_von_G,[0:210],"{A1,A4}",binary,clauses,kappa,0.5850516814238776,0.0
Gellert__Das_Leben_der_schwedischen_Gräfin_von_G,[0:210],"{A1,A4}",binary,clauses,alpha,0.58546333650183,0.0
Gellert__Das_Leben_der_schwedischen_Gräfin_von_G,[0:210],"{A1,A4}",binary,clauses,gamma,0.5749036304150567,0.0
Gellert__Das_Leben_der_schwedischen_Gräfin_von_G,[0:210],"{A1,A4}",binary,clauses,P,0.8509662626924337,0.10678021618080574
Gellert__Das_Leben_der_schwedischen_Gräfin_von_G,[0:210],"{A1,A4}",binary,clauses,R,0.3529411764705882,0.010695187165775416
Gellert__Das_Leben_der_schwedischen_Gräfin_von_G,[0:210],"{A1,A4}",binary,clauses,F,0.4979981259051026,0.029133657040633837
Goethe__Die_Wahlverwandtschaften,"[0:152],[152:330],[330:486],[486:687]","{},{},{},{}",multi,tokens,kappa,,
Goethe__Die_Wahlverwandtschaften,"[0:152],[152:330],[330:486],[486:687]","{},{},{},{}",multi,tokens,alpha,,
Goethe__Die_Wahlverwandtschaften,"[0:152],[152:330],[330:486],[486:687]","{},{},{},{}",multi,tokens,gamma,,
Goethe__Die_Wahlverwandtschaften,"[0:152],[152:330],[330:486],[486:687]","{},{},{},{}",multi,tokens,P,0.0,0.0
Goethe__Die_Wahlverwandtschaften,"[0:152],[152:330],[330:486],[486:687]","{},{},{},{}",multi,tokens,R,0.0,0.0
Goethe__Die_Wahlverwandtschaften,"[0:152],[152:330],[330:486],[486:687]","{},{},{},{}",multi,tokens,F,0.0,0.0
Goethe__Die_Wahlverwandtschaften,"[0:152],[152:330],[330:486],[486:687]","{},{},{},{}",multi,clauses,kappa,,
Goethe__Die_Wahlverwandtschaften,"[0:152],[152:330],[330:486],[486:687]","{},{},{},{}",multi,clauses,alpha,,
Goethe__Die_Wahlverwandtschaften,"[0:152],[152:330],[330:486],[486:687]","{},{},{},{}",multi,clauses,gamma,,
Goethe__Die_Wahlverwandtschaften,"[0:152],[152:330],[330:486],[486:687]","{},{},{},{}",multi,clauses,P,0.0,0.0
Goethe__Die_Wahlverwandtschaften,"[0:152],[152:330],[330:486],[486:687]","{},{},{},{}",multi,clauses,R,0.0,0.0
Goethe__Die_Wahlverwandtschaften,"[0:152],[152:330],[330:486],[486:687]","{},{},{},{}",multi,clauses,F,0.0,0.0
Goethe__Die_Wahlverwandtschaften,"[0:152],[152:330],[330:486],[486:687]","{A2,A6},{A1,A5},{A2,A6},{A1,A5}",binary,tokens,kappa,0.3310185702508218,0.28897707147173785
Goethe__Die_Wahlverwandtschaften,"[0:152],[152:330],[330:486],[486:687]","{A2,A6},{A1,A5},{A2,A6},{A1,A5}",binary,tokens,alpha,0.3311126294795318,0.2889506282369739
Goethe__Die_Wahlverwandtschaften,"[0:152],[152:330],[330:486],[486:687]","{A2,A6},{A1,A5},{A2,A6},{A1,A5}",binary,tokens,gamma,0.42533332864662865,0.15598860614982688
Goethe__Die_Wahlverwandtschaften,"[0:152],[152:330],[330:486],[486:687]","{A2,A6},{A1,A5},{A2,A6},{A1,A5}",binary,tokens,P,0.5860434417203125,0.1949895088835928
Goethe__Die_Wahlverwandtschaften,"[0:152],[152:330],[330:486],[486:687]","{A2,A6},{A1,A5},{A2,A6},{A1,A5}",binary,tokens,R,0.4932394434778037,0.24866216798208354
Goethe__Die_Wahlverwandtschaften,"[0:152],[152:330],[330:486],[486:687]","{A2,A6},{A1,A5},{A2,A6},{A1,A5}",binary,tokens,F,0.5187370393779391,0.24845512133815909
Goethe__Die_Wahlverwandtschaften,"[0:152],[152:330],[330:486],[486:687]","{A2,A6},{A1,A5},{A2,A6},{A1,A5}",binary,clauses,kappa,0.326571362017141,0.27910262456018325
Goethe__Die_Wahlverwandtschaften,"[0:152],[152:330],[330:486],[486:687]","{A2,A6},{A1,A5},{A2,A6},{A1,A5}",binary,clauses,alpha,0.32733414581866627,0.2788955604659403
Goethe__Die_Wahlverwandtschaften,"[0:152],[152:330],[330:486],[486:687]","{A2,A6},{A1,A5},{A2,A6},{A1,A5}",binary,clauses,gamma,0.41188727932736513,0.14566785793753464
Goethe__Die_Wahlverwandtschaften,"[0:152],[152:330],[330:486],[486:687]","{A2,A6},{A1,A5},{A2,A6},{A1,A5}",binary,clauses,P,0.6101712421790116,0.16105025353907979
Goethe__Die_Wahlverwandtschaften,"[0:152],[152:330],[330:486],[486:687]","{A2,A6},{A1,A5},{A2,A6},{A1,A5}",binary,clauses,R,0.49179347768303316,0.2450685310669592
Goethe__Die_Wahlverwandtschaften,"[0:152],[152:330],[330:486],[486:687]","{A2,A6},{A1,A5},{A2,A6},{A1,A5}",binary,clauses,F,0.5229112100356,0.24100018870405657
Grillparzer__Der_arme_Spielmann,[0:420],"{A1,A4}",multi,tokens,kappa,0.20881657740656445,0.0
Grillparzer__Der_arme_Spielmann,[0:420],"{A1,A4}",multi,tokens,alpha,0.2215114030416716,0.0
Grillparzer__Der_arme_Spielmann,[0:420],"{A1,A4}",multi,tokens,gamma,0.23092635586432042,0.0
Grillparzer__Der_arme_Spielmann,[0:420],"{A1,A4}",multi,tokens,P,0.5436788830748713,0.026815981537640254
Grillparzer__Der_arme_Spielmann,[0:420],"{A1,A4}",multi,tokens,R,0.6263536928741608,0.11010937838423218
Grillparzer__Der_arme_Spielmann,[0:420],"{A1,A4}",multi,tokens,F,0.5550353466955569,0.03593363187291182
Grillparzer__Der_arme_Spielmann,[0:420],"{A1,A4}",multi,clauses,kappa,0.19653440198679267,0.0
Grillparzer__Der_arme_Spielmann,[0:420],"{A1,A4}",multi,clauses,alpha,0.20821452435006116,0.0
Grillparzer__Der_arme_Spielmann,[0:420],"{A1,A4}",multi,clauses,gamma,0.2505032933066277,0.0
Grillparzer__Der_arme_Spielmann,[0:420],"{A1,A4}",multi,clauses,P,0.5596870965292018,0.0456520088099035
Grillparzer__Der_arme_Spielmann,[0:420],"{A1,A4}",multi,clauses,R,0.6348755411255411,0.1291937229437229
Grillparzer__Der_arme_Spielmann,[0:420],"{A1,A4}",multi,clauses,F,0.5621342481807599,0.031442717489229166
Grillparzer__Der_arme_Spielmann,[0:420],"{A1,A4}",binary,tokens,kappa,0.2390884776314099,0.0
Grillparzer__Der_arme_Spielmann,[0:420],"{A1,A4}",binary,tokens,alpha,0.2391348690179701,0.0
Grillparzer__Der_arme_Spielmann,[0:420],"{A1,A4}",binary,tokens,gamma,0.23080124575879313,0.0
Grillparzer__Der_arme_Spielmann,[0:420],"{A1,A4}",binary,tokens,P,0.6242963878611243,0.02648350815274042
Grillparzer__Der_arme_Spielmann,[0:420],"{A1,A4}",binary,tokens,R,0.6562829989440337,0.13674762407602953
Grillparzer__Der_arme_Spielmann,[0:420],"{A1,A4}",binary,tokens,F,0.6354149355835397,0.07948273219370922
Grillparzer__Der_arme_Spielmann,[0:420],"{A1,A4}",binary,clauses,kappa,0.22009630298400404,0.0
Grillparzer__Der_arme_Spielmann,[0:420],"{A1,A4}",binary,clauses,alpha,0.22050721114892236,0.0
Grillparzer__Der_arme_Spielmann,[0:420],"{A1,A4}",binary,clauses,gamma,0.2606437828759406,0.0
Grillparzer__Der_arme_Spielmann,[0:420],"{A1,A4}",binary,clauses,P,0.6423969731056345,0.019020349729011177
Grillparzer__Der_arme_Spielmann,[0:420],"{A1,A4}",binary,clauses,R,0.6407766990291262,0.17475728155339804
Grillparzer__Der_arme_Spielmann,[0:420],"{A1,A4}",binary,clauses,F,0.6318840579710145,0.09855072463768122
Grimmelshausen__Der_abenteuerliche_Simplicissimus,[0:221],{A6},multi,tokens,kappa,,
Grimmelshausen__Der_abenteuerliche_Simplicissimus,[0:221],{A6},multi,tokens,alpha,,
Grimmelshausen__Der_abenteuerliche_Simplicissimus,[0:221],{A6},multi,tokens,gamma,,
Grimmelshausen__Der_abenteuerliche_Simplicissimus,[0:221],{A6},multi,tokens,P,0.3247302181890951,0.3247302181890951
Grimmelshausen__Der_abenteuerliche_Simplicissimus,[0:221],{A6},multi,tokens,R,0.35991499728205173,0.35991499728205173
Grimmelshausen__Der_abenteuerliche_Simplicissimus,[0:221],{A6},multi,tokens,F,0.33513616597241125,0.33513616597241125
Grimmelshausen__Der_abenteuerliche_Simplicissimus,[0:221],{A6},multi,clauses,kappa,,
Grimmelshausen__Der_abenteuerliche_Simplicissimus,[0:221],{A6},multi,clauses,alpha,,
Grimmelshausen__Der_abenteuerliche_Simplicissimus,[0:221],{A6},multi,clauses,gamma,,
Grimmelshausen__Der_abenteuerliche_Simplicissimus,[0:221],{A6},multi,clauses,P,0.33433772755806657,0.33433772755806657
Grimmelshausen__Der_abenteuerliche_Simplicissimus,[0:221],{A6},multi,clauses,R,0.3609989576045696,0.3609989576045696
Grimmelshausen__Der_abenteuerliche_Simplicissimus,[0:221],{A6},multi,clauses,F,0.34609254952448193,0.34609254952448193
Grimmelshausen__Der_abenteuerliche_Simplicissimus,[0:221],"{A5,A6}",binary,tokens,kappa,0.23091808923037077,0.0
Grimmelshausen__Der_abenteuerliche_Simplicissimus,[0:221],"{A5,A6}",binary,tokens,alpha,0.23098434370235288,0.0
Grimmelshausen__Der_abenteuerliche_Simplicissimus,[0:221],"{A5,A6}",binary,tokens,gamma,0.18091277553063223,0.0
Grimmelshausen__Der_abenteuerliche_Simplicissimus,[0:221],"{A5,A6}",binary,tokens,P,0.6913040226001661,0.034659987682610305
Grimmelshausen__Der_abenteuerliche_Simplicissimus,[0:221],"{A5,A6}",binary,tokens,R,0.5588550026752274,0.19662921348314608
Grimmelshausen__Der_abenteuerliche_Simplicissimus,[0:221],"{A5,A6}",binary,tokens,F,0.6036632732401497,0.13676672151601177
Grimmelshausen__Der_abenteuerliche_Simplicissimus,[0:221],"{A5,A6}",binary,clauses,kappa,0.25822792913113196,0.0
Grimmelshausen__Der_abenteuerliche_Simplicissimus,[0:221],"{A5,A6}",binary,clauses,alpha,0.25876622526383786,0.0
Grimmelshausen__Der_abenteuerliche_Simplicissimus,[0:221],"{A5,A6}",binary,clauses,gamma,0.14521123427797866,0.0
Grimmelshausen__Der_abenteuerliche_Simplicissimus,[0:221],"{A5,A6}",binary,clauses,P,0.6992802878848461,0.07632946821271491
Grimmelshausen__Der_abenteuerliche_Simplicissimus,[0:221],"{A5,A6}",binary,clauses,R,0.5731707317073171,0.20243902439024392
Grimmelshausen__Der_abenteuerliche_Simplicissimus,[0:221],"{A5,A6}",binary,clauses,F,0.6202207801894533,0.1553889759081077
Hoffmann__Der_Sandmann,[0:203],{A11},multi,tokens,kappa,,
Hoffmann__Der_Sandmann,[0:203],{A11},multi,tokens,alpha,,
Hoffmann__Der_Sandmann,[0:203],{A11},multi,tokens,gamma,,
Hoffmann__Der_Sandmann,[0:203],{A11},multi,tokens,P,0.15833333333333333,0.15833333333333333
Hoffmann__Der_Sandmann,[0:203],{A11},multi,tokens,R,0.010248112189859762,0.010248112189859762
Hoffmann__Der_Sandmann,[0:203],{A11},multi,tokens,F,0.019250253292806482,0.019250253292806482
Hoffmann__Der_Sandmann,[0:203],{A11},multi,clauses,kappa,,
Hoffmann__Der_Sandmann,[0:203],{A11},multi,clauses,alpha,,
Hoffmann__Der_Sandmann,[0:203],{A11},multi,clauses,gamma,,
Hoffmann__Der_Sandmann,[0:203],{A11},multi,clauses,P,0.16666666666666666,0.16666666666666666
Hoffmann__Der_Sandmann,[0:203],{A11},multi,clauses,R,0.004629629629629629,0.004629629629629629
Hoffmann__Der_Sandmann,[0:203],{A11},multi,clauses,F,0.009009009009009009,0.009009009009009009
Hoffmann__Der_Sandmann,[0:203],"{A2,A5}",binary,tokens,kappa,0.4686206954241527,0.0
Hoffmann__Der_Sandmann,[0:203],"{A2,A5}",binary,tokens,alpha,0.468685656219333,0.0
Hoffmann__Der_Sandmann,[0:203],"{A2,A5}",binary,tokens,gamma,0.2681941366389067,0.0
Hoffmann__Der_Sandmann,[0:203],"{A2,A5}",binary,tokens,P,0.7483651569837388,0.17623801761943575
Hoffmann__Der_Sandmann,[0:203],"{A2,A5}",binary,tokens,R,0.42475728155339804,0.1407766990291262
Hoffmann__Der_Sandmann,[0:203],"{A2,A5}",binary,tokens,F,0.5406846363556415,0.1611225925600211
Hoffmann__Der_Sandmann,[0:203],"{A2,A5}",binary,clauses,kappa,0.45819369253244024,0.0
Hoffmann__Der_Sandmann,[0:203],"{A2,A5}",binary,clauses,alpha,0.4587522557360145,0.0
Hoffmann__Der_Sandmann,[0:203],"{A2,A5}",binary,clauses,gamma,0.2565109013621337,0.0
Hoffmann__Der_Sandmann,[0:203],"{A2,A5}",binary,clauses,P,0.7342215988779803,0.16900420757363255
Hoffmann__Der_Sandmann,[0:203],"{A2,A5}",binary,clauses,R,0.40594059405940597,0.14851485148514854
Hoffmann__Der_Sandmann,[0:203],"{A2,A5}",binary,clauses,F,0.5204290305079087,0.1666875339092692
Hölderlin__Hyperion_oder_der_Eremit_in_Griechenland,[0:440],"{A5,A6}",multi,tokens,kappa,0.5449494266432081,0.0
Hölderlin__Hyperion_oder_der_Eremit_in_Griechenland,[0:440],"{A5,A6}",multi,tokens,alpha,0.6088537582816254,0.0
Hölderlin__Hyperion_oder_der_Eremit_in_Griechenland,[0:440],"{A5,A6}",multi,tokens,gamma,0.46934428971953757,0.0
Hölderlin__Hyperion_oder_der_Eremit_in_Griechenland,[0:440],"{A5,A6}",multi,tokens,P,0.9312111217174437,0.025211325178907285
Hölderlin__Hyperion_oder_der_Eremit_in_Griechenland,[0:440],"{A5,A6}",multi,tokens,R,0.7793822179901035,0.09923487263657627
Hölderlin__Hyperion_oder_der_Eremit_in_Griechenland,[0:440],"{A5,A6}",multi,tokens,F,0.8319218380535355,0.08302728179812946
Hölderlin__Hyperion_oder_der_Eremit_in_Griechenland,[0:440],"{A5,A6}",multi,clauses,kappa,0.548131453294951,0.0
Hölderlin__Hyperion_oder_der_Eremit_in_Griechenland,[0:440],"{A5,A6}",multi,clauses,alpha,0.6095370307249037,0.0
Hölderlin__Hyperion_oder_der_Eremit_in_Griechenland,[0:440],"{A5,A6}",multi,clauses,gamma,0.474792380137143,0.0
Hölderlin__Hyperion_oder_der_Eremit_in_Griechenland,[0:440],"{A5,A6}",multi,clauses,P,0.9257692625573304,0.029607424151267436
Hölderlin__Hyperion_oder_der_Eremit_in_Griechenland,[0:440],"{A5,A6}",multi,clauses,R,0.7785520579985705,0.11370773707212922
Hölderlin__Hyperion_oder_der_Eremit_in_Griechenland,[0:440],"{A5,A6}",multi,clauses,F,0.828426180665335,0.09335245559933891
Hölderlin__Hyperion_oder_der_Eremit_in_Griechenland,[0:440],"{A5,A6}",binary,tokens,kappa,0.7585355325692965,0.0
Hölderlin__Hyperion_oder_der_Eremit_in_Griechenland,[0:440],"{A5,A6}",binary,tokens,alpha,0.7585482922642569,0.0
Hölderlin__Hyperion_oder_der_Eremit_in_Griechenland,[0:440],"{A5,A6}",binary,tokens,gamma,0.4635277532894372,0.0
Hölderlin__Hyperion_oder_der_Eremit_in_Griechenland,[0:440],"{A5,A6}",binary,tokens,P,0.9044144253233803,0.026563835546184966
Hölderlin__Hyperion_oder_der_Eremit_in_Griechenland,[0:440],"{A5,A6}",binary,tokens,R,0.8907441493557717,0.010123586642124649
Hölderlin__Hyperion_oder_der_Eremit_in_Griechenland,[0:440],"{A5,A6}",binary,tokens,F,0.8974544628979095,0.018221068306153054
Hölderlin__Hyperion_oder_der_Eremit_in_Griechenland,[0:440],"{A5,A6}",binary,clauses,kappa,0.7534972901604144,0.0
Hölderlin__Hyperion_oder_der_Eremit_in_Griechenland,[0:440],"{A5,A6}",binary,clauses,alpha,0.7536113062149195,0.0
Hölderlin__Hyperion_oder_der_Eremit_in_Griechenland,[0:440],"{A5,A6}",binary,clauses,gamma,0.4560029116882435,0.0
Hölderlin__Hyperion_oder_der_Eremit_in_Griechenland,[0:440],"{A5,A6}",binary,clauses,P,0.9002001192584295,0.02943740739402262
Hölderlin__Hyperion_oder_der_Eremit_in_Griechenland,[0:440],"{A5,A6}",binary,clauses,R,0.8953488372093024,0.026427061310782263
Hölderlin__Hyperion_oder_der_Eremit_in_Griechenland,[0:440],"{A5,A6}",binary,clauses,F,0.8977656455363461,0.02792437569507633
Kafka__Der_Bau,[0:207],{},multi,tokens,kappa,,
Kafka__Der_Bau,[0:207],{},multi,tokens,alpha,,
Kafka__Der_Bau,[0:207],{},multi,tokens,gamma,,
Kafka__Der_Bau,[0:207],{},multi,tokens,P,0.0,0.0
Kafka__Der_Bau,[0:207],{},multi,tokens,R,0.0,0.0
Kafka__Der_Bau,[0:207],{},multi,tokens,F,0.0,0.0
Kafka__Der_Bau,[0:207],{},multi,clauses,kappa,,
Kafka__Der_Bau,[0:207],{},multi,clauses,alpha,,
Kafka__Der_Bau,[0:207],{},multi,clauses,gamma,,
Kafka__Der_Bau,[0:207],{},multi,clauses,P,0.0,0.0
Kafka__Der_Bau,[0:207],{},multi,clauses,R,0.0,0.0
Kafka__Der_Bau,[0:207],{},multi,clauses,F,0.0,0.0
Kafka__Der_Bau,[0:207],"{A3,A6}",binary,tokens,kappa,0.6693560369444421,0.0
Kafka__Der_Bau,[0:207],"{A3,A6}",binary,tokens,alpha,0.6693809423348498,0.0
Kafka__Der_Bau,[0:207],"{A3,A6}",binary,tokens,gamma,0.5090376483727515,0.0
Kafka__Der_Bau,[0:207],"{A3,A6}",binary,tokens,P,0.8545301614882642,0.0027689090420802698
Kafka__Der_Bau,[0:207],"{A3,A6}",binary,tokens,R,0.754102096627165,0.0394257064721969
Kafka__Der_Bau,[0:207],"{A3,A6}",binary,tokens,F,0.800565870829798,0.021048098023434603
Kafka__Der_Bau,[0:207],"{A3,A6}",binary,clauses,kappa,0.681331551772488,0.0
Kafka__Der_Bau,[0:207],"{A3,A6}",binary,clauses,alpha,0.6815459989112684,0.0
Kafka__Der_Bau,[0:207],"{A3,A6}",binary,clauses,gamma,0.5483460026521534,0.0
Kafka__Der_Bau,[0:207],"{A3,A6}",binary,clauses,P,0.888575192923019,0.0031996988518727676
Kafka__Der_Bau,[0:207],"{A3,A6}",binary,clauses,R,0.7678571428571429,0.03214285714285714
Kafka__Der_Bau,[0:207],"{A3,A6}",binary,clauses,F,0.8233937796249858,0.0171315487052206
Kleist__Michael_Kohlhaas,"[0:241],[241:443]","{A2,A5},{A1,A2}",multi,tokens,kappa,0.1091521830116097,0.027426745519833144
Kleist__Michael_Kohlhaas,"[0:241],[241:443]","{A2,A5},{A1,A2}",multi,tokens,alpha,0.11394042839244084,0.029535996662674646
Kleist__Michael_Kohlhaas,"[0:241],[241:443]","{A2,A5},{A1,A2}",multi,tokens,gamma,0.10148360182517702,0.02315093797134793
Kleist__Michael_Kohlhaas,"[0:241],[241:443]","{A2,A5},{A1,A2}",multi,tokens,P,0.701870364063284,0.14275977566185852
Kleist__Michael_Kohlhaas,"[0:241],[241:443]","{A2,A5},{A1,A2}",multi,tokens,R,0.6937334502228656,0.23750709240751777
Kleist__Michael_Kohlhaas,"[0:241],[241:443]","{A2,A5},{A1,A2}",multi,tokens,F,0.6598364938060621,0.16124943105219516
Kleist__Michael_Kohlhaas,"[0:241],[241:443]","{A2,A5},{A1,A2}",multi,clauses,kappa,0.13317348720728256,0.05074751623169341
Kleist__Michael_Kohlhaas,"[0:241],[241:443]","{A2,A5},{A1,A2}",multi,clauses,alpha,0.13835838253392896,0.0528719924506269
Kleist__Michael_Kohlhaas,"[0:241],[241:443]","{A2,A5},{A1,A2}",multi,clauses,gamma,0.11245754436063687,0.014703139733255821
Kleist__Michael_Kohlhaas,"[0:241],[241:443]","{A2,A5},{A1,A2}",multi,clauses,P,0.7004069126381084,0.1497761251237857
Kleist__Michael_Kohlhaas,"[0:241],[241:443]","{A2,A5},{A1,A2}",multi,clauses,R,0.6987696443341604,0.2288383416565111
Kleist__Michael_Kohlhaas,"[0:241],[241:443]","{A2,A5},{A1,A2}",multi,clauses,F,0.6573842390915327,0.1491687867792577
Kleist__Michael_Kohlhaas,"[0:241],[241:443]","{A2,A5},{A1,A2}",binary,tokens,kappa,0.12284802836016878,0.041889479137370844
Kleist__Michael_Kohlhaas,"[0:241],[241:443]","{A2,A5},{A1,A2}",binary,tokens,alpha,0.12293032940411913,0.04188359735165531
Kleist__Michael_Kohlhaas,"[0:241],[241:443]","{A2,A5},{A1,A2}",binary,tokens,gamma,0.12424363703197294,0.024552247312950026
Kleist__Michael_Kohlhaas,"[0:241],[241:443]","{A2,A5},{A1,A2}",binary,tokens,P,0.6371268733293818,0.221495674907823
Kleist__Michael_Kohlhaas,"[0:241],[241:443]","{A2,A5},{A1,A2}",binary,tokens,R,0.5720968539554638,0.3420228231527027
Kleist__Michael_Kohlhaas,"[0:241],[241:443]","{A2,A5},{A1,A2}",binary,tokens,F,0.5256511136034376,0.19561333697144365
Kleist__Michael_Kohlhaas,"[0:241],[241:443]","{A2,A5},{A1,A2}",binary,clauses,kappa,0.15387376028690034,0.06851064854291498
Kleist__Michael_Kohlhaas,"[0:241],[241:443]","{A2,A5},{A1,A2}",binary,clauses,alpha,0.15451241716859682,0.06847479444507137
Kleist__Michael_Kohlhaas,"[0:241],[241:443]","{A2,A5},{A1,A2}",binary,clauses,gamma,0.11626633946355813,0.01996020251606334
Kleist__Michael_Kohlhaas,"[0:241],[241:443]","{A2,A5},{A1,A2}",binary,clauses,P,0.6260195035460994,0.22446946373227947
Kleist__Michael_Kohlhaas,"[0:241],[241:443]","{A2,A5},{A1,A2}",binary,clauses,R,0.5828903654485049,0.3273184474384044
Kleist__Michael_Kohlhaas,"[0:241],[241:443]","{A2,A5},{A1,A2}",binary,clauses,F,0.5287698368178986,0.1728796525732631
LaRoche__Geschichte_des_Fräuleins_von_Sternheim,[0:217],{},multi,tokens,kappa,,
LaRoche__Geschichte_des_Fräuleins_von_Sternheim,[0:217],{},multi,tokens,alpha,,
LaRoche__Geschichte_des_Fräuleins_von_Sternheim,[0:217],{},multi,tokens,gamma,,
LaRoche__Geschichte_des_Fräuleins_von_Sternheim,[0:217],{},multi,tokens,P,0.0,0.0
LaRoche__Geschichte_des_Fräuleins_von_Sternheim,[0:217],{},multi,tokens,R,0.0,0.0
LaRoche__Geschichte_des_Fräuleins_von_Sternheim,[0:217],{},multi,tokens,F,0.0,0.0
LaRoche__Geschichte_des_Fräuleins_von_Sternheim,[0:217],{},multi,clauses,kappa,,
LaRoche__Geschichte_des_Fräuleins_von_Sternheim,[0:217],{},multi,clauses,alpha,,
LaRoche__Geschichte_des_Fräuleins_von_Sternheim,[0:217],{},multi,clauses,gamma,,
LaRoche__Geschichte_des_Fräuleins_von_Sternheim,[0:217],{},multi,clauses,P,0.0,0.0
LaRoche__Geschichte_des_Fräuleins_von_Sternheim,[0:217],{},multi,clauses,R,0.0,0.0
LaRoche__Geschichte_des_Fräuleins_von_Sternheim,[0:217],{},multi,clauses,F,0.0,0.0
LaRoche__Geschichte_des_Fräuleins_von_Sternheim,[0:217],"{A1,A4}",binary,tokens,kappa,0.4087635043656053,0.0
LaRoche__Geschichte_des_Fräuleins_von_Sternheim,[0:217],"{A1,A4}",binary,tokens,alpha,0.408820060372458,0.0
LaRoche__Geschichte_des_Fräuleins_von_Sternheim,[0:217],"{A1,A4}",binary,tokens,gamma,0.3851290975296965,0.0
LaRoche__Geschichte_des_Fräuleins_von_Sternheim,[0:217],"{A1,A4}",binary,tokens,P,0.9708852737012945,0.007271722885736187
LaRoche__Geschichte_des_Fräuleins_von_Sternheim,[0:217],"{A1,A4}",binary,tokens,R,0.42326923076923073,0.12788461538461535
LaRoche__Geschichte_des_Fräuleins_von_Sternheim,[0:217],"{A1,A4}",binary,tokens,F,0.5786033621301772,0.1264396883003272
LaRoche__Geschichte_des_Fräuleins_von_Sternheim,[0:217],"{A1,A4}",binary,clauses,kappa,0.32541990216536104,0.0
LaRoche__Geschichte_des_Fräuleins_von_Sternheim,[0:217],"{A1,A4}",binary,clauses,alpha,0.32600143673245996,0.0
LaRoche__Geschichte_des_Fräuleins_von_Sternheim,[0:217],"{A1,A4}",binary,clauses,gamma,0.3886771785452563,0.0
LaRoche__Geschichte_des_Fräuleins_von_Sternheim,[0:217],"{A1,A4}",binary,clauses,P,0.9753721112416764,0.004357618488053272
LaRoche__Geschichte_des_Fräuleins_von_Sternheim,[0:217],"{A1,A4}",binary,clauses,R,0.375886524822695,0.13829787234042554
LaRoche__Geschichte_des_Fräuleins_von_Sternheim,[0:217],"{A1,A4}",binary,clauses,F,0.5280924932087723,0.14632611144239055
May__Winnetou_II,"[0:250],[250:500]","{A3,A4},{A3,A4}",multi,tokens,kappa,0.6201593294652002,0.07435181999533602
May__Winnetou_II,"[0:250],[250:500]","{A3,A4},{A3,A4}",multi,tokens,alpha,0.6600989288897228,0.07845267510912168
May__Winnetou_II,"[0:250],[250:500]","{A3,A4},{A3,A4}",multi,tokens,gamma,0.6795368808425868,0.10101268902781863
May__Winnetou_II,"[0:250],[250:500]","{A3,A4},{A3,A4}",multi,tokens,P,0.789508883830086,0.05631160108697489
May__Winnetou_II,"[0:250],[250:500]","{A3,A4},{A3,A4}",multi,tokens,R,0.7566416948094491,0.024536201660553047
May__Winnetou_II,"[0:250],[250:500]","{A3,A4},{A3,A4}",multi,tokens,F,0.7544430856769206,0.0318184332703634
May__Winnetou_II,"[0:250],[250:500]","{A3,A4},{A3,A4}",multi,clauses,kappa,0.6250630848228691,0.07133411409827023
May__Winnetou_II,"[0:250],[250:500]","{A3,A4},{A3,A4}",multi,clauses,alpha,0.6698412830968103,0.07201441969356376
May__Winnetou_II,"[0:250],[250:500]","{A3,A4},{A3,A4}",multi,clauses,gamma,0.6898599017885859,0.08989512667350896
May__Winnetou_II,"[0:250],[250:500]","{A3,A4},{A3,A4}",multi,clauses,P,0.7869096322076197,0.06270899801296445
May__Winnetou_II,"[0:250],[250:500]","{A3,A4},{A3,A4}",multi,clauses,R,0.7591976855675485,0.03140774161314382
May__Winnetou_II,"[0:250],[250:500]","{A3,A4},{A3,A4}",multi,clauses,F,0.7542565294569376,0.03359050442375975
May__Winnetou_II,"[0:250],[250:500]","{A3,A4},{A3,A4}",binary,tokens,kappa,0.7670615403006944,0.121200105598058
May__Winnetou_II,"[0:250],[250:500]","{A3,A4},{A3,A4}",binary,tokens,alpha,0.7670886337866739,0.12118920138389833
May__Winnetou_II,"[0:250],[250:500]","{A3,A4},{A3,A4}",binary,tokens,gamma,0.7288892867177763,0.10069161276784816
May__Winnetou_II,"[0:250],[250:500]","{A3,A4},{A3,A4}",binary,tokens,P,0.9194258377915805,0.08038799918573193
May__Winnetou_II,"[0:250],[250:500]","{A3,A4},{A3,A4}",binary,tokens,R,0.8381836865359882,0.07601263457196882
May__Winnetou_II,"[0:250],[250:500]","{A3,A4},{A3,A4}",binary,tokens,F,0.8767252665998078,0.07682415185937945
May__Winnetou_II,"[0:250],[250:500]","{A3,A4},{A3,A4}",binary,clauses,kappa,0.78236683417128,0.10022477226969889
May__Winnetou_II,"[0:250],[250:500]","{A3,A4},{A3,A4}",binary,clauses,alpha,0.7825693968555004,0.1001490005072484
May__Winnetou_II,"[0:250],[250:500]","{A3,A4},{A3,A4}",binary,clauses,gamma,0.7383413879860324,0.09507459374806948
May__Winnetou_II,"[0:250],[250:500]","{A3,A4},{A3,A4}",binary,clauses,P,0.9231045981045981,0.07164168403791557
May__Winnetou_II,"[0:250],[250:500]","{A3,A4},{A3,A4}",binary,clauses,R,0.828845741257241,0.06720540943102424
May__Winnetou_II,"[0:250],[250:500]","{A3,A4},{A3,A4}",binary,clauses,F,0.8729891380366066,0.06616041572734027
Musil__Der_Mann_ohne_Eigenschaften,[0:420],"{A3,A4}",multi,tokens,kappa,0.8086558774799992,0.0
Musil__Der_Mann_ohne_Eigenschaften,[0:420],"{A3,A4}",multi,tokens,alpha,0.839717148576448,0.0
Musil__Der_Mann_ohne_Eigenschaften,[0:420],"{A3,A4}",multi,tokens,gamma,0.6998116172651819,0.0
Musil__Der_Mann_ohne_Eigenschaften,[0:420],"{A3,A4}",multi,tokens,P,0.5684808456744299,0.027059000001490474
Musil__Der_Mann_ohne_Eigenschaften,[0:420],"{A3,A4}",multi,tokens,R,0.33034305342435066,0.027936290267087355
Musil__Der_Mann_ohne_Eigenschaften,[0:420],"{A3,A4}",multi,tokens,F,0.41154981060023244,0.02432393857313825
Musil__Der_Mann_ohne_Eigenschaften,[0:420],"{A3,A4}",multi,clauses,kappa,0.8105491407323445,0.0
Musil__Der_Mann_ohne_Eigenschaften,[0:420],"{A3,A4}",multi,clauses,alpha,0.8424038796051947,0.0
Musil__Der_Mann_ohne_Eigenschaften,[0:420],"{A3,A4}",multi,clauses,gamma,0.7070556728969349,0.0
Musil__Der_Mann_ohne_Eigenschaften,[0:420],"{A3,A4}",multi,clauses,P,0.5792108201467785,0.0028010038838248152
Musil__Der_Mann_ohne_Eigenschaften,[0:420],"{A3,A4}",multi,clauses,R,0.30922575097967764,0.0284287653397601
Musil__Der_Mann_ohne_Eigenschaften,[0:420],"{A3,A4}",multi,clauses,F,0.3978866337436322,0.022756992098352108
Musil__Der_Mann_ohne_Eigenschaften,[0:420],"{A3,A4}",binary,tokens,kappa,0.6076735754602062,0.0
Musil__Der_Mann_ohne_Eigenschaften,[0:420],"{A3,A4}",binary,tokens,alpha,0.6076906494624927,0.0
Musil__Der_Mann_ohne_Eigenschaften,[0:420],"{A3,A4}",binary,tokens,gamma,0.3567725362775147,0.0
Musil__Der_Mann_ohne_Eigenschaften,[0:420],"{A3,A4}",binary,tokens,P,0.9111563472081512,0.011871097045708101
Musil__Der_Mann_ohne_Eigenschaften,[0:420],"{A3,A4}",binary,tokens,R,0.6412511332728921,0.13934723481414324
Musil__Der_Mann_ohne_Eigenschaften,[0:420],"{A3,A4}",binary,tokens,F,0.7450522188380188,0.10080690288317184
Musil__Der_Mann_ohne_Eigenschaften,[0:420],"{A3,A4}",binary,clauses,kappa,0.5686419359261715,0.0
Musil__Der_Mann_ohne_Eigenschaften,[0:420],"{A3,A4}",binary,clauses,alpha,0.5688112287299683,0.0
Musil__Der_Mann_ohne_Eigenschaften,[0:420],"{A3,A4}",binary,clauses,gamma,0.36814499764617803,0.0
Musil__Der_Mann_ohne_Eigenschaften,[0:420],"{A3,A4}",binary,clauses,P,0.9282465953307393,0.009496595330739321
Musil__Der_Mann_ohne_Eigenschaften,[0:420],"{A3,A4}",binary,clauses,R,0.6247987117552335,0.15136876006441224
Musil__Der_Mann_ohne_Eigenschaften,[0:420],"{A3,A4}",binary,clauses,F,0.7371031848207221,0.11223602222773599
Novalis__Die_Lehrlinge_zu_Sais,"[0:230],[230:440]","{A2,A3},{A5,A6}",multi,tokens,kappa,0.799205629944695,0.1630850104999842
Novalis__Die_Lehrlinge_zu_Sais,"[0:230],[230:440]","{A2,A3},{A5,A6}",multi,tokens,alpha,0.8145421751850515,0.1476601971550659
Novalis__Die_Lehrlinge_zu_Sais,"[0:230],[230:440]","{A2,A3},{A5,A6}",multi,tokens,gamma,0.73550946403877,0.212767671716644
Novalis__Die_Lehrlinge_zu_Sais,"[0:230],[230:440]","{A2,A3},{A5,A6}",multi,tokens,P,0.8480678917257569,0.026704254850345492
Novalis__Die_Lehrlinge_zu_Sais,"[0:230],[230:440]","{A2,A3},{A5,A6}",multi,tokens,R,0.7425201407361782,0.004161226134334846
Novalis__Die_Lehrlinge_zu_Sais,"[0:230],[230:440]","{A2,A3},{A5,A6}",multi,tokens,F,0.7722938009852673,0.02001868587039662
Novalis__Die_Lehrlinge_zu_Sais,"[0:230],[230:440]","{A2,A3},{A5,A6}",multi,clauses,kappa,0.7958491086546943,0.1801015034901794
Novalis__Die_Lehrlinge_zu_Sais,"[0:230],[230:440]","{A2,A3},{A5,A6}",multi,clauses,alpha,0.813271801235391,0.16264825901626495
Novalis__Die_Lehrlinge_zu_Sais,"[0:230],[230:440]","{A2,A3},{A5,A6}",multi,clauses,gamma,0.7479060416214829,0.20013996603727757
Novalis__Die_Lehrlinge_zu_Sais,"[0:230],[230:440]","{A2,A3},{A5,A6}",multi,clauses,P,0.8484883551756589,0.02560724287549393
Novalis__Die_Lehrlinge_zu_Sais,"[0:230],[230:440]","{A2,A3},{A5,A6}",multi,clauses,R,0.7453242687840937,0.003621209590538813
Novalis__Die_Lehrlinge_zu_Sais,"[0:230],[230:440]","{A2,A3},{A5,A6}",multi,clauses,F,0.7709668325286971,0.024565469682774732
Novalis__Die_Lehrlinge_zu_Sais,"[0:230],[230:440]","{A2,A3},{A5,A6}",binary,tokens,kappa,0.8406782511288218,0.11886843510064887
Novalis__Die_Lehrlinge_zu_Sais,"[0:230],[230:440]","{A2,A3},{A5,A6}",binary,tokens,alpha,0.8406926571391351,0.11885742168625718
Novalis__Die_Lehrlinge_zu_Sais,"[0:230],[230:440]","{A2,A3},{A5,A6}",binary,tokens,gamma,0.7297708872687492,0.22827023803602248
Novalis__Die_Lehrlinge_zu_Sais,"[0:230],[230:440]","{A2,A3},{A5,A6}",binary,tokens,P,0.9735479624560697,0.009474967190988828
Novalis__Die_Lehrlinge_zu_Sais,"[0:230],[230:440]","{A2,A3},{A5,A6}",binary,tokens,R,0.8306345773182935,0.08997131805472323
Novalis__Die_Lehrlinge_zu_Sais,"[0:230],[230:440]","{A2,A3},{A5,A6}",binary,tokens,F,0.8939981023888992,0.054366608713900366
Novalis__Die_Lehrlinge_zu_Sais,"[0:230],[230:440]","{A2,A3},{A5,A6}",binary,clauses,kappa,0.8456752997683858,0.12860746063481904
Novalis__Die_Lehrlinge_zu_Sais,"[0:230],[230:440]","{A2,A3},{A5,A6}",binary,clauses,alpha,0.8458033710226076,0.1285009281072278
Novalis__Die_Lehrlinge_zu_Sais,"[0:230],[230:440]","{A2,A3},{A5,A6}",binary,clauses,gamma,0.7430582084330809,0.21645595547015517
Novalis__Die_Lehrlinge_zu_Sais,"[0:230],[230:440]","{A2,A3},{A5,A6}",binary,clauses,P,0.97187077919541,0.012557077485722783
Novalis__Die_Lehrlinge_zu_Sais,"[0:230],[230:440]","{A2,A3},{A5,A6}",binary,clauses,R,0.8514408682634731,0.08280391995305833
Novalis__Die_Lehrlinge_zu_Sais,"[0:230],[230:440]","{A2,A3},{A5,A6}",binary,clauses,F,0.9059151975468058,0.05125662220927847
Reuter__Schelmuffskys_kuriose_und_sehr_gefährliche_Reisebeschreibung_zu_Wasser_und_Lande,[0:460],"{A5,A6}",multi,tokens,kappa,0.7849497631138093,0.0
Reuter__Schelmuffskys_kuriose_und_sehr_gefährliche_Reisebeschreibung_zu_Wasser_und_Lande,[0:460],"{A5,A6}",multi,tokens,alpha,0.8010909694172269,0.0
Reuter__Schelmuffskys_kuriose_und_sehr_gefährliche_Reisebeschreibung_zu_Wasser_und_Lande,[0:460],"{A5,A6}",multi,tokens,gamma,0.7377710230063443,0.0
Reuter__Schelmuffskys_kuriose_und_sehr_gefährliche_Reisebeschreibung_zu_Wasser_und_Lande,[0:460],"{A5,A6}",multi,tokens,P,0.8554726439688234,0.01543996832309924
Reuter__Schelmuffskys_kuriose_und_sehr_gefährliche_Reisebeschreibung_zu_Wasser_und_Lande,[0:460],"{A5,A6}",multi,tokens,R,0.9404537890424988,0.03765040962621602
Reuter__Schelmuffskys_kuriose_und_sehr_gefährliche_Reisebeschreibung_zu_Wasser_und_Lande,[0:460],"{A5,A6}",multi,tokens,F,0.8928437450205569,0.007043507623333889
Reuter__Schelmuffskys_kuriose_und_sehr_gefährliche_Reisebeschreibung_zu_Wasser_und_Lande,[0:460],"{A5,A6}",multi,clauses,kappa,0.7644723588315461,0.0
Reuter__Schelmuffskys_kuriose_und_sehr_gefährliche_Reisebeschreibung_zu_Wasser_und_Lande,[0:460],"{A5,A6}",multi,clauses,alpha,0.7773509952440809,0.0
Reuter__Schelmuffskys_kuriose_und_sehr_gefährliche_Reisebeschreibung_zu_Wasser_und_Lande,[0:460],"{A5,A6}",multi,clauses,gamma,0.7231315482983389,0.0
Reuter__Schelmuffskys_kuriose_und_sehr_gefährliche_Reisebeschreibung_zu_Wasser_und_Lande,[0:460],"{A5,A6}",multi,clauses,P,0.8429782762651067,0.015719041742556117
Reuter__Schelmuffskys_kuriose_und_sehr_gefährliche_Reisebeschreibung_zu_Wasser_und_Lande,[0:460],"{A5,A6}",multi,clauses,R,0.9421110804089528,0.03191489361702138
Reuter__Schelmuffskys_kuriose_und_sehr_gefährliche_Reisebeschreibung_zu_Wasser_und_Lande,[0:460],"{A5,A6}",multi,clauses,F,0.8866296802810032,0.0035100758890829753
Reuter__Schelmuffskys_kuriose_und_sehr_gefährliche_Reisebeschreibung_zu_Wasser_und_Lande,[0:460],"{A5,A6}",binary,tokens,kappa,0.8251179575751302,0.0
Reuter__Schelmuffskys_kuriose_und_sehr_gefährliche_Reisebeschreibung_zu_Wasser_und_Lande,[0:460],"{A5,A6}",binary,tokens,alpha,0.8251258054499474,0.0
Reuter__Schelmuffskys_kuriose_und_sehr_gefährliche_Reisebeschreibung_zu_Wasser_und_Lande,[0:460],"{A5,A6}",binary,tokens,gamma,0.7441026816966689,0.0
Reuter__Schelmuffskys_kuriose_und_sehr_gefährliche_Reisebeschreibung_zu_Wasser_und_Lande,[0:460],"{A5,A6}",binary,tokens,P,0.8391267202742613,0.05557693672447772
Reuter__Schelmuffskys_kuriose_und_sehr_gefährliche_Reisebeschreibung_zu_Wasser_und_Lande,[0:460],"{A5,A6}",binary,tokens,R,0.9607908847184987,0.009718498659517405
Reuter__Schelmuffskys_kuriose_und_sehr_gefährliche_Reisebeschreibung_zu_Wasser_und_Lande,[0:460],"{A5,A6}",binary,tokens,F,0.894546579355908,0.02748071109243494
Reuter__Schelmuffskys_kuriose_und_sehr_gefährliche_Reisebeschreibung_zu_Wasser_und_Lande,[0:460],"{A5,A6}",binary,clauses,kappa,0.7937165755208786,0.0
Reuter__Schelmuffskys_kuriose_und_sehr_gefährliche_Reisebeschreibung_zu_Wasser_und_Lande,[0:460],"{A5,A6}",binary,clauses,alpha,0.7937944183225689,0.0
Reuter__Schelmuffskys_kuriose_und_sehr_gefährliche_Reisebeschreibung_zu_Wasser_und_Lande,[0:460],"{A5,A6}",binary,clauses,gamma,0.7278749205788763,0.0
Reuter__Schelmuffskys_kuriose_und_sehr_gefährliche_Reisebeschreibung_zu_Wasser_und_Lande,[0:460],"{A5,A6}",binary,clauses,P,0.8170448179271709,0.05724089635854346
Reuter__Schelmuffskys_kuriose_und_sehr_gefährliche_Reisebeschreibung_zu_Wasser_und_Lande,[0:460],"{A5,A6}",binary,clauses,R,0.9565217391304348,0.006211180124223614
Reuter__Schelmuffskys_kuriose_und_sehr_gefährliche_Reisebeschreibung_zu_Wasser_und_Lande,[0:460],"{A5,A6}",binary,clauses,F,0.8800146771037182,0.03069960861056753
Rilke__Die_Aufzeichnungen_des_Malte_Laurids_Brigge,[0:430],"{A2,A4}",multi,tokens,kappa,0.545737424419861,0.0
Rilke__Die_Aufzeichnungen_des_Malte_Laurids_Brigge,[0:430],"{A2,A4}",multi,tokens,alpha,0.5882938606993497,0.0
Rilke__Die_Aufzeichnungen_des_Malte_Laurids_Brigge,[0:430],"{A2,A4}",multi,tokens,gamma,0.3845713694108359,0.0
Rilke__Die_Aufzeichnungen_des_Malte_Laurids_Brigge,[0:430],"{A2,A4}",multi,tokens,P,0.685130564679723,0.005998769322761999
Rilke__Die_Aufzeichnungen_des_Malte_Laurids_Brigge,[0:430],"{A2,A4}",multi,tokens,R,0.7593556745986214,0.060585300034640965
Rilke__Die_Aufzeichnungen_des_Malte_Laurids_Brigge,[0:430],"{A2,A4}",multi,tokens,F,0.7106494364680758,0.020498085678886835
Rilke__Die_Aufzeichnungen_des_Malte_Laurids_Brigge,[0:430],"{A2,A4}",multi,clauses,kappa,0.530993668662234,0.0
Rilke__Die_Aufzeichnungen_des_Malte_Laurids_Brigge,[0:430],"{A2,A4}",multi,clauses,alpha,0.5697711003986897,0.0
Rilke__Die_Aufzeichnungen_des_Malte_Laurids_Brigge,[0:430],"{A2,A4}",multi,clauses,gamma,0.40491666491247136,0.0
Rilke__Die_Aufzeichnungen_des_Malte_Laurids_Brigge,[0:430],"{A2,A4}",multi,clauses,P,0.6660976708413326,0.009735426243793976
Rilke__Die_Aufzeichnungen_des_Malte_Laurids_Brigge,[0:430],"{A2,A4}",multi,clauses,R,0.7578657772950972,0.06709280349356367
Rilke__Die_Aufzeichnungen_des_Malte_Laurids_Brigge,[0:430],"{A2,A4}",multi,clauses,F,0.6979993372722143,0.019203383634457616
Rilke__Die_Aufzeichnungen_des_Malte_Laurids_Brigge,[0:430],"{A2,A4}",binary,tokens,kappa,0.6923333536893415,0.0
Rilke__Die_Aufzeichnungen_des_Malte_Laurids_Brigge,[0:430],"{A2,A4}",binary,tokens,alpha,0.6923505360107036,0.0
Rilke__Die_Aufzeichnungen_des_Malte_Laurids_Brigge,[0:430],"{A2,A4}",binary,tokens,gamma,0.3808493789334889,0.0
Rilke__Die_Aufzeichnungen_des_Malte_Laurids_Brigge,[0:430],"{A2,A4}",binary,tokens,P,0.6959294330808159,0.034854653439075844
Rilke__Die_Aufzeichnungen_des_Malte_Laurids_Brigge,[0:430],"{A2,A4}",binary,tokens,R,0.8427258193445244,0.08653077537969622
Rilke__Die_Aufzeichnungen_des_Malte_Laurids_Brigge,[0:430],"{A2,A4}",binary,tokens,F,0.7579130109462509,0.014640569382707358
Rilke__Die_Aufzeichnungen_des_Malte_Laurids_Brigge,[0:430],"{A2,A4}",binary,clauses,kappa,0.6670148552339074,0.0
Rilke__Die_Aufzeichnungen_des_Malte_Laurids_Brigge,[0:430],"{A2,A4}",binary,clauses,alpha,0.6671601367106812,0.0
Rilke__Die_Aufzeichnungen_des_Malte_Laurids_Brigge,[0:430],"{A2,A4}",binary,clauses,gamma,0.36903324511233127,0.0
Rilke__Die_Aufzeichnungen_des_Malte_Laurids_Brigge,[0:430],"{A2,A4}",binary,clauses,P,0.6611766263279242,0.03364626195545456
Rilke__Die_Aufzeichnungen_des_Malte_Laurids_Brigge,[0:430],"{A2,A4}",binary,clauses,R,0.8432835820895522,0.08208955223880599
Rilke__Die_Aufzeichnungen_des_Malte_Laurids_Brigge,[0:430],"{A2,A4}",binary,clauses,F,0.7371923747074531,0.010696648211726612
Schnabel__Die_Insel_Felsenburg,[0:300],"{A2,A3}",multi,tokens,kappa,0.7366244021914924,0.0
Schnabel__Die_Insel_Felsenburg,[0:300],"{A2,A3}",multi,tokens,alpha,0.7818436729461362,0.0
Schnabel__Die_Insel_Felsenburg,[0:300],"{A2,A3}",multi,tokens,gamma,0.6883564590101785,0.0
Schnabel__Die_Insel_Felsenburg,[0:300],"{A2,A3}",multi,tokens,P,0.7116036793183842,0.015271935774201217
Schnabel__Die_Insel_Felsenburg,[0:300],"{A2,A3}",multi,tokens,R,0.8698177700013884,0.0011879914922023893
Schnabel__Die_Insel_Felsenburg,[0:300],"{A2,A3}",multi,tokens,F,0.7785550023799301,0.009013275271820997
Schnabel__Die_Insel_Felsenburg,[0:300],"{A2,A3}",multi,clauses,kappa,0.7391651655078536,0.0
Schnabel__Die_Insel_Felsenburg,[0:300],"{A2,A3}",multi,clauses,alpha,0.7903147966946604,0.0
Schnabel__Die_Insel_Felsenburg,[0:300],"{A2,A3}",multi,clauses,gamma,0.6856732799074771,0.0
Schnabel__Die_Insel_Felsenburg,[0:300],"{A2,A3}",multi,clauses,P,0.7074319910066038,0.0008042296903261748
Schnabel__Die_Insel_Felsenburg,[0:300],"{A2,A3}",multi,clauses,R,0.8565656565656565,0.0017570664629488197
Schnabel__Die_Insel_Felsenburg,[0:300],"{A2,A3}",multi,clauses,F,0.7695139044965391,0.0003666895114650681
Schnabel__Die_Insel_Felsenburg,[0:300],"{A2,A3}",binary,tokens,kappa,0.8847026221141558,0.0
Schnabel__Die_Insel_Felsenburg,[0:300],"{A2,A3}",binary,tokens,alpha,0.8847091887719689,0.0
Schnabel__Die_Insel_Felsenburg,[0:300],"{A2,A3}",binary,tokens,gamma,0.7471356022542045,0.0
Schnabel__Die_Insel_Felsenburg,[0:300],"{A2,A3}",binary,tokens,P,0.8806276871371694,0.030699837209319514
Schnabel__Die_Insel_Felsenburg,[0:300],"{A2,A3}",binary,tokens,R,0.9509120171673819,0.0029506437768240246
Schnabel__Die_Insel_Felsenburg,[0:300],"{A2,A3}",binary,tokens,F,0.9141909829752878,0.017919108767831537
Schnabel__Die_Insel_Felsenburg,[0:300],"{A2,A3}",binary,clauses,kappa,0.9062477111257599,0.0
Schnabel__Die_Insel_Felsenburg,[0:300],"{A2,A3}",binary,clauses,alpha,0.9062965404428819,0.0
Schnabel__Die_Insel_Felsenburg,[0:300],"{A2,A3}",binary,clauses,gamma,0.7602908283977137,0.0
Schnabel__Die_Insel_Felsenburg,[0:300],"{A2,A3}",binary,clauses,P,0.8832294606061837,0.015388050914553697
Schnabel__Die_Insel_Felsenburg,[0:300],"{A2,A3}",binary,clauses,R,0.9468599033816425,0.004830917874396157
Schnabel__Die_Insel_Felsenburg,[0:300],"{A2,A3}",binary,clauses,F,0.9138227110686027,0.005988609686114255
Wieland__Geschichte_des_Agathon,[0:500],"{A1,A2,A3,A4,A5,A6}",multi,tokens,kappa,0.5897860595540355,0.0
Wieland__Geschichte_des_Agathon,[0:500],"{A1,A2,A3,A4,A5,A6}",multi,tokens,alpha,0.6019920814168427,0.0
Wieland__Geschichte_des_Agathon,[0:500],"{A1,A2,A3,A4,A5,A6}",multi,tokens,gamma,,
Wieland__Geschichte_des_Agathon,[0:500],"{A1,A2,A3,A4,A5,A6}",multi,tokens,P,0.8584068183737856,0.019340863802891232
Wieland__Geschichte_des_Agathon,[0:500],"{A1,A2,A3,A4,A5,A6}",multi,tokens,R,0.3886553817803309,0.08482306921383849
Wieland__Geschichte_des_Agathon,[0:500],"{A1,A2,A3,A4,A5,A6}",multi,tokens,F,0.4961679861833767,0.07141129513230723
Wieland__Geschichte_des_Agathon,[0:500],"{A1,A2,A3,A4,A5,A6}",multi,clauses,kappa,0.5964502178475583,0.0
Wieland__Geschichte_des_Agathon,[0:500],"{A1,A2,A3,A4,A5,A6}",multi,clauses,alpha,0.6081149947293152,0.0
Wieland__Geschichte_des_Agathon,[0:500],"{A1,A2,A3,A4,A5,A6}",multi,clauses,gamma,,
Wieland__Geschichte_des_Agathon,[0:500],"{A1,A2,A3,A4,A5,A6}",multi,clauses,P,0.868795297239031,0.02351134357801248
Wieland__Geschichte_des_Agathon,[0:500],"{A1,A2,A3,A4,A5,A6}",multi,clauses,R,0.39007968882968885,0.08398690296961124
Wieland__Geschichte_des_Agathon,[0:500],"{A1,A2,A3,A4,A5,A6}",multi,clauses,F,0.4981418159813842,0.07036275382765175
Wieland__Geschichte_des_Agathon,[0:500],"{A1,A2,A3,A4,A5,A6}",binary,tokens,kappa,0.6159793156151155,0.0
Wieland__Geschichte_des_Agathon,[0:500],"{A1,A2,A3,A4,A5,A6}",binary,tokens,alpha,0.615984070700352,0.0
Wieland__Geschichte_des_Agathon,[0:500],"{A1,A2,A3,A4,A5,A6}",binary,tokens,gamma,,
Wieland__Geschichte_des_Agathon,[0:500],"{A1,A2,A3,A4,A5,A6}",binary,tokens,P,0.9780820286706468,0.007495071503251731
Wieland__Geschichte_des_Agathon,[0:500],"{A1,A2,A3,A4,A5,A6}",binary,tokens,R,0.5909090909090909,0.10766454488171229
Wieland__Geschichte_des_Agathon,[0:500],"{A1,A2,A3,A4,A5,A6}",binary,tokens,F,0.7308459759415581,0.07929364829293914
Wieland__Geschichte_des_Agathon,[0:500],"{A1,A2,A3,A4,A5,A6}",binary,clauses,kappa,0.6218934304854169,0.0
Wieland__Geschichte_des_Agathon,[0:500],"{A1,A2,A3,A4,A5,A6}",binary,clauses,alpha,0.6219327919854694,0.0
Wieland__Geschichte_des_Agathon,[0:500],"{A1,A2,A3,A4,A5,A6}",binary,clauses,gamma,,
Wieland__Geschichte_des_Agathon,[0:500],"{A1,A2,A3,A4,A5,A6}",binary,clauses,P,0.978261496922301,0.007843708541472257
Wieland__Geschichte_des_Agathon,[0:500],"{A1,A2,A3,A4,A5,A6}",binary,clauses,R,0.5828955049620549,0.11180284640415533
Wieland__Geschichte_des_Agathon,[0:500],"{A1,A2,A3,A4,A5,A6}",binary,clauses,F,0.7240237690444603,0.08300753893149504
AVERAGE,,,multi,tokens,kappa,0.5306269561371926,0.2319674669335482
AVERAGE,,,multi,tokens,alpha,0.5526626711347371,0.24104092859470916
AVERAGE,,,multi,tokens,gamma,0.4741441232547663,0.22934777934457035
AVERAGE,,,multi,tokens,P,0.5577335643982946,0.311129404086732
AVERAGE,,,multi,tokens,R,0.48050270548057206,0.30926916351678746
AVERAGE,,,multi,tokens,F,0.48618771594329335,0.297751076673276
AVERAGE,,,multi,clauses,kappa,0.5293315415800774,0.22773265878880508
AVERAGE,,,multi,clauses,alpha,0.5517776861276458,0.23739341439240164
AVERAGE,,,multi,clauses,gamma,0.47874885400341394,0.2291821267773577
AVERAGE,,,multi,clauses,P,0.5587584529526102,0.3094616889477633
AVERAGE,,,multi,clauses,R,0.4792509196390763,0.30996258958288586
AVERAGE,,,multi,clauses,F,0.4840528411470604,0.2966099965507428
AVERAGE,,,binary,tokens,kappa,0.5113067684039877,0.2774120394728364
AVERAGE,,,binary,tokens,alpha,0.5113482927198094,0.27738924469383175
AVERAGE,,,binary,tokens,gamma,0.40279667132239544,0.2483069339189432
AVERAGE,,,binary,tokens,P,0.81864366155096,0.12211012486561461
AVERAGE,,,binary,tokens,R,0.6463913544283723,0.19616486583840012
AVERAGE,,,binary,tokens,F,0.6960610875894111,0.1499267979028522
AVERAGE,,,binary,clauses,kappa,0.5033658723116153,0.27970953257145986
AVERAGE,,,binary,clauses,alpha,0.5037241319698647,0.279514078403368
AVERAGE,,,binary,clauses,gamma,0.3989220595506943,0.2582747482674932
AVERAGE,,,binary,clauses,P,0.8213344922951025,0.12305383100656633
AVERAGE,,,binary,clauses,R,0.6426004034061817,0.2016643396544387
AVERAGE,,,binary,clauses,F,0.6921293213840309,0.15307587749823012
