              P         R         F
ALL    0.666667  0.571429  0.615385
BARE   0.816901  0.698795  0.753247
DIV    1.000000  0.375000  0.545455
EXIST  1.000000  1.000000  1.000000
MEIST  1.000000  1.000000  1.000000
NEG    1.000000  0.250000  0.400000
micro  0.825581  0.612069  0.702970
macro  0.913928  0.649204  0.719014
binar  0.870588  0.649123  0.743719

          ALL  BARE  DIV  EXIST  MEIST  NEG  untagged  multiple
ALL         3     0    0      0      0    0         3         0
BARE        2    57    0      0      0    0        23         0
DIV         0     1    2      0      0    0         4         0
EXIST       0     0    0      2      0    0         0         0
MEIST       0     0    0      0      0    0         0         0
NEG         0     1    0      0      0    4        10         0
untagged    0    11    0      0      0    0       326         0
multiple    0     1    0      0      0    0         0         1
