              P         R      F
GI     0.566176  0.291667  0.385
micro  0.566176  0.291667  0.385
macro  0.566176  0.291667  0.385
binar  0.566176  0.291667  0.385

          GI  untagged
GI        77       187
untagged  59      1270
