              P         R         F
ALL    0.181818  0.444444  0.258065
BARE   0.161290  0.368421  0.224359
DIV    0.166667  0.142857  0.153846
EXIST  0.375000  1.000000  0.545455
MEIST  0.000000  0.000000  0.000000
NEG    0.081633  0.129032  0.100000
micro  0.155116  0.311258  0.207048
macro  0.161068  0.347459  0.213621
binar  0.184818  0.380952  0.248889

          ALL  BARE  DIV  EXIST  MEIST  NEG  untagged  multiple
ALL         4     0    0      0      0    0         5         0
BARE        2    35    0      1      0    0        56         0
DIV         0     1    1      0      0    0         2         0
EXIST       0     0    0      0      0    0         0         0
MEIST       0     0    0      0      0    0         6         0
NEG         2     3    0      0      0    3        22         0
untagged   14   178    5      4      1   45       579         0
multiple    0     0    0      3      0    1         0         0
