              P         R         F
GI     0.750237  0.883669  0.811505
micro  0.750237  0.883669  0.811505
macro  0.750237  0.883669  0.811505
binar  0.750237  0.883669  0.811505

           GI  untagged
GI        790       104
untagged  263      1194
