              P         R         F
ALL    0.941176  0.695652  0.800000
BARE   0.746667  0.800000  0.772414
DIV    0.966667  0.783784  0.865672
EXIST  1.000000  1.000000  1.000000
MEIST  1.000000  1.000000  1.000000
NEG    0.964286  0.729730  0.830769
micro  0.857143  0.771930  0.812308
macro  0.936466  0.834861  0.878142
binar  0.947712  0.852941  0.897833

          ALL  BARE  DIV  EXIST  MEIST  NEG  untagged  multiple
ALL        16     2    0      0      0    0         5         0
BARE        0    56    1      0      0    1        12         0
DIV         1     5   28      0      0    0         2         0
EXIST       0     0    0      3      0    0         0         0
MEIST       0     0    0      0      1    0         0         0
NEG         0     4    0      0      0   26         6         0
untagged    0     8    0      0      0    0       836         0
multiple    0     0    0      0      0    0         0         1
