              P         R         F
ALL    0.266667  0.347826  0.301887
BARE   0.131915  0.442857  0.203279
DIV    0.521739  0.324324  0.400000
EXIST  0.000000  0.000000  0.000000
MEIST  0.500000  1.000000  0.666667
NEG    0.156250  0.135135  0.144928
micro  0.174847  0.333333  0.229376
macro  0.262762  0.375024  0.286127
binar  0.245399  0.470588  0.322581

          ALL  BARE  DIV  EXIST  MEIST  NEG  untagged  multiple
ALL         8     3    1      0      0    0        11         0
BARE        1    31    1      0      0    0        37         0
DIV         3     4   11      0      0    0        18         0
EXIST       0     2    0      0      0    0         1         0
MEIST       0     0    0      0      1    0         0         0
NEG         2     2    2      2      0    5        23         0
untagged   16   193    7      2      1   27       598         0
multiple    0     0    1      0      0    0         0         0
