              P         R         F
ALL    0.505051  0.781250  0.613497
BARE   0.601562  0.636364  0.618474
DIV    0.533333  0.842105  0.653061
EXIST  1.000000  0.666667  0.800000
MEIST  0.400000  1.000000  0.571429
NEG    0.583333  0.763636  0.661417
micro  0.560117  0.718045  0.629325
macro  0.603880  0.781670  0.652980
binar  0.627566  0.810606  0.707438

          ALL  BARE  DIV  EXIST  MEIST  NEG  untagged  multiple
ALL        50     3    0      0      0    0        10         0
BARE        5    77    2      0      3    3        31         0
DIV         0     0   16      0      1    0         1         0
EXIST       0     0    0      2      0    0         0         0
MEIST       0     0    0      0      4    0         0         0
NEG         6     0    0      0      0   42         6         0
untagged   38    48   12      0      2   27      1202         0
multiple    0     0    0      0      0    0         2         0
