              P         R         F
ALL    0.356164  0.406250  0.379562
BARE   0.232000  0.239669  0.235772
DIV    0.078947  0.157895  0.105263
EXIST  0.750000  1.000000  0.857143
MEIST  0.000000  0.000000  0.000000
NEG    0.259259  0.127273  0.170732
micro  0.250923  0.255639  0.253259
macro  0.279395  0.321848  0.291412
binar  0.328244  0.325758  0.326996

          ALL  BARE  DIV  EXIST  MEIST  NEG  untagged  multiple
ALL        24     4    0      0      0    1        32         2
BARE        0    29    4      0      0    1        87         0
DIV         0     1    3      0      0    0        14         0
EXIST       0     0    0      2      0    0         0         0
MEIST       1     0    0      0      0    1         2         0
NEG         4     1    0      0      0    6        43         0
untagged   37    90   24      0      2   17      1153         6
multiple    0     0    0      0      0    1         0         1
