              P         R         F
ALL    0.375000  0.391304  0.382979
BARE   0.324503  0.449541  0.376923
DIV    0.207317  0.293103  0.242857
EXIST  0.000000  0.000000  0.000000
MEIST  0.000000  0.000000  0.000000
NEG    0.233871  0.591837  0.335260
micro  0.275610  0.431298  0.336310
macro  0.190115  0.287631  0.223003
binar  0.439024  0.705882  0.541353

          ALL  BARE  DIV  EXIST  MEIST  NEG  untagged  multiple
ALL        18     7    6      0      1    4         8         0
BARE        8    49    8      0      0   12        26         0
DIV         2     7   16      0      2    4        22         0
EXIST       0     0    0      0      0    0         0         0
MEIST       0     0    0      0      0    0         0         0
NEG         2     0    2      0      0   29        15         0
untagged   18    88   47      2      0   75      1222         0
multiple    0     0    3      0      0    0         4         0
