              P         R         F
ALL    0.541667  0.684211  0.604651
BARE   0.522727  0.442308  0.479167
DIV    0.000000  0.000000  0.000000
EXIST  0.333333  0.333333  0.333333
MEIST  0.000000  0.000000  0.000000
NEG    0.529412  0.500000  0.514286
micro  0.516854  0.455446  0.484211
macro  0.321190  0.326642  0.321906
binar  0.650602  0.540000  0.590164

          ALL  BARE  DIV  EXIST  MEIST  NEG  untagged  multiple
ALL        13     2    0      0      0    0         4         0
BARE        1    18    0      0      0    0        28         5
DIV         0     0    0      0      0    0         7         0
EXIST       0     2    0      1      0    0         0         0
MEIST       0     0    0      0      0    0         1         0
NEG         2     0    0      0      0    8         6         1
untagged    4    16    0      2      0    7       697         0
multiple    0     0    0      0      0    1         0         0
