              P         R        F
GI     0.816327  0.430108  0.56338
micro  0.816327  0.430108  0.56338
macro  0.816327  0.430108  0.56338
binar  0.816327  0.430108  0.56338

          GI  untagged
GI        40        53
untagged   9       930
