              P         R         F
ALL    0.000000  0.000000  0.000000
BARE   0.000000  0.000000  0.000000
DIV    0.000000  0.000000  0.000000
EXIST  1.000000  1.000000  1.000000
MEIST  1.000000  1.000000  1.000000
NEG    0.000000  0.000000  0.000000
micro  0.000000  0.000000  0.000000
macro  0.333333  0.333333  0.333333
binar  0.000000  0.000000  0.000000

          ALL  BARE  DIV  EXIST  MEIST  NEG  untagged  multiple
ALL         0     0    0      0      0    0         9         0
BARE        0     0    0      0      0    0        35         0
DIV         0     0    0      0      0    0         7         0
EXIST       0     0    0      0      0    0         0         0
MEIST       0     0    0      0      0    0         0         0
NEG         0     0    0      0      0    0        17         0
untagged    0     0    0      0      0    0       342         0
multiple    0     0    0      0      0    0        14         0
