              P        R         F
ALL    0.000000  0.00000  0.000000
BARE   0.000000  0.00000  0.000000
DIV    0.000000  0.00000  0.000000
EXIST  0.000000  0.00000  0.000000
MEIST  0.000000  0.00000  0.000000
NEG    0.000000  0.00000  0.000000
micro  0.000000  0.00000  0.000000
macro  0.000000  0.00000  0.000000
binar  0.629588  0.63311  0.631344

          ALL  BARE  DIV  EXIST  MEIST  NEG  untagged  multiple
ALL         0     0    0      0      0    0         0         0
BARE        0     0    0      0      0    0         0         0
DIV         0     0    0      0      0    0         0         0
EXIST       0     0    0      0      0    0         0         0
MEIST       0     0    0      0      0    0         0         0
NEG         0     0    0      0      0    0         0         0
untagged   65   501   87     24      9  178      1452        35
multiple    0     0    0      0      0    0         0         0
