SubID,Target,MSO_RMT,MSO_Stokes,MSO_Efield,SCD,E_RMT,E_Stokes,E_Efield,X,Y,Z
Sub-01,FDI,40,40,40,17.47,52.14,52.14,52.14,-25.87,-4.17,67.01
Sub-01,IPL,40,20,34,10.96,61.41,30.71,52.2,-60.16,-36.69,19.06
Sub-01,Aud,40,25,29,12.35,71.15,44.47,51.58,-65.1,-2.61,8.21
Sub-01,Somato,40,51,54,21.08,38.56,49.16,52.05,-23.84,-24.02,62.86
Sub-01,DLPFC,40,29,33,13.91,62.36,45.21,51.44,-34.98,59.11,45.44
Sub-02,FDI,35,35,35,17.21,38.98,38.98,38.98,-26.4,-33.16,78.23
Sub-02,IPL,35,34,31,16.83,44.22,42.96,39.17,-42.59,-48.83,60.04
Sub-02,Aud,35,22,26,12.97,51.73,32.51,38.42,-57.22,-24.61,23.02
Sub-02,Somato,35,56,55,24.16,24.7,39.52,38.82,-40.74,-26.24,45.62
Sub-02,DLPFC,35,32,36,16.2,38.28,35,39.37,-29.59,39.9,47.17
Sub-03,FDI,49,49,49,22.3,53.96,53.96,53.96,-31.01,-21.51,50.16
Sub-03,IPL,49,40,58,19.42,45.84,37.42,54.26,-40.67,-63.96,38.47
Sub-03,Aud,49,33,51,16.92,51.64,34.78,53.75,-59.75,-20.91,6.3
Sub-03,Somato,49,31,43,16.41,61.01,38.6,53.54,-56.1,-29.38,33.22
Sub-03,DLPFC,49,44,51,20.48,51.72,46.44,53.83,-30.87,32.4,35.6
Sub-04,FDI,56,56,56,22.1,63.86,63.86,63.86,-22.78,-29.6,60.27
Sub-04,IPL,56,53,69,20.99,52.02,49.23,64.09,-32.88,-86.17,22.65
Sub-04,Aud,56,27,41,12.46,86.32,41.62,63.2,-60.32,-34.25,11.87
Sub-04,Somato,56,47,56,19.01,63.73,53.49,63.73,-46.09,-41.7,45.12
Sub-04,DLPFC,56,49,67,19.71,53.37,46.7,63.86,-31.99,30.26,38.37
Sub-05,FDI,39,39,39,20.85,50.98,50.98,50.98,-26.97,-25.01,57.82
Sub-05,IPL,39,25,37,16.25,54.08,34.67,51.31,-55.05,-56.04,24.07
Sub-05,Aud,39,17,40,13.65,49.64,21.64,50.91,-63.5,-16.92,-6.24
Sub-05,Somato,39,32,43,18.57,46.32,38.01,51.07,-33.66,-47.02,54.83
Sub-05,DLPFC,39,28,41,17.1,48.47,34.8,50.96,-29.67,40.26,32.4
Sub-06,FDI,45,45,45,18.52,50.25,50.25,50.25,-26.47,-30.78,60.58
Sub-06,IPL,45,43,53,17.86,42.29,40.41,49.81,-56.4,-36.38,26.53
Sub-06,Aud,45,54,52,21.63,43.62,52.34,50.4,-49.66,10.55,-3.51
Sub-06,Somato,45,72,73,27.41,31.04,49.66,50.35,-44,-16.36,25.73
Sub-06,DLPFC,45,42,42,17.56,53.76,50.17,50.17,-34.41,34.85,31.22
Sub-07,FDI,39,39,39,18.37,60.73,60.73,60.73,-27.32,9.88,74.76
Sub-07,IPL,39,31,52,15.84,45.57,36.22,60.76,-50.34,-17.06,57.12
Sub-07,Aud,39,30,46,15.32,51.66,39.74,60.93,-60.95,-2.77,18.08
Sub-07,Somato,39,38,57,18.12,41.71,40.64,60.97,-9.22,-16.52,83.07
Sub-07,DLPFC,39,38,48,17.99,49.8,48.52,61.29,-34.04,62.9,45.87
Sub-08,FDI,47,47,47,18.4,59.1,59.1,59.1,-33.42,-11.3,61.4
Sub-08,IPL,47,49,58,19.04,47.73,49.76,58.9,-41.67,-39.63,34.15
Sub-08,Aud,47,44,48,17.45,58.33,54.61,59.57,-57.45,41.16,0.89
Sub-08,Somato,47,51,67,19.83,41.77,45.32,59.54,-8.58,-26.35,67.39
Sub-08,DLPFC,47,46,48,17.94,57.9,56.67,59.13,-38.71,65.2,37.86
Sub-09,FDI,59,59,59,20.59,66.46,66.46,66.46,-34.03,-42.99,46.45
Sub-09,IPL,59,55,83,19.11,47.45,44.23,66.75,-44.84,-77.43,26.68
Sub-09,Aud,59,36,48,12.86,82.45,50.31,67.08,-69,-35.9,-6.72
Sub-09,Somato,59,48,79,16.92,49.7,40.43,66.54,-57.09,-38.27,27.22
Sub-09,DLPFC,59,51,54,17.94,73.02,63.12,66.83,-37.25,20.13,36.24
Sub-10,FDI,50,50,50,17.25,65.01,65.01,65.01,-36.38,24.81,93.56
Sub-10,IPL,50,52,65,18.02,50.19,52.2,65.25,-42.41,-22.12,84.94
Sub-10,Aud,50,53,51,18.39,63.86,67.69,65.14,-56.28,45.73,32.45
Sub-10,Somato,50,60,51,20.64,63.92,76.71,65.2,-37.92,13,91.18
Sub-10,DLPFC,50,48,59,16.55,55.53,53.31,65.53,-36.33,74.01,61.54
Sub-11,FDI,57,57,57,16.63,62.6,62.6,62.6,-31.36,-33.17,55.76
Sub-11,IPL,57,46,49,13.06,72.66,58.64,62.46,-33.48,-89.33,14.45
Sub-11,Aud,57,53,51,15.18,69.69,64.8,62.36,-59.6,-11.32,-8.19
Sub-11,Somato,57,52,53,14.82,67.27,61.37,62.55,-43.06,-42.4,49.59
Sub-11,DLPFC,57,58,58,17.06,61.31,62.39,62.39,-35.46,36.1,29.12
Sub-12,FDI,56,56,56,23.94,48.71,48.71,48.71,-32.64,-16.63,63.54
Sub-12,IPL,56,50,55,21.88,49.49,44.19,48.61,-44.44,-50.37,41.06
Sub-12,Aud,56,47,43,20.95,63.3,53.13,48.61,-60.29,32.87,5.82
Sub-12,Somato,56,48,46,21.34,59.47,50.97,48.85,-10.44,-34.82,73.61
Sub-12,DLPFC,56,44,45,19.83,60.28,47.36,48.44,-44.85,56.52,44.81
Sub-13,FDI,44,44,44,18.21,51.69,51.69,51.69,-20.67,-8.23,64.24
Sub-13,IPL,44,48,55,19.68,41.48,45.25,51.85,-37.42,-45.07,40.73
Sub-13,Aud,44,47,51,19.11,44.55,47.58,51.63,-50.01,29.02,3.18
Sub-13,Somato,44,45,49,18.39,45.98,47.03,51.21,-2.31,-29.38,67.49
Sub-13,DLPFC,44,33,37,14.4,61.32,45.99,51.57,-31.33,53.23,36.73
Sub-14,FDI,32,32,32,15.62,51.99,51.99,51.99,-37.16,-9.29,58.22
Sub-14,IPL,32,32,45,15.66,36.72,36.72,51.63,-45.88,-47.02,37.67
Sub-14,Aud,32,45,47,19.92,35.15,49.43,51.63,-51.83,30.88,1.06
Sub-14,Somato,32,40,40,18.39,41.32,51.65,51.65,-11.35,-33.49,64.74
Sub-14,DLPFC,32,36,45,17.09,37.01,41.64,52.05,-32.08,52.16,38.18
Sub-15,FDI,40,40,40,17.11,63.51,63.51,63.51,-32.08,-23.52,70.75
Sub-15,IPL,40,38,54,16.35,47.4,45.03,63.99,-53.63,-54.26,42.06
Sub-15,Aud,40,38,48,16.3,52.92,50.27,63.5,-57.52,3.52,10.23
Sub-15,Somato,40,49,67,20.02,38.18,46.77,63.95,-33.77,-44.37,65.34
Sub-15,DLPFC,40,41,55,17.58,45.99,47.14,63.23,-36.77,34.83,44
Sub-16,FDI,56,56,56,15.18,88.71,88.71,88.71,-29.96,-50.52,54.59
Sub-16,IPL,56,64,80,17.94,62.36,71.27,89.09,-35.39,-83.62,29.94
Sub-16,Aud,56,57,72,15.53,69.24,70.47,89.02,-55.37,-36.81,8.8
Sub-16,Somato,56,62,73,17.16,68.19,75.5,88.89,-3.15,-69.65,59.25
Sub-16,DLPFC,56,57,75,15.5,66.59,67.78,89.19,-32.49,15.33,34.51
Sub-17,FDI,49,49,49,20.05,57.42,57.42,57.42,-35.95,-39.33,63.53
Sub-17,IPL,49,45,50,18.6,56.51,51.89,57.66,-46.07,-73.68,35.97
Sub-17,Aud,49,36,41,15.75,68.21,50.11,57.07,-62.19,-19.63,13.06
Sub-17,Somato,49,50,63,20.23,44.81,45.73,57.62,-11.82,-63.4,69.69
Sub-17,DLPFC,49,47,53,19.51,53.17,51,57.52,-36.17,31.67,44.74
Sub-18,FDI,42,42,42,13.77,83.41,83.41,83.41,-29.12,-6.26,64.2
Sub-18,IPL,42,56,86,18.33,40.93,54.57,83.8,-36.28,-43.85,39.38
Sub-18,Aud,42,51,68,16.85,51.88,63,84,-57.47,4.82,12.86
Sub-18,Somato,42,53,68,17.41,51.3,64.73,83.05,-4.41,-30.6,66.6
Sub-18,DLPFC,42,51,73,16.7,48.13,58.45,83.66,-31.8,56.51,39.15
