Electrode,-25.4160966255747,75.9372553404411,0.8664099029180505,Fp1
Electrode,-0.2581651014199293,79.85923468130888,6.017443217353937,Fpz
Electrode,24.550403675170934,76.02193477753863,-0.550247741397706,Fp2
Electrode,-37.94413473911685,61.451255764323136,-34.792522954066726,AF9
Electrode,-45.93074236703871,65.65430891650642,-4.579619069354739,AF7
Electrode,-40.007719889089785,68.84342271915737,11.360739037109415,AF5
Electrode,-29.851995342586825,69.985419125671,25.906625729131274,AF3
Electrode,-15.970867413138341,69.39633578978857,36.199617270518914,AF1
Electrode,0.6100800670063219,70.55551137211762,38.85711671767882,AFz
Electrode,17.465253610607625,70.14143317199203,35.64088395340077,AF2
Electrode,31.127362912931897,69.13722758894633,24.669618912169103,AF4
Electrode,40.145502681608086,68.06328935437405,8.811838342928862,AF6
Electrode,45.91663889783627,65.05221354964328,-7.576380602496382,AF8
Electrode,36.95447078413051,60.066188198958244,-37.94240558537964,AF10
Electrode,-53.15621925175737,44.60234586992247,-39.79720131841356,F9
Electrode,-62.30920505397631,49.69370651133131,-9.92817376484372,F7
Electrode,-58.245609599738216,50.45207339724479,17.747757791314967,F5
Electrode,-45.17802785353535,50.53752731774727,42.55053920777778,F3
Electrode,-23.671218207447694,49.83377321147731,58.40340213402854,F1
Electrode,0.9903007205245804,49.25983699324349,63.020678511708276,Fz
Electrode,26.75560615947147,49.68184691797531,56.22375820243599,F2
Electrode,47.7220575944331,50.7715884057403,38.44093694501017,F4
Electrode,60.76851212562573,50.82017617415708,13.938957766095491,F6
Electrode,62.10156549745126,49.1595766323335,-14.491980762318518,F8
Electrode,50.069110202866945,44.647424585786865,-43.97030371380749,F10
Electrode,-59.49116580445852,27.53160294358854,-44.89895721224136,FT9
Electrode,-73.38947037481951,28.667011695237203,-15.779742706459633,FT7
Electrode,-71.85603472303514,27.88891747956846,20.29048086539073,FC5
Electrode,-55.72412648678102,25.926420567797557,50.723330504334264,FC3
Electrode,-29.51814524227152,23.305271323928533,71.42816646887665,FC1
Electrode,1.1909407688910143,22.10497208922655,76.72074649515267,FCz
Electrode,32.35503934366752,23.453120042373186,69.76338061633939,FC2
Electrode,59.14929289674767,25.48442166162173,47.6425868542698,FC4
Electrode,73.62977696366522,26.869603285048775,15.626064383732365,FC6
Electrode,71.87211183841322,27.943959157954637,-20.35416172285942,FT8
Electrode,59.693035228328355,25.71010284604192,-47.17313986315361,FT10
Electrode,-62.43883683466718,8.507004407192314,-49.15540030536685,T9
Electrode,-77.72119225450481,4.526095392156289,-20.11508485593991,T7
Electrode,-78.43940281500072,0.9376146549059095,18.823673294332366,C5
Electrode,-60.814272550684876,-2.665508200965669,52.49495772726414,C3
Electrode,-31.15328862396283,-5.574583589504403,73.01453105943618,C1
ReferenceElectrode,1.3502851674206686,-6.860847657215139,79.87816974413651,Cz
Electrode,35.08978184658927,-5.7825675208331635,71.21019780972502,C2
Electrode,64.36600286752848,-3.419857463508045,48.2734617226923,C4
Electrode,79.31419936672557,-0.37197819584578395,14.163841477304157,C6
Electrode,76.49153480159471,2.963811179520624,-24.65184346551956,T8
Electrode,60.743671963490456,8.178455418259848,-51.64394360683015,T10
Electrode,-63.54429641007066,-11.178767524547535,-46.12215273781029,TP9
Electrode,-75.01628836194992,-17.645441671843564,-22.866379750342706,TP7
Electrode,-74.97296314477529,-26.08108390637748,12.977939854837512,CP5
Electrode,-57.90259249131497,-30.72994210448612,45.219351649112895,CP3
Electrode,-29.877831623873814,-34.07311349866641,66.01743660724536,CP1
Electrode,1.215615632762928,-35.17912254550926,72.24925758530163,CPz
Electrode,34.400193074684125,-33.86919821612967,63.631254736481246,CP2
Electrode,60.83939273669752,-31.8088034170388,40.98389394255465,CP4
Electrode,74.9111283769472,-27.036987002476465,8.260287791011768,CP6
Electrode,73.06242858224768,-19.33830732723485,-26.686927671701365,TP8
Electrode,59.89463363848874,-13.808869380250258,-51.09743497373512,TP10
Electrode,-53.3708980039697,-28.439563024943876,-51.904181617816086,P9
Electrode,-64.94898416155888,-40.57421779953937,-24.27698095796407,P7
Electrode,-63.08850835316771,-49.23247043879356,4.177777834759787,P5
Electrode,-49.36003011368701,-55.52337844682221,29.84183335855205,P3
Electrode,-25.49482361426595,-59.27827111597945,47.042556484908935,P1
Electrode,1.0637862558256566,-60.57694466725142,52.360560140622326,Pz
Electrode,29.240734501959018,-58.553783440647095,45.393513510287406,P2
Electrode,51.20291826290034,-55.79751327599072,26.87829457629376,P4
Electrode,62.186049990244236,-49.995165374414874,-0.06834864771025195,P6
Electrode,62.61824328746851,-40.95854470505179,-28.14274827218389,P8
Electrode,50.24003763121521,-29.362255383011995,-54.86947703302274,P10
Electrode,-39.970617858159606,-45.94133248112985,-52.31278265092409,PO9
Electrode,-48.48475880932327,-59.12125531839388,-24.2122095252958,PO7
Electrode,-44.710541133202554,-65.72839159864675,-7.450512889534629,PO5
Electrode,-34.623653120048004,-71.65852365328658,7.057806380715105,PO3
Electrode,-18.265099551710605,-75.9956957176478,16.19042651208486,PO1
Electrode,0.3967742715342766,-77.80973910725666,20.148829409134812,POz
Electrode,19.683881022251907,-76.50678923437897,14.759210158667095,PO2
Electrode,34.658679911353595,-71.9266563618744,3.8489046863804752,PO4
Electrode,44.587773453620954,-66.2178310057228,-10.43625522243029,PO6
Electrode,46.159220547932684,-58.50367923544035,-26.90298301661955,PO8
Electrode,37.20664477156078,-45.300524266424006,-54.954053490017806,PO10
Electrode,-26.627028626058916,-72.09412350485378,-22.230066314380966,O1
Electrode,-0.4718333462929545,-77.4389331828137,-18.428494509396845,Oz
Electrode,25.605688928789828,-72.16497042386094,-23.816907249670187,O2
Electrode,-23.077943926121435,-56.66764699768904,-51.22019286138199,I1
Electrode,-1.0959813030714454,-63.73915061263267,-49.405480533302104,Iz
Electrode,20.628782888089702,-57.45093049125266,-51.98627609940189,I2
Electrode,-35.615805812632644,69.59631146719276,-17.712378917331854,AFp9h
Electrode,-32.74785691247703,73.1591364044811,2.1589128411576723,AFp7h
Electrode,-24.79080237288936,75.817518298818,9.615777039005145,AFp5h
Electrode,-15.600237914263014,76.52949071303199,16.506031069705397,AFp3h
Electrode,-5.544775840878851,76.58452219426123,21.973343197702658,AFp1h
Electrode,6.145880449303767,76.45881145083534,21.67209022165684,AFp2h
Electrode,16.081916266882416,76.40736851570507,16.7671510915181,AFp4h
Electrode,24.53348437922586,75.44349833290858,8.190734945519063,AFp6h
Electrode,32.55653303541385,73.45471315076907,0.14924154796802147,AFp8h
Electrode,34.18650371479947,69.55211645412491,-19.45083462378301,AFp10h
Electrode,-52.66960825030884,56.77929796548725,-23.567982858022855,AFF9h
Electrode,-53.46292734468574,59.347336049305156,4.341640721805005,AFF7h
Electrode,-45.195987487414904,60.945623513148156,25.816727828250436,AFF5h
Electrode,-30.003459486018897,61.11728146233999,42.74731140537592,AFF3h
Electrode,-9.68396280512876,61.4315668724805,51.273418090814346,AFF1h
Electrode,12.1944462837902,60.79577338618412,50.87914197871248,AFF2h
Electrode,32.00806957129415,60.54681795901457,40.83094959024089,AFF4h
Electrode,46.64012184853479,60.80992439955629,22.862332368694638,AFF6h
Electrode,54.33259303842659,59.612129800712026,0.9405553526299952,AFF8h
Electrode,51.34688129354729,56.075217695702946,-26.51288710370613,AFF10h
Electrode,-64.06942006396149,38.22458453478037,-29.924716047040874,FFT9h
Electrode,-68.51158555421026,40.3665230435239,3.8522342426582106,FFT7h
Electrode,-59.503026852539534,39.15499328432958,34.039997672660256,FFC5h
Electrode,-39.64497729873037,37.997368523407985,58.29646855892313,FFC3h
Electrode,-12.36937431150145,36.247637040205895,70.29436852581735,FFC1h
Electrode,15.865736169800059,36.13670598910414,69.10542588173742,FFC2h
Electrode,42.836758389730875,38.270624829736434,55.355817042048386,FFC4h
Electrode,62.24921672784706,39.3507372268713,30.0813701749818,FFC6h
Electrode,69.5484912755313,39.69434779200044,-1.0442694218452573,FFT8h
Electrode,62.72181700094383,36.545925756849535,-34.42157425011238,FFT10h
Electrode,-69.03286832613875,17.58802797135849,-34.78632114244554,FTT9h
Electrode,-78.66031695996796,16.45955081469559,1.60600195536448,FTT7h
Electrode,-69.59125706562986,12.804921636227975,37.62917777692186,FCC5h
Electrode,-46.19558577605501,10.167348617314522,64.86825378153029,FCC3h
Electrode,-14.73162439416053,7.950621512651464,77.94854566943158,FCC1h
Electrode,17.77604756462984,8.09967620063959,77.59925096101641,FCC2h
Electrode,49.52071975189734,9.899550302925723,62.22329919351073,FCC4h
Electrode,72.36716291531266,11.74152389777026,33.233241875161,FCC6h
Electrode,78.08037757882262,15.10757380618382,-3.6894312203357837,FTT8h
Electrode,68.50243894247471,15.895788921035766,-38.98040729927203,FTT10h
Electrode,-71.14523002761962,-6.744126668683807,-35.59370339533437,TTP9h
Electrode,-79.57461547693795,-10.270083987241689,-2.6689108742601757,TTP7h
Electrode,-70.72946249492158,-14.922031491080565,33.556811889962404,CCP5h
Electrode,-47.322924375008284,-18.746512422565722,62.30936959097688,CCP3h
Electrode,-14.88860292730229,-20.556244957820354,76.29496884630194,CCP1h
Electrode,18.96333245027087,-21.085084516440816,75.30611131427482,CCP2h
Electrode,50.51894904049043,-19.633226736152128,58.60416186942002,CCP4h
Electrode,72.56512077599965,-16.097067300465717,29.437715650973892,CCP6h
Electrode,79.18439018613685,-12.03889240141115,-7.771539787494105,TTP8h
Electrode,69.4693628230374,-9.551658257450306,-38.65159769410823,TTP10h
Electrode,-64.28646010010924,-25.84097323480867,-39.17427058225306,TPP9h
Electrode,-71.95726049316423,-34.78172585773714,-7.450633814891255,TPP7h
Electrode,-64.03978075145278,-41.70791465778063,25.014312935909892,CPP5h
Electrode,-41.72259965716121,-46.24989014737082,50.008745635619995,CPP3h
Electrode,-13.055725480995207,-48.04953062965274,62.519391398796316,CPP1h
Electrode,17.459595971963644,-47.95275912028747,61.54773262093566,CPP2h
Electrode,45.51509401953498,-45.573191676298066,46.63708472616791,CPP4h
Electrode,65.28893103237385,-42.490585145567245,20.9061955537275,CPP6h
Electrode,70.28096105369688,-35.43197657748313,-12.084154817508283,TPP8h
Electrode,61.926650464437586,-26.890977027603125,-42.59114534713674,TPP10h
Electrode,-52.92922557806338,-45.345918792664854,-40.52858432388619,PPO9h
Electrode,-57.52080853332374,-54.68767135588324,-12.866510890251464,PPO7h
Electrode,-50.042177685172454,-61.1201932553503,9.582008710908779,PPO5h
Electrode,-33.59061442656983,-67.14296478628039,26.863995118215076,PPO3h
Electrode,-10.836481648984982,-70.11341811756452,35.93726457426665,PPO1h
Electrode,13.516514250654216,-69.97300517773098,36.292260899675995,PPO2h
Electrode,35.732817228331854,-67.40953086060904,25.567571584831793,PPO4h
Electrode,50.07228339058156,-61.92196703645342,6.1828697078565815,PPO6h
Electrode,55.680323242944944,-54.89698497658643,-16.553643135023492,PPO8h
Electrode,50.45839335783428,-45.57396662995578,-43.06807369583058,PPO10h
Electrode,-35.574650172724205,-59.97746321409106,-39.20266317053827,POO9h
Electrode,-36.22562734233645,-68.91854331492743,-18.012783203153806,POO7h
Electrode,-29.935063198798005,-73.80722226616861,-8.505858591952702,POO5h
Electrode,-19.054951724009502,-77.72519595367648,-2.3083337917950266,POO3h
Electrode,-6.805560077024744,-79.80257711450759,0.2722014359609888,POO1h
Electrode,6.508179060524791,-79.69940001544721,-1.4243212860611703,POO2h
Electrode,19.04395054058893,-77.59969263609176,-4.56044977785733,POO4h
Electrode,29.114249120868113,-74.02597507121587,-11.202056237694922,POO6h
Electrode,35.53004861796233,-69.18788471828454,-20.263340517779096,POO8h
Electrode,32.87772792326699,-59.77310928222649,-41.20181705571066,POO10h
Electrode,-13.376584774657603,-70.06336827414671,-36.9510568358185,OI1h
Electrode,11.74360543919705,-70.36357715437461,-37.63179818606319,OI2h
Electrode,-12.95479315012005,78.90151086805925,3.490435947177471,Fp1h
Electrode,12.497226212610485,79.01358091696314,2.716772554975882,Fp2h
Electrode,-45.09147156640762,63.2822825686982,-21.204888937627803,AF9h
Electrode,-43.778615296242926,67.23106947636121,3.7933459713189497,AF7h
Electrode,-35.62311417960297,69.74914477930126,18.703386423434516,AF5h
Electrode,-23.608006232971697,69.48523087653302,31.98210839508235,AF3h
Electrode,-7.8131031462489045,69.64643057125888,38.436746765303795,AF1h
Electrode,9.40701024225214,70.19629778322131,38.3688862551481,AF2h
Electrode,25.0548142554323,69.32953871464689,31.036115705799077,AF4h
Electrode,35.8361239707081,68.93412562099866,16.77914827663067,AF6h
Electrode,43.85513162214354,67.11767654312696,1.3077028357991995,AF8h
Electrode,44.18963353859282,62.64651660809859,-23.195699240402124,AF10h
Electrode,-59.11890178677014,48.06417272773469,-26.806002216567904,F9h
Electrode,-61.800424377704594,50.33467750411067,4.384189479956724,F7h
Electrode,-52.78644091978329,50.42101919674325,30.474059518524438,F5h
Electrode,-35.2539430676648,50.109779554339376,51.64282865199118,F3h
Electrode,-11.123893776842978,49.61127758840616,61.87360322140023,F1h
Electrode,14.414821366728226,49.140519003246595,60.963160902740974,F2h
Electrode,38.1188080973929,50.20769672816446,48.78557769365024,F4h
Electrode,54.91433302258443,50.95470197229963,26.355721629642424,F6h
Electrode,62.89304561105058,50.48432619451444,-0.19065895055720095,F8h
Electrode,57.66924862390275,46.56893479837265,-31.09686545404881,F10h
Electrode,-66.72221184630433,28.79162963604928,-32.47274913889298,FT9h
Electrode,-74.41779498601474,28.75134963702963,2.9877176074984826,FT7h
Electrode,-65.82476630640046,26.844648350443272,36.875820998587734,FC5h
Electrode,-43.49102942701001,24.47542740027378,62.665220530041005,FC3h
Electrode,-13.751087969162517,22.14402862776218,75.55674925696111,FC1h
Electrode,16.79938762875728,22.50356695945942,75.01609300327192,FC2h
Electrode,46.7235015246826,24.54921607901607,60.1383279232871,FC4h
Electrode,68.5863341772029,25.949594381625378,32.84769530311578,FC6h
Electrode,74.65597427574114,27.767425377863663,-2.46183389706059,FT8h
Electrode,66.43754279976814,26.543139637125776,-36.401100635257116,FT10h
Electrode,-71.37348459867201,4.460460191080696,-35.73611371012275,T9h
Electrode,-80.17213506124638,2.9756769965342427,-0.6828190805890686,T7h
Electrode,-70.90385199623371,-0.8339813058122605,36.44390502989669,C5h
Electrode,-47.10969275266105,-4.1876763722820325,65.13873454831521,C3h
Electrode,-14.645522593199125,-6.434749650081008,78.18464578582719,C1h
Electrode,18.759857234210052,-6.558103776957918,77.74050628960553,C2h
Electrode,50.57341620769144,-4.694060931759287,61.3785669197398,C4h
Electrode,73.55979379143366,-2.1102883046461676,31.88371598747708,C6h
Electrode,79.51059716433771,1.3767134812029642,-5.772606586189847,T8h
Electrode,68.92332081031151,4.421611602934787,-41.09050958303496,T10h
Electrode,-70.0541049255389,-14.641480908981858,-35.183386652579934,TP9h
Electrode,-76.92299599219142,-23.07608917821758,-5.3317698422879225,TP7h
Electrode,-68.22575004866921,-28.645517475740043,29.986153539239112,CP5h
Electrode,-45.09882276079037,-32.45861790392895,57.351071886732264,CP3h
Electrode,-13.908301496347885,-34.61254800349202,71.1965319203057,CP1h
Electrode,18.607660843728222,-34.41035082979823,69.66882000140316,CP2h
Electrode,48.45732964126211,-32.837317619626006,53.95790184362575,CP4h
Electrode,70.00745944338317,-29.669185118457452,25.58804772643885,CP6h
Electrode,75.60867647868223,-23.510957644351308,-9.897118824413578,TP8h
Electrode,65.90955034473545,-18.312238164963624,-40.85122225588849,TP10h
Electrode,-59.68276160576113,-35.74343269947985,-40.33960099223678,P9h
Electrode,-65.16756061193794,-45.36484090851155,-10.384736501601306,P7h
Electrode,-57.873472831466565,-52.76432699110602,17.86548691745873,P5h
Electrode,-37.89714222182701,-57.68882633289316,39.55942119538636,P3h
Electrode,-11.75991882457202,-59.892140709499955,51.05591154864097,P1h
Electrode,16.259025872320766,-60.003523227916254,50.65709528545103,P2h
Electrode,41.25647461090893,-57.780686032059236,37.34871652310242,P4h
Electrode,58.08169779517525,-52.81499916387977,14.074379982674634,P6h
Electrode,63.83685275634541,-45.59746296358389,-14.383185855669634,P8h
Electrode,56.89665177668963,-36.512789900499186,-43.441008216056105,P10h
Electrode,-44.60153311852827,-53.32066021676532,-40.28928118567865,PO9h
Electrode,-47.367341982219166,-63.081240126933324,-15.979395161302708,PO7h
Electrode,-40.54890536664799,-68.69379636156614,0.22360018752407892,PO5h
Electrode,-27.067338500275266,-74.0462273557591,12.093930343752763,PO3h
Electrode,-9.112601049688944,-77.23310280866457,18.916339878994197,PO1h
Electrode,10.130474069741783,-77.69069801009738,17.567555116504373,PO2h
Electrode,28.15808567116443,-74.85646123985623,10.233793915585412,PO4h
Electrode,40.922762188882466,-69.26756242468723,-2.470289098148479,PO6h
Electrode,45.50411680508601,-62.333360567331965,-18.692800709852143,PO8h
Electrode,42.429694354015304,-52.85007095813479,-42.37808537330641,PO10h
Electrode,-14.08617654451132,-76.22272223936939,-20.50559038166991,O1h
Electrode,13.017062245560135,-75.43099813709338,-21.254289466101085,O2h
Electrode,-11.955725934502285,-61.288360480904615,-50.84025414328585,I1h
Electrode,11.215790561150238,-61.09977582285741,-51.451430731418014,I2h
Electrode,-28.827791140623102,67.26901760078448,-32.98111103405015,AFp9
Electrode,-36.094255779680445,71.49367708366677,-1.8301760633321678,AFp7
Electrode,-29.05347029759843,74.52057250436133,5.924258247187153,AFp5
Electrode,-20.523342895832993,76.63269484370986,12.81194381364988,AFp3
Electrode,-10.786953098326602,76.41438096344842,20.204100125454378,AFp1
Electrode,-0.08967472340995819,76.23081229702706,22.71176827846924,AFpz
Electrode,11.541290611457523,76.71752870721684,20.59149302676211,AFp2
Electrode,20.70103551294072,75.9271656542301,12.68682026858561,AFp4
Electrode,28.767268543477805,74.38299374010928,4.170080139400184,AFp6
Electrode,35.35673898873577,71.47616523741185,-4.003617496065329,AFp8
Electrode,28.018740150069505,66.44149554855015,-35.28912373130227,AFp10
Electrode,-45.88662509866559,53.022787761213216,-38.23486434662422,AFF9
Electrode,-54.68214017311492,58.29712781887041,-7.205375137620285,AFF7
Electrode,-49.760564431885705,60.56442962989881,15.02997316747572,AFF5
Electrode,-38.50436859018063,61.32466831198996,35.196503049715375,AFF3
Electrode,-20.22584139690745,60.847523298417414,48.13086726509448,AFF1
Electrode,0.665432371662217,60.901079618809156,52.15077504393971,AFFz
Electrode,22.76150611099568,60.63958719611473,47.17602661714789,AFF2
Electrode,39.95141830864105,60.45795913867654,32.35364672557245,AFF4
Electrode,51.448896486408785,60.69442010983815,12.147144436420536,AFF6
Electrode,54.74854924676156,58.311342717900125,-10.998312363086484,AFF8
Electrode,45.64507517683464,51.847905024997104,-42.21629987155155,AFF10
Electrode,-56.06107545222362,38.10502240635496,-42.132602478506215,FFT9
Electrode,-68.62024011078007,39.95894311391867,-12.796115140870425,FFT7
Electrode,-65.7537505193738,39.729400672114,19.847916445934732,FFC5
Electrode,-50.6881626811835,38.53154280672276,47.15894120097265,FFC3
Electrode,-26.60565509194533,37.50115356549975,66.18595252936747,FFC1
Electrode,1.2331807420454586,36.1524885705677,71.2624059968727,FFCz
Electrode,29.718418730553044,36.932116290041435,63.55942087335403,FFC2
Electrode,53.68574711099234,38.929697366761346,43.81141019887454,FFC4
Electrode,67.82133509113724,39.81719650194465,15.118688115116202,FFC6
Electrode,67.5827966002282,38.8554983813472,-17.67556660229282,FFT8
Electrode,55.06533094741383,35.826414397174865,-45.82468627005855,FFT10
Electrode,-61.653012572687686,18.175287807368175,-46.426947723078975,FTT9
Electrode,-76.05177660931615,16.66477725170867,-18.08585360016731,FTT7
Electrode,-76.51363515832911,15.111343900541655,20.459417300380437,FCC5
Electrode,-59.273522405163824,11.438354425867042,52.41024756504029,FCC3
Electrode,-30.85806880398897,8.804725668001161,73.26931105326413,FCC1
Electrode,1.3902759744578916,7.492695691554173,79.54238088872876,FCCz
Electrode,34.16128434706136,9.028502981929408,71.52837068305993,FCC2
Electrode,63.05966802870536,11.476424211314022,49.41280380411133,FCC4
Electrode,77.26005840288072,13.589673203819295,14.89391872036585,FCC6
Electrode,75.64112292227833,15.560484041507427,-22.6394785459857,FTT8
Electrode,61.633623367932316,15.663872135046923,-50.29088086589704,FTT10
Electrode,-63.13207606012317,-2.495510205674286,-47.70982017061882,TTP9
Electrode,-77.19844362264311,-7.253089570528565,-21.001906525649865,TTP7
Electrode,-77.6317967217483,-12.926177572148154,16.021811838834395,CCP5
Electrode,-60.581168568659585,-17.083439154342926,49.79656267967838,CCP3
Electrode,-31.616414313346297,-19.82974231785377,70.66309823837649,CCP1
Electrode,1.2924782333066072,-21.24177702198891,77.59893335517408,CCPz
Electrode,35.41392625783217,-20.656909821203005,68.89575404824608,CCP2
Electrode,63.271739813768946,-17.92395352523353,45.30920441049833,CCP4
Electrode,78.18335970936783,-14.379111299054232,11.840765245760718,CCP6
Electrode,76.23069477618996,-7.982332668683158,-25.89278396003472,TTP8
Electrode,61.745636086567096,-2.1985496766705763,-50.15973803280288,TTP10
Electrode,-60.56759876225558,-17.509146974778844,-48.360498155991834,TPP9
Electrode,-70.42294817185636,-30.01820233269588,-23.847238585869146,TPP7
Electrode,-69.81773491990415,-38.51097798050891,9.051754988226875,CPP5
Electrode,-54.57179681990651,-44.25328747663372,38.947109566625755,CPP3
Electrode,-28.215941011995156,-47.044175401643216,58.643103118838845,CPP1
Electrode,1.1212151976277074,-48.355783932515564,63.86197288577241,CPPz
Electrode,31.894200494612775,-47.01709377561493,55.33173018546964,CPP2
Electrode,56.93450258242016,-44.52264590066554,35.235328006696335,CPP4
Electrode,69.13108700543202,-38.88983449122811,4.7976437115736115,CPP6
Electrode,68.11398247264665,-30.52712060727536,-27.961703364943418,TPP8
Electrode,54.8975226156915,-20.894343380840198,-53.72346639157269,TPP10
Electrode,-47.51112700129667,-36.80977856012135,-53.065354241713386,PPO9
Electrode,-57.44525217673646,-50.38416805608445,-24.381746585332515,PPO7
Electrode,-54.42855562790038,-58.1405727958314,-1.6132818434101504,PPO5
Electrode,-42.8833047192785,-63.98539231022001,18.796077686400952,PPO3
Electrode,-22.804376608113,-69.13704607641607,32.985919637485345,PPO1
Electrode,0.8105960454296972,-70.31898275307641,37.3144883066452,PPOz
Electrode,25.391110749378328,-69.60746045460223,32.246312241669145,PPO2
Electrode,43.78649044587357,-64.58675475128409,16.425612618188236,PPO4
Electrode,54.36518757402249,-58.24848510165162,-4.714449838944809,PPO6
Electrode,55.349326611742875,-50.53736622570456,-27.853104758726577,PPO8
Electrode,44.5771607638587,-38.47338495917113,-54.48295270768931,PPO10
Electrode,-32.26698022281733,-51.50876811808183,-51.86550535453296,POO9
Electrode,-38.28828735290721,-66.43602091308901,-23.39971316556182,POO7
Electrode,-33.35199134155201,-71.56029491211632,-13.14274136086739,POO5
Electrode,-24.846190159846966,-76.28372699799333,-5.554496574356037,POO3
Electrode,-13.374472146273641,-78.76263375420443,0.5390412556846524,POO1
Electrode,0.03483036378097992,-80.04805964374111,0.08851192990664991,POOz
Electrode,13.064707340681249,-78.98535964095427,-2.293799830139183,POO2
Electrode,24.478908396146558,-76.05790422727306,-7.198700560463601,POO4
Electrode,33.209751336052776,-71.80808734601516,-14.950534964677821,POO6
Electrode,36.623449060611996,-65.98586783900049,-25.56868008117584,POO8
Electrode,29.754050134695007,-52.14155049924964,-52.8247589596326,POO10
Electrode,-24.798888135425127,-65.71891964799629,-38.13698037616738,OI1
Electrode,-0.8999692598804898,-72.42289756046176,-34.9938996953901,OIz
Electrode,23.105729364909855,-66.28393275187769,-40.091789634446876,OI2
Electrode,-77.72119225450481,4.526095392156289,-20.11508485593991,T3
Electrode,-64.94898416155888,-40.57421779953937,-24.27698095796407,T5
Electrode,76.49153480159471,2.963811179520624,-24.65184346551956,T4
Electrode,62.61824328746851,-40.95854470505179,-28.14274827218389,T6
Electrode,-55.028197975871834,-4.1226900512526425,-57.281841131717435,M1
Electrode,45.898783818021776,-5.212550907359678,-65.4872050638322,M2
Electrode,-55.80916470444914,0.6085231059832661,-56.693756539521935,A1
Electrode,51.88521051936035,2.666214671560642,-60.6807841561902,A2
Fiducial,-0.17360079590553595,74.55571916403169,-29.179290680392988,Nz
Fiducial,-1.0959813030714454,-63.73915061263267,-49.405480533302104,Iz
Fiducial,-61.45439700042069,5.314619825820201,-50.286941775613045,LPA
Fiducial,62.03733007658098,3.961361319527085,-50.08568147732535,RPA
