ReferenceElectrode,-0.6317729301940194,15.60021570328339,78.36860515920488,reference
Electrode,0.48977546986991305,0.6328729941673039,80.4585863655292,1
Electrode,0.10909711312978221,30.44639525864561,73.65300522623241,2
Electrode,29.215405571589113,14.29555103546622,72.84925404025581,3
Electrode,28.46018862210267,-16.693943542200852,73.26975038917006,4
Electrode,-0.006358842400137732,-29.079843546585607,74.95921924537923,5
Electrode,-26.09053061942738,-13.660178372023578,73.6210152991539,6
Electrode,-27.919957639467636,16.152422568318688,73.58550782173103,7
Electrode,-0.5131891777277905,55.784955254277584,57.50691984977339,8
Electrode,31.879565581375044,45.500690086096235,57.05793582051466,9
Electrode,52.692305656230445,23.49052882319286,55.75827275077211,10
Electrode,58.82422468229425,-4.641103433485821,53.858071938545244,11
Electrode,49.22297152411151,-28.975431214144184,56.11916639631639,12
Electrode,28.379606678632303,-47.86444939774658,56.7745088705343,13
Electrode,0.0668487715416044,-54.15142795329993,58.97723913749172,14
Electrode,-28.364408150148098,-46.766420309979786,58.86370674200646,15
Electrode,-49.32671504966724,-27.16288643877206,56.9443191375194,16
Electrode,-58.03888487970793,-1.222694590775394,55.49344755553862,17
Electrode,-53.01011916258692,25.182960175450233,54.15343929549692,18
Electrode,-32.07894298395884,48.027741765576714,55.615590919952226,19
Electrode,0.8938272417364939,72.76404303437347,33.24325070614904,20
Electrode,32.5206994332701,66.23814805620322,31.302638141102484,21
Electrode,57.359436871009294,46.51530058276943,29.291707828817877,22
Electrode,72.62406514124427,19.54263919500178,27.473005209927372,23
Electrode,74.13114056764778,-10.606468808978832,28.39862698380587,24
Electrode,64.8056026254358,-37.248450341371004,30.04054909147908,25
Electrode,46.5750514297166,-56.895051445509836,33.13157230802699,26
Electrode,15.505970226423385,-71.71556650686041,32.89080556000004,27
Electrode,-19.027316286576827,-69.81856830699361,33.47624629982395,28
Electrode,-47.334427857483895,-55.434022281334656,33.086415035911266,29
Electrode,-65.61914239505188,-32.28325711298028,32.26265271391513,30
Electrode,-73.78966167711062,-4.56378592391225,30.50667442294447,31
Electrode,-70.92315967572678,25.01718336695602,27.6670469064037,32
Electrode,-53.98495125573028,51.49171320749799,26.317207619704387,41
Electrode,-30.27457387789485,68.47570122980747,29.012321500110755,42
Electrode,-0.8201651503335512,79.78195019596477,8.382817932235145,43
Electrode,31.228317662545255,73.36028818210647,5.393773855921263,44
Electrode,58.0213837058444,56.303037716977364,-1.0023321526900648,45
Electrode,73.14476612329884,31.836517246337923,-2.401410316675559,46
Electrode,79.61576581287876,1.9651972261388444,-4.09602738780116,47
Electrode,74.91468300371398,-27.72223028386805,-2.1537589455000514,48
Electrode,58.48310979321169,-54.53762172298853,-0.060624641216434905,49
Electrode,30.297892922563356,-74.12144418751052,3.049738385073167,50
Electrode,-2.3095854451018427,-79.9998049026688,-0.5053485831867892,51
Electrode,-33.5134079812,-72.89271666445707,3.055515929392084,52
Electrode,-60.08458626523789,-53.037245296682684,2.2495394124012384,53
Electrode,-75.91471972535703,-26.80727132004649,1.4346906138331712,54
Electrode,-80.17123807908507,2.870181353434259,-1.1142408934429335,55
Electrode,-73.24139560731895,32.35521497623531,-1.112498849180755,56
Electrode,-56.222367594122474,56.862880982139544,-2.10286807408413,57
Electrode,-30.609439446006824,74.20320545976483,1.5042977712461028,58
Electrode,62.799509011370326,39.06701826120626,-30.081258920470177,59
Electrode,71.73846520577999,13.81793927982,-33.54117174781302,60
Electrode,70.61007165389445,-24.32343318351978,-28.396915710892635,61
Electrode,55.835546247906535,-49.623908127365674,-28.867735223008076,62
Electrode,29.529781540638705,-68.37862154444517,-27.89188109358834,63
Electrode,0.5480890709986055,-74.17339624091116,-29.21425800443725,64
Electrode,-30.16896636111985,-68.69621575884527,-27.979679620278244,65
Electrode,-57.03088659295168,-49.22815961486589,-28.166644844722203,66
Electrode,-70.97782058796639,-24.485976939562292,-28.13651787420092,67
Electrode,-72.38484289092496,10.289011903391911,-32.24438382657725,68
Electrode,-63.951655728651666,38.19436632530325,-30.164132713944674,69
Electrode,-59.39113343709805,16.2621780925495,-49.90657727343141,70
Electrode,61.18617515096907,16.890967785548362,-50.15072544116368,71
