Electrode,-22.57145109642959,77.54449917902033,1.1187141954160622,Fp1
Electrode,26.465600854835667,75.88076409343637,1.34841706054016,Fp2
Electrode,-1.1138203131535107,53.48604792849528,59.41763685433703,Fz
Electrode,-39.670285080781554,59.96990760993872,34.16966437072083,F3
Electrode,41.546302061184036,59.40646733343307,34.897753826377226,F4
Electrode,-63.84204112437891,47.637273921022135,-5.83144942813839,F7
Electrode,65.0512362592346,46.43602330894476,-6.933683050058047,F8
ReferenceElectrode,-0.218247073901348,0.7988144438405094,80.70658903660717,Cz
Electrode,-56.93354604206787,2.554790480363032,56.269725658058,C3
Electrode,55.872808999892406,0.7758850993421884,56.438113245389225,C4
Electrode,-78.98002233180635,0.5883110626338373,-13.707131203562227,T7
Electrode,79.1230534193794,-4.159476468783215,-11.219418581975606,T8
Electrode,-0.7846702605087263,-45.492226908430595,65.50501770689027,Pz
Electrode,-41.3496994646902,-54.25559373705265,42.53666265356704,P3
Electrode,38.82244697398815,-54.40445887394233,44.106135790551534,P4
Electrode,-67.93000562473598,-41.79629579412721,-5.167368148379801,P7
Electrode,66.40271380647414,-44.95107663974412,-1.436021908129459,P8
Electrode,-29.186010343482096,-74.35491452164523,7.051424378590031,O1
Electrode,25.41701771635641,-74.89296191118756,9.12550135474897,O2
Fiducial,-0.35895728756326184,74.51437851879248,-30.696070909887297,Nz
Fiducial,-0.09683969245441126,-72.89370777030848,-32.740385402162886,Iz
Fiducial,-68.11175815663152,2.4816033912483,-42.59966703703585,LPA
Fiducial,68.21323212334929,2.2380383261045242,-41.37998298985744,RPA
