View""{
SP(-25.6179044567284, 75.38647758661583, -5.501923438747995){0};
T3(-25.6179044567284, 75.38647758661583, -0.5019234387479949, 0){"Fp1"};
SP(-0.7061142004451066, 79.74996143834491, -2.5729304098944557){0};
T3(-0.7061142004451066, 79.74996143834491, 2.4270695901055443, 0){"Fpz"};
SP(24.163684861980723, 76.07856660477705, -5.428721493013629){0};
T3(24.163684861980723, 76.07856660477705, -0.4287214930136294, 0){"Fp2"};
SP(-47.083981630033584, 64.69040181576081, -8.454890897337963){0};
T3(-47.083981630033584, 64.69040181576081, -3.454890897337963, 0){"AF7"};
SP(-31.094442867035113, 72.25339597097549, 16.847509441986528){0};
T3(-31.094442867035113, 72.25339597097549, 21.847509441986528, 0){"AF3"};
SP(-0.9137766915983319, 74.57817252504235, 27.79040281130319){0};
T3(-0.9137766915983319, 74.57817252504235, 32.79040281130319, 0){"AFz"};
SP(29.616418489241234, 71.99968444731807, 17.798270833971984){0};
T3(29.616418489241234, 71.99968444731807, 22.798270833971984, 0){"AF4"};
SP(46.442874267888016, 64.77870791966792, -7.44964108057763){0};
T3(46.442874267888016, 64.77870791966792, -2.4496410805776296, 0){"AF8"};
SP(-55.55900484236877, 42.58869680043578, -39.3969622338871){0};
T3(-55.55900484236877, 42.58869680043578, -34.3969622338871, 0){"F9"};
SP(-63.58407933183878, 48.021287570585486, -10.220989741674751){0};
T3(-63.58407933183878, 48.021287570585486, -5.220989741674751, 0){"F7"};
SP(-57.7863996728917, 52.43047800487495, 13.42424966295907){0};
T3(-57.7863996728917, 52.43047800487495, 18.42424966295907, 0){"F5"};
SP(-46.003620849241734, 56.78414564218498, 33.766896516299305){0};
T3(-46.003620849241734, 56.78414564218498, 38.766896516299305, 0){"F3"};
SP(-25.696980853075534, 58.669178485408494, 48.42586814136422){0};
T3(-25.696980853075534, 58.669178485408494, 53.42586814136422, 0){"F1"};
SP(-0.8020639631789988, 58.967958988265764, 54.35138637559074){0};
T3(-0.8020639631789988, 58.967958988265764, 59.35138637559074, 0){"Fz"};
SP(24.37322170981163, 58.30552171213103, 49.09451375979177){0};
T3(24.37322170981163, 58.30552171213103, 54.09451375979177, 0){"F2"};
SP(44.68546270541515, 55.84855205202942, 34.695908206420555){0};
T3(44.68546270541515, 55.84855205202942, 39.695908206420555, 0){"F4"};
SP(58.3035300587893, 53.259029977801426, 14.938840648018111){0};
T3(58.3035300587893, 53.259029977801426, 19.93884064801811, 0){"F6"};
SP(63.581744849728864, 48.39043464544388, -9.19586697664135){0};
T3(63.581744849728864, 48.39043464544388, -4.19586697664135, 0){"F8"};
SP(55.439333700136174, 43.17616229374557, -37.847948624966705){0};
T3(55.439333700136174, 43.17616229374557, -32.847948624966705, 0){"F10"};
SP(-63.481935682712376, 24.47872893597259, -41.34719566196622){0};
T3(-63.481935682712376, 24.47872893597259, -36.34719566196622, 0){"FT9"};
SP(-74.59111069262327, 27.06757076231041, -11.663492829874109){0};
T3(-74.59111069262327, 27.06757076231041, -6.663492829874109, 0){"FT7"};
SP(-70.74055324021431, 30.41427744934833, 19.549960482998102){0};
T3(-70.74055324021431, 30.41427744934833, 24.549960482998102, 0){"FC5"};
SP(-55.75026800039724, 32.40514336312842, 45.91586142577476){0};
T3(-55.75026800039724, 32.40514336312842, 50.91586142577476, 0){"FC3"};
SP(-31.74281074602647, 34.267842320168995, 65.51887336342463){0};
T3(-31.74281074602647, 34.267842320168995, 70.51887336342463, 0){"FC1"};
SP(-0.5911628231629624, 34.10421645875921, 72.15969436085516){0};
T3(-0.5911628231629624, 34.10421645875921, 77.15969436085516, 0){"FCz"};
SP(30.343447700073675, 33.630560984062235, 65.1611838858779){0};
T3(30.343447700073675, 33.630560984062235, 70.1611838858779, 0){"FC2"};
SP(55.45704800441897, 32.339593778262895, 47.32519871809451){0};
T3(55.45704800441897, 32.339593778262895, 52.32519871809451, 0){"FC4"};
SP(71.33941488285463, 29.962515372040976, 21.054114510228832){0};
T3(71.33941488285463, 29.962515372040976, 26.054114510228832, 0){"FC6"};
SP(74.19261161742139, 27.219353181648845, -10.44536879945279){0};
T3(74.19261161742139, 27.219353181648845, -5.44536879945279, 0){"FT8"};
SP(64.84733173063098, 24.609236920767277, -40.65348428059458){0};
T3(64.84733173063098, 24.609236920767277, -35.65348428059458, 0){"FT10"};
SP(-67.61855912871425, 5.1616479970131826, -41.98766475021315){0};
T3(-67.61855912871425, 5.1616479970131826, -36.98766475021315, 0){"T9"};
SP(-79.0919537577866, 4.130610735861451, -11.853281945630759){0};
T3(-79.0919537577866, 4.130610735861451, -6.8532819456307585, 0){"T7"};
SP(-77.92052814087884, 4.436653029396531, 20.4787665365257){0};
T3(-77.92052814087884, 4.436653029396531, 25.4787665365257, 0){"C5"};
SP(-62.50142617843055, 4.677897972768674, 49.75544576764084){0};
T3(-62.50142617843055, 4.677897972768674, 54.75544576764084, 0){"C3"};
SP(-35.63661985501996, 4.985773803445967, 71.60310794940065){0};
T3(-35.63661985501996, 4.985773803445967, 76.60310794940065, 0){"C1"};
SP(-0.9833909587596609, 4.929439318392143, 80.01972407056043){0};
T3(-0.9833909587596609, 4.929439318392143, 85.01972407056043, 0){"Cz"};
SP(33.86231202266861, 4.831699047781278, 72.29144786436464){0};
T3(33.86231202266861, 4.831699047781278, 77.29144786436464, 0){"C2"};
SP(61.68394922427151, 4.269932093146396, 51.49766551052114){0};
T3(61.68394922427151, 4.269932093146396, 56.49766551052114, 0){"C4"};
SP(77.16930542911598, 4.168206997772053, 21.83596346212359){0};
T3(77.16930542911598, 4.168206997772053, 26.83596346212359, 0){"C6"};
SP(79.19225351358438, 3.4063708254663414, -10.406426707208425){0};
T3(79.19225351358438, 3.4063708254663414, -5.406426707208425, 0){"T8"};
SP(68.55794584618698, 4.5531193792657465, -41.72997676085443){0};
T3(68.55794584618698, 4.5531193792657465, -36.72997676085443, 0){"T10"};
SP(-67.58150684842443, -15.670709648659958, -38.52095121385843){0};
T3(-67.58150684842443, -15.670709648659958, -33.52095121385843, 0){"TP9"};
SP(-76.86475968562269, -20.321645573881476, -11.651842076267313){0};
T3(-76.86475968562269, -20.321645573881476, -6.651842076267313, 0){"TP7"};
SP(-73.98278714177638, -22.43074184794358, 21.450373979490223){0};
T3(-73.98278714177638, -22.43074184794358, 26.450373979490223, 0){"CP5"};
SP(-58.40492620162584, -23.335957077094893, 49.48191010538776){0};
T3(-58.40492620162584, -23.335957077094893, 54.48191010538776, 0){"CP3"};
SP(-32.34944096081106, -24.695376011213, 68.42120487857294){0};
T3(-32.34944096081106, -24.695376011213, 73.42120487857294, 0){"CP1"};
SP(-0.8348034564415465, -25.220105298877765, 76.64867189592601){0};
T3(-0.8348034564415465, -25.220105298877765, 81.64867189592601, 0){"CPz"};
SP(31.408666993289152, -24.922395259980867, 69.93926664772697){0};
T3(31.408666993289152, -24.922395259980867, 74.93926664772697, 0){"CP2"};
SP(57.094598710504364, -23.865621333117847, 50.34258694495746){0};
T3(57.094598710504364, -23.865621333117847, 55.34258694495746, 0){"CP4"};
SP(73.38876156772552, -23.03278086266051, 22.888015247258974){0};
T3(73.38876156772552, -23.03278086266051, 27.888015247258974, 0){"CP6"};
SP(76.41061399986428, -20.83346931945655, -9.852611061777292){0};
T3(76.41061399986428, -20.83346931945655, -4.852611061777292, 0){"TP8"};
SP(68.47781769371541, -16.81473324099126, -37.540343648295504){0};
T3(68.47781769371541, -16.81473324099126, -32.540343648295504, 0){"TP10"};
SP(-58.64564366637583, -36.410216261130856, -41.59805356863443){0};
T3(-58.64564366637583, -36.410216261130856, -36.59805356863443, 0){"P9"};
SP(-67.03186911893354, -42.785713438824, -9.95957217064301){0};
T3(-67.03186911893354, -42.785713438824, -4.9595721706430105, 0){"P7"};
SP(-63.267482269387855, -46.96091607115191, 16.327968350463614){0};
T3(-63.267482269387855, -46.96091607115191, 21.327968350463614, 0){"P5"};
SP(-50.023005217234676, -49.98396721748501, 39.3264914315144){0};
T3(-50.023005217234676, -49.98396721748501, 44.3264914315144, 0){"P3"};
SP(-27.54769630450359, -51.51347830198868, 54.24330238102402){0};
T3(-27.54769630450359, -51.51347830198868, 59.24330238102402, 0){"P1"};
SP(-0.8280018382787631, -52.80560945124963, 60.26190544364091){0};
T3(-0.8280018382787631, -52.80560945124963, 65.26190544364091, 0){"Pz"};
SP(25.66669393670478, -52.12868434216129, 55.132412291225144){0};
T3(25.66669393670478, -52.12868434216129, 60.132412291225144, 0){"P2"};
SP(48.32879719268611, -49.667338871119675, 40.13266317555279){0};
T3(48.32879719268611, -49.667338871119675, 45.13266317555279, 0){"P4"};
SP(62.066952984843304, -47.33407282919884, 17.66747280980303){0};
T3(62.066952984843304, -47.33407282919884, 22.66747280980303, 0){"P6"};
SP(66.57104298966898, -42.84926008783169, -8.606966028631415){0};
T3(66.57104298966898, -42.84926008783169, -3.6069660286314154, 0){"P8"};
SP(59.15778155857385, -36.802491343702755, -40.0768548069913){0};
T3(59.15778155857385, -36.802491343702755, -35.0768548069913, 0){"P10"};
SP(-44.54347052523829, -54.34564918496684, -39.07188537458904){0};
T3(-44.54347052523829, -54.34564918496684, -34.07188537458904, 0){"PO9"};
SP(-50.05247292835786, -61.83905483421237, -7.356216931467419){0};
T3(-50.05247292835786, -61.83905483421237, -2.3562169314674186, 0){"PO7"};
SP(-33.96783307700468, -68.79457035391601, 21.50146161464689){0};
T3(-33.96783307700468, -68.79457035391601, 26.50146161464689, 0){"PO3"};
SP(-0.7455149166935513, -72.48429010453835, 33.0069729164527){0};
T3(-0.7455149166935513, -72.48429010453835, 38.0069729164527, 0){"POz"};
SP(33.28181957667235, -69.59313050994169, 22.227197290460037){0};
T3(33.28181957667235, -69.59313050994169, 27.227197290460037, 0){"PO4"};
SP(49.82945324085288, -62.287501173386964, -6.313599472175673){0};
T3(49.82945324085288, -62.287501173386964, -1.3135994721756727, 0){"PO8"};
SP(44.91391484446868, -54.171096332232544, -37.99454567626301){0};
T3(44.91391484446868, -54.171096332232544, -32.99454567626301, 0){"PO10"};
SP(-27.348799934193654, -75.60346137879866, -4.188845851128941){0};
T3(-27.348799934193654, -75.60346137879866, 0.8111541488710587, 0){"O1"};
SP(-0.1387934411284597, -79.96012660464397, -0.6292426687540331){0};
T3(-0.1387934411284597, -79.96012660464397, 4.370757331245967, 0){"Oz"};
SP(26.87968444802858, -75.76073032378787, -3.5401936415042865){0};
T3(26.87968444802858, -75.76073032378787, 1.4598063584957135, 0){"O2"};
SP(-0.0896864886931017, -73.03745104063059, -32.91408305489334){0};
T3(-0.0896864886931017, -73.03745104063059, -27.91408305489334, 0){"Iz"};
SP(-24.1594970119703, -67.3061770137873, -36.0351095155023){0};
T3(-24.1594970119703, -67.3061770137873, -31.0351095155023, 0){"I1"};
SP(24.193318855234182, -67.70301475370465, -35.8091477412106){0};
T3(24.193318855234182, -67.70301475370465, -30.8091477412106, 0){"I2"};
SP(-0.9824614387357483, 73.87700992148764, -30.687103466678625){0};
T3(-0.9824614387357483, 73.87700992148764, -25.687103466678625, 0){"Nz"};
SP(-0.0896864886931017, -73.03745104063059, -32.91408305489334){0};
T3(-0.0896864886931017, -73.03745104063059, -27.91408305489334, 0){"Iz"};
SP(-67.53743131059571, 2.6210243439076684, -42.05900998599507){0};
T3(-67.53743131059571, 2.6210243439076684, -37.05900998599507, 0){"LPA"};
SP(68.81783095362643, 2.089716183640114, -41.51259393780954){0};
T3(68.81783095362643, 2.089716183640114, -36.51259393780954, 0){"RPA"};
};
myView = PostProcessing.NbViews-1;
View[myView].PointType=1;
View[myView].PointSize=6;
View[myView].LineType=1;
View[myView].LineWidth=2;
