View""{
SP(-25.4160966255747, 75.9372553404411, 0.8664099029180505){0};
T3(-25.4160966255747, 75.9372553404411, 5.8664099029180505, 0){"Fp1"};
SP(-0.2581651014199293, 79.85923468130888, 6.017443217353937){0};
T3(-0.2581651014199293, 79.85923468130888, 11.017443217353936, 0){"Fpz"};
SP(24.550403675170934, 76.02193477753863, -0.550247741397706){0};
T3(24.550403675170934, 76.02193477753863, 4.4497522586022935, 0){"Fp2"};
SP(-37.94413473911685, 61.451255764323136, -34.792522954066726){0};
T3(-37.94413473911685, 61.451255764323136, -29.792522954066726, 0){"AF9"};
SP(-45.93074236703871, 65.65430891650642, -4.579619069354739){0};
T3(-45.93074236703871, 65.65430891650642, 0.42038093064526105, 0){"AF7"};
SP(-40.007719889089785, 68.84342271915737, 11.360739037109415){0};
T3(-40.007719889089785, 68.84342271915737, 16.360739037109415, 0){"AF5"};
SP(-29.851995342586825, 69.985419125671, 25.906625729131274){0};
T3(-29.851995342586825, 69.985419125671, 30.906625729131274, 0){"AF3"};
SP(-15.970867413138341, 69.39633578978857, 36.199617270518914){0};
T3(-15.970867413138341, 69.39633578978857, 41.199617270518914, 0){"AF1"};
SP(0.6100800670063219, 70.55551137211762, 38.85711671767882){0};
T3(0.6100800670063219, 70.55551137211762, 43.85711671767882, 0){"AFz"};
SP(17.465253610607625, 70.14143317199203, 35.64088395340077){0};
T3(17.465253610607625, 70.14143317199203, 40.64088395340077, 0){"AF2"};
SP(31.127362912931897, 69.13722758894633, 24.669618912169103){0};
T3(31.127362912931897, 69.13722758894633, 29.669618912169103, 0){"AF4"};
SP(40.145502681608086, 68.06328935437405, 8.811838342928862){0};
T3(40.145502681608086, 68.06328935437405, 13.811838342928862, 0){"AF6"};
SP(45.91663889783627, 65.05221354964328, -7.576380602496382){0};
T3(45.91663889783627, 65.05221354964328, -2.576380602496382, 0){"AF8"};
SP(36.95447078413051, 60.066188198958244, -37.94240558537964){0};
T3(36.95447078413051, 60.066188198958244, -32.94240558537964, 0){"AF10"};
SP(-53.15621925175737, 44.60234586992247, -39.79720131841356){0};
T3(-53.15621925175737, 44.60234586992247, -34.79720131841356, 0){"F9"};
SP(-62.30920505397631, 49.69370651133131, -9.92817376484372){0};
T3(-62.30920505397631, 49.69370651133131, -4.92817376484372, 0){"F7"};
SP(-58.245609599738216, 50.45207339724479, 17.747757791314967){0};
T3(-58.245609599738216, 50.45207339724479, 22.747757791314967, 0){"F5"};
SP(-45.17802785353535, 50.53752731774727, 42.55053920777778){0};
T3(-45.17802785353535, 50.53752731774727, 47.55053920777778, 0){"F3"};
SP(-23.671218207447694, 49.83377321147731, 58.40340213402854){0};
T3(-23.671218207447694, 49.83377321147731, 63.40340213402854, 0){"F1"};
SP(0.9903007205245804, 49.25983699324349, 63.020678511708276){0};
T3(0.9903007205245804, 49.25983699324349, 68.02067851170827, 0){"Fz"};
SP(26.75560615947147, 49.68184691797531, 56.22375820243599){0};
T3(26.75560615947147, 49.68184691797531, 61.22375820243599, 0){"F2"};
SP(47.7220575944331, 50.7715884057403, 38.44093694501017){0};
T3(47.7220575944331, 50.7715884057403, 43.44093694501017, 0){"F4"};
SP(60.76851212562573, 50.82017617415708, 13.938957766095491){0};
T3(60.76851212562573, 50.82017617415708, 18.93895776609549, 0){"F6"};
SP(62.10156549745126, 49.1595766323335, -14.491980762318518){0};
T3(62.10156549745126, 49.1595766323335, -9.491980762318518, 0){"F8"};
SP(50.069110202866945, 44.647424585786865, -43.97030371380749){0};
T3(50.069110202866945, 44.647424585786865, -38.97030371380749, 0){"F10"};
SP(-59.49116580445852, 27.53160294358854, -44.89895721224136){0};
T3(-59.49116580445852, 27.53160294358854, -39.89895721224136, 0){"FT9"};
SP(-73.38947037481951, 28.667011695237203, -15.779742706459633){0};
T3(-73.38947037481951, 28.667011695237203, -10.779742706459633, 0){"FT7"};
SP(-71.85603472303514, 27.88891747956846, 20.29048086539073){0};
T3(-71.85603472303514, 27.88891747956846, 25.29048086539073, 0){"FC5"};
SP(-55.72412648678102, 25.926420567797557, 50.723330504334264){0};
T3(-55.72412648678102, 25.926420567797557, 55.723330504334264, 0){"FC3"};
SP(-29.51814524227152, 23.305271323928533, 71.42816646887665){0};
T3(-29.51814524227152, 23.305271323928533, 76.42816646887665, 0){"FC1"};
SP(1.1909407688910143, 22.10497208922655, 76.72074649515267){0};
T3(1.1909407688910143, 22.10497208922655, 81.72074649515267, 0){"FCz"};
SP(32.35503934366752, 23.453120042373186, 69.76338061633939){0};
T3(32.35503934366752, 23.453120042373186, 74.76338061633939, 0){"FC2"};
SP(59.14929289674767, 25.48442166162173, 47.6425868542698){0};
T3(59.14929289674767, 25.48442166162173, 52.6425868542698, 0){"FC4"};
SP(73.62977696366522, 26.869603285048775, 15.626064383732365){0};
T3(73.62977696366522, 26.869603285048775, 20.626064383732363, 0){"FC6"};
SP(71.87211183841322, 27.943959157954637, -20.35416172285942){0};
T3(71.87211183841322, 27.943959157954637, -15.35416172285942, 0){"FT8"};
SP(59.693035228328355, 25.71010284604192, -47.17313986315361){0};
T3(59.693035228328355, 25.71010284604192, -42.17313986315361, 0){"FT10"};
SP(-62.43883683466718, 8.507004407192314, -49.15540030536685){0};
T3(-62.43883683466718, 8.507004407192314, -44.15540030536685, 0){"T9"};
SP(-77.72119225450481, 4.526095392156289, -20.11508485593991){0};
T3(-77.72119225450481, 4.526095392156289, -15.115084855939909, 0){"T7"};
SP(-78.43940281500072, 0.9376146549059095, 18.823673294332366){0};
T3(-78.43940281500072, 0.9376146549059095, 23.823673294332366, 0){"C5"};
SP(-60.814272550684876, -2.665508200965669, 52.49495772726414){0};
T3(-60.814272550684876, -2.665508200965669, 57.49495772726414, 0){"C3"};
SP(-31.15328862396283, -5.574583589504403, 73.01453105943618){0};
T3(-31.15328862396283, -5.574583589504403, 78.01453105943618, 0){"C1"};
SP(1.3502851674206686, -6.860847657215139, 79.87816974413651){0};
T3(1.3502851674206686, -6.860847657215139, 84.87816974413651, 0){"Cz"};
SP(35.08978184658927, -5.7825675208331635, 71.21019780972502){0};
T3(35.08978184658927, -5.7825675208331635, 76.21019780972502, 0){"C2"};
SP(64.36600286752848, -3.419857463508045, 48.2734617226923){0};
T3(64.36600286752848, -3.419857463508045, 53.2734617226923, 0){"C4"};
SP(79.31419936672557, -0.37197819584578395, 14.163841477304157){0};
T3(79.31419936672557, -0.37197819584578395, 19.163841477304157, 0){"C6"};
SP(76.49153480159471, 2.963811179520624, -24.65184346551956){0};
T3(76.49153480159471, 2.963811179520624, -19.65184346551956, 0){"T8"};
SP(60.743671963490456, 8.178455418259848, -51.64394360683015){0};
T3(60.743671963490456, 8.178455418259848, -46.64394360683015, 0){"T10"};
SP(-63.54429641007066, -11.178767524547535, -46.12215273781029){0};
T3(-63.54429641007066, -11.178767524547535, -41.12215273781029, 0){"TP9"};
SP(-75.01628836194992, -17.645441671843564, -22.866379750342706){0};
T3(-75.01628836194992, -17.645441671843564, -17.866379750342706, 0){"TP7"};
SP(-74.97296314477529, -26.08108390637748, 12.977939854837512){0};
T3(-74.97296314477529, -26.08108390637748, 17.977939854837512, 0){"CP5"};
SP(-57.90259249131497, -30.72994210448612, 45.219351649112895){0};
T3(-57.90259249131497, -30.72994210448612, 50.219351649112895, 0){"CP3"};
SP(-29.877831623873814, -34.07311349866641, 66.01743660724536){0};
T3(-29.877831623873814, -34.07311349866641, 71.01743660724536, 0){"CP1"};
SP(1.215615632762928, -35.17912254550926, 72.24925758530163){0};
T3(1.215615632762928, -35.17912254550926, 77.24925758530163, 0){"CPz"};
SP(34.400193074684125, -33.86919821612967, 63.631254736481246){0};
T3(34.400193074684125, -33.86919821612967, 68.63125473648125, 0){"CP2"};
SP(60.83939273669752, -31.8088034170388, 40.98389394255465){0};
T3(60.83939273669752, -31.8088034170388, 45.98389394255465, 0){"CP4"};
SP(74.9111283769472, -27.036987002476465, 8.260287791011768){0};
T3(74.9111283769472, -27.036987002476465, 13.260287791011768, 0){"CP6"};
SP(73.06242858224768, -19.33830732723485, -26.686927671701365){0};
T3(73.06242858224768, -19.33830732723485, -21.686927671701365, 0){"TP8"};
SP(59.89463363848874, -13.808869380250258, -51.09743497373512){0};
T3(59.89463363848874, -13.808869380250258, -46.09743497373512, 0){"TP10"};
SP(-53.3708980039697, -28.439563024943876, -51.904181617816086){0};
T3(-53.3708980039697, -28.439563024943876, -46.904181617816086, 0){"P9"};
SP(-64.94898416155888, -40.57421779953937, -24.27698095796407){0};
T3(-64.94898416155888, -40.57421779953937, -19.27698095796407, 0){"P7"};
SP(-63.08850835316771, -49.23247043879356, 4.177777834759787){0};
T3(-63.08850835316771, -49.23247043879356, 9.177777834759787, 0){"P5"};
SP(-49.36003011368701, -55.52337844682221, 29.84183335855205){0};
T3(-49.36003011368701, -55.52337844682221, 34.84183335855205, 0){"P3"};
SP(-25.49482361426595, -59.27827111597945, 47.042556484908935){0};
T3(-25.49482361426595, -59.27827111597945, 52.042556484908935, 0){"P1"};
SP(1.0637862558256566, -60.57694466725142, 52.360560140622326){0};
T3(1.0637862558256566, -60.57694466725142, 57.360560140622326, 0){"Pz"};
SP(29.240734501959018, -58.553783440647095, 45.393513510287406){0};
T3(29.240734501959018, -58.553783440647095, 50.393513510287406, 0){"P2"};
SP(51.20291826290034, -55.79751327599072, 26.87829457629376){0};
T3(51.20291826290034, -55.79751327599072, 31.87829457629376, 0){"P4"};
SP(62.186049990244236, -49.995165374414874, -0.06834864771025195){0};
T3(62.186049990244236, -49.995165374414874, 4.931651352289748, 0){"P6"};
SP(62.61824328746851, -40.95854470505179, -28.14274827218389){0};
T3(62.61824328746851, -40.95854470505179, -23.14274827218389, 0){"P8"};
SP(50.24003763121521, -29.362255383011995, -54.86947703302274){0};
T3(50.24003763121521, -29.362255383011995, -49.86947703302274, 0){"P10"};
SP(-39.970617858159606, -45.94133248112985, -52.31278265092409){0};
T3(-39.970617858159606, -45.94133248112985, -47.31278265092409, 0){"PO9"};
SP(-48.48475880932327, -59.12125531839388, -24.2122095252958){0};
T3(-48.48475880932327, -59.12125531839388, -19.2122095252958, 0){"PO7"};
SP(-44.710541133202554, -65.72839159864675, -7.450512889534629){0};
T3(-44.710541133202554, -65.72839159864675, -2.450512889534629, 0){"PO5"};
SP(-34.623653120048004, -71.65852365328658, 7.057806380715105){0};
T3(-34.623653120048004, -71.65852365328658, 12.057806380715105, 0){"PO3"};
SP(-18.265099551710605, -75.9956957176478, 16.19042651208486){0};
T3(-18.265099551710605, -75.9956957176478, 21.19042651208486, 0){"PO1"};
SP(0.3967742715342766, -77.80973910725666, 20.148829409134812){0};
T3(0.3967742715342766, -77.80973910725666, 25.148829409134812, 0){"POz"};
SP(19.683881022251907, -76.50678923437897, 14.759210158667095){0};
T3(19.683881022251907, -76.50678923437897, 19.759210158667095, 0){"PO2"};
SP(34.658679911353595, -71.9266563618744, 3.8489046863804752){0};
T3(34.658679911353595, -71.9266563618744, 8.848904686380475, 0){"PO4"};
SP(44.587773453620954, -66.2178310057228, -10.43625522243029){0};
T3(44.587773453620954, -66.2178310057228, -5.43625522243029, 0){"PO6"};
SP(46.159220547932684, -58.50367923544035, -26.90298301661955){0};
T3(46.159220547932684, -58.50367923544035, -21.90298301661955, 0){"PO8"};
SP(37.20664477156078, -45.300524266424006, -54.954053490017806){0};
T3(37.20664477156078, -45.300524266424006, -49.954053490017806, 0){"PO10"};
SP(-26.627028626058916, -72.09412350485378, -22.230066314380966){0};
T3(-26.627028626058916, -72.09412350485378, -17.230066314380966, 0){"O1"};
SP(-0.4718333462929545, -77.4389331828137, -18.428494509396845){0};
T3(-0.4718333462929545, -77.4389331828137, -13.428494509396845, 0){"Oz"};
SP(25.605688928789828, -72.16497042386094, -23.816907249670187){0};
T3(25.605688928789828, -72.16497042386094, -18.816907249670187, 0){"O2"};
SP(-23.077943926121435, -56.66764699768904, -51.22019286138199){0};
T3(-23.077943926121435, -56.66764699768904, -46.22019286138199, 0){"I1"};
SP(-1.0959813030714454, -63.73915061263267, -49.405480533302104){0};
T3(-1.0959813030714454, -63.73915061263267, -44.405480533302104, 0){"Iz"};
SP(20.628782888089702, -57.45093049125266, -51.98627609940189){0};
T3(20.628782888089702, -57.45093049125266, -46.98627609940189, 0){"I2"};
SP(-35.615805812632644, 69.59631146719276, -17.712378917331854){0};
T3(-35.615805812632644, 69.59631146719276, -12.712378917331854, 0){"AFp9h"};
SP(-32.74785691247703, 73.1591364044811, 2.1589128411576723){0};
T3(-32.74785691247703, 73.1591364044811, 7.158912841157672, 0){"AFp7h"};
SP(-24.79080237288936, 75.817518298818, 9.615777039005145){0};
T3(-24.79080237288936, 75.817518298818, 14.615777039005145, 0){"AFp5h"};
SP(-15.600237914263014, 76.52949071303199, 16.506031069705397){0};
T3(-15.600237914263014, 76.52949071303199, 21.506031069705397, 0){"AFp3h"};
SP(-5.544775840878851, 76.58452219426123, 21.973343197702658){0};
T3(-5.544775840878851, 76.58452219426123, 26.973343197702658, 0){"AFp1h"};
SP(6.145880449303767, 76.45881145083534, 21.67209022165684){0};
T3(6.145880449303767, 76.45881145083534, 26.67209022165684, 0){"AFp2h"};
SP(16.081916266882416, 76.40736851570507, 16.7671510915181){0};
T3(16.081916266882416, 76.40736851570507, 21.7671510915181, 0){"AFp4h"};
SP(24.53348437922586, 75.44349833290858, 8.190734945519063){0};
T3(24.53348437922586, 75.44349833290858, 13.190734945519063, 0){"AFp6h"};
SP(32.55653303541385, 73.45471315076907, 0.14924154796802147){0};
T3(32.55653303541385, 73.45471315076907, 5.149241547968021, 0){"AFp8h"};
SP(34.18650371479947, 69.55211645412491, -19.45083462378301){0};
T3(34.18650371479947, 69.55211645412491, -14.45083462378301, 0){"AFp10h"};
SP(-52.66960825030884, 56.77929796548725, -23.567982858022855){0};
T3(-52.66960825030884, 56.77929796548725, -18.567982858022855, 0){"AFF9h"};
SP(-53.46292734468574, 59.347336049305156, 4.341640721805005){0};
T3(-53.46292734468574, 59.347336049305156, 9.341640721805005, 0){"AFF7h"};
SP(-45.195987487414904, 60.945623513148156, 25.816727828250436){0};
T3(-45.195987487414904, 60.945623513148156, 30.816727828250436, 0){"AFF5h"};
SP(-30.003459486018897, 61.11728146233999, 42.74731140537592){0};
T3(-30.003459486018897, 61.11728146233999, 47.74731140537592, 0){"AFF3h"};
SP(-9.68396280512876, 61.4315668724805, 51.273418090814346){0};
T3(-9.68396280512876, 61.4315668724805, 56.273418090814346, 0){"AFF1h"};
SP(12.1944462837902, 60.79577338618412, 50.87914197871248){0};
T3(12.1944462837902, 60.79577338618412, 55.87914197871248, 0){"AFF2h"};
SP(32.00806957129415, 60.54681795901457, 40.83094959024089){0};
T3(32.00806957129415, 60.54681795901457, 45.83094959024089, 0){"AFF4h"};
SP(46.64012184853479, 60.80992439955629, 22.862332368694638){0};
T3(46.64012184853479, 60.80992439955629, 27.862332368694638, 0){"AFF6h"};
SP(54.33259303842659, 59.612129800712026, 0.9405553526299952){0};
T3(54.33259303842659, 59.612129800712026, 5.940555352629995, 0){"AFF8h"};
SP(51.34688129354729, 56.075217695702946, -26.51288710370613){0};
T3(51.34688129354729, 56.075217695702946, -21.51288710370613, 0){"AFF10h"};
SP(-64.06942006396149, 38.22458453478037, -29.924716047040874){0};
T3(-64.06942006396149, 38.22458453478037, -24.924716047040874, 0){"FFT9h"};
SP(-68.51158555421026, 40.3665230435239, 3.8522342426582106){0};
T3(-68.51158555421026, 40.3665230435239, 8.852234242658211, 0){"FFT7h"};
SP(-59.503026852539534, 39.15499328432958, 34.039997672660256){0};
T3(-59.503026852539534, 39.15499328432958, 39.039997672660256, 0){"FFC5h"};
SP(-39.64497729873037, 37.997368523407985, 58.29646855892313){0};
T3(-39.64497729873037, 37.997368523407985, 63.29646855892313, 0){"FFC3h"};
SP(-12.36937431150145, 36.247637040205895, 70.29436852581735){0};
T3(-12.36937431150145, 36.247637040205895, 75.29436852581735, 0){"FFC1h"};
SP(15.865736169800059, 36.13670598910414, 69.10542588173742){0};
T3(15.865736169800059, 36.13670598910414, 74.10542588173742, 0){"FFC2h"};
SP(42.836758389730875, 38.270624829736434, 55.355817042048386){0};
T3(42.836758389730875, 38.270624829736434, 60.355817042048386, 0){"FFC4h"};
SP(62.24921672784706, 39.3507372268713, 30.0813701749818){0};
T3(62.24921672784706, 39.3507372268713, 35.0813701749818, 0){"FFC6h"};
SP(69.5484912755313, 39.69434779200044, -1.0442694218452573){0};
T3(69.5484912755313, 39.69434779200044, 3.9557305781547427, 0){"FFT8h"};
SP(62.72181700094383, 36.545925756849535, -34.42157425011238){0};
T3(62.72181700094383, 36.545925756849535, -29.42157425011238, 0){"FFT10h"};
SP(-69.03286832613875, 17.58802797135849, -34.78632114244554){0};
T3(-69.03286832613875, 17.58802797135849, -29.786321142445537, 0){"FTT9h"};
SP(-78.66031695996796, 16.45955081469559, 1.60600195536448){0};
T3(-78.66031695996796, 16.45955081469559, 6.60600195536448, 0){"FTT7h"};
SP(-69.59125706562986, 12.804921636227975, 37.62917777692186){0};
T3(-69.59125706562986, 12.804921636227975, 42.62917777692186, 0){"FCC5h"};
SP(-46.19558577605501, 10.167348617314522, 64.86825378153029){0};
T3(-46.19558577605501, 10.167348617314522, 69.86825378153029, 0){"FCC3h"};
SP(-14.73162439416053, 7.950621512651464, 77.94854566943158){0};
T3(-14.73162439416053, 7.950621512651464, 82.94854566943158, 0){"FCC1h"};
SP(17.77604756462984, 8.09967620063959, 77.59925096101641){0};
T3(17.77604756462984, 8.09967620063959, 82.59925096101641, 0){"FCC2h"};
SP(49.52071975189734, 9.899550302925723, 62.22329919351073){0};
T3(49.52071975189734, 9.899550302925723, 67.22329919351073, 0){"FCC4h"};
SP(72.36716291531266, 11.74152389777026, 33.233241875161){0};
T3(72.36716291531266, 11.74152389777026, 38.233241875161, 0){"FCC6h"};
SP(78.08037757882262, 15.10757380618382, -3.6894312203357837){0};
T3(78.08037757882262, 15.10757380618382, 1.3105687796642163, 0){"FTT8h"};
SP(68.50243894247471, 15.895788921035766, -38.98040729927203){0};
T3(68.50243894247471, 15.895788921035766, -33.98040729927203, 0){"FTT10h"};
SP(-71.14523002761962, -6.744126668683807, -35.59370339533437){0};
T3(-71.14523002761962, -6.744126668683807, -30.593703395334373, 0){"TTP9h"};
SP(-79.57461547693795, -10.270083987241689, -2.6689108742601757){0};
T3(-79.57461547693795, -10.270083987241689, 2.3310891257398243, 0){"TTP7h"};
SP(-70.72946249492158, -14.922031491080565, 33.556811889962404){0};
T3(-70.72946249492158, -14.922031491080565, 38.556811889962404, 0){"CCP5h"};
SP(-47.322924375008284, -18.746512422565722, 62.30936959097688){0};
T3(-47.322924375008284, -18.746512422565722, 67.30936959097687, 0){"CCP3h"};
SP(-14.88860292730229, -20.556244957820354, 76.29496884630194){0};
T3(-14.88860292730229, -20.556244957820354, 81.29496884630194, 0){"CCP1h"};
SP(18.96333245027087, -21.085084516440816, 75.30611131427482){0};
T3(18.96333245027087, -21.085084516440816, 80.30611131427482, 0){"CCP2h"};
SP(50.51894904049043, -19.633226736152128, 58.60416186942002){0};
T3(50.51894904049043, -19.633226736152128, 63.60416186942002, 0){"CCP4h"};
SP(72.56512077599965, -16.097067300465717, 29.437715650973892){0};
T3(72.56512077599965, -16.097067300465717, 34.43771565097389, 0){"CCP6h"};
SP(79.18439018613685, -12.03889240141115, -7.771539787494105){0};
T3(79.18439018613685, -12.03889240141115, -2.7715397874941052, 0){"TTP8h"};
SP(69.4693628230374, -9.551658257450306, -38.65159769410823){0};
T3(69.4693628230374, -9.551658257450306, -33.65159769410823, 0){"TTP10h"};
SP(-64.28646010010924, -25.84097323480867, -39.17427058225306){0};
T3(-64.28646010010924, -25.84097323480867, -34.17427058225306, 0){"TPP9h"};
SP(-71.95726049316423, -34.78172585773714, -7.450633814891255){0};
T3(-71.95726049316423, -34.78172585773714, -2.4506338148912548, 0){"TPP7h"};
SP(-64.03978075145278, -41.70791465778063, 25.014312935909892){0};
T3(-64.03978075145278, -41.70791465778063, 30.014312935909892, 0){"CPP5h"};
SP(-41.72259965716121, -46.24989014737082, 50.008745635619995){0};
T3(-41.72259965716121, -46.24989014737082, 55.008745635619995, 0){"CPP3h"};
SP(-13.055725480995207, -48.04953062965274, 62.519391398796316){0};
T3(-13.055725480995207, -48.04953062965274, 67.51939139879632, 0){"CPP1h"};
SP(17.459595971963644, -47.95275912028747, 61.54773262093566){0};
T3(17.459595971963644, -47.95275912028747, 66.54773262093566, 0){"CPP2h"};
SP(45.51509401953498, -45.573191676298066, 46.63708472616791){0};
T3(45.51509401953498, -45.573191676298066, 51.63708472616791, 0){"CPP4h"};
SP(65.28893103237385, -42.490585145567245, 20.9061955537275){0};
T3(65.28893103237385, -42.490585145567245, 25.9061955537275, 0){"CPP6h"};
SP(70.28096105369688, -35.43197657748313, -12.084154817508283){0};
T3(70.28096105369688, -35.43197657748313, -7.084154817508283, 0){"TPP8h"};
SP(61.926650464437586, -26.890977027603125, -42.59114534713674){0};
T3(61.926650464437586, -26.890977027603125, -37.59114534713674, 0){"TPP10h"};
SP(-52.92922557806338, -45.345918792664854, -40.52858432388619){0};
T3(-52.92922557806338, -45.345918792664854, -35.52858432388619, 0){"PPO9h"};
SP(-57.52080853332374, -54.68767135588324, -12.866510890251464){0};
T3(-57.52080853332374, -54.68767135588324, -7.8665108902514636, 0){"PPO7h"};
SP(-50.042177685172454, -61.1201932553503, 9.582008710908779){0};
T3(-50.042177685172454, -61.1201932553503, 14.582008710908779, 0){"PPO5h"};
SP(-33.59061442656983, -67.14296478628039, 26.863995118215076){0};
T3(-33.59061442656983, -67.14296478628039, 31.863995118215076, 0){"PPO3h"};
SP(-10.836481648984982, -70.11341811756452, 35.93726457426665){0};
T3(-10.836481648984982, -70.11341811756452, 40.93726457426665, 0){"PPO1h"};
SP(13.516514250654216, -69.97300517773098, 36.292260899675995){0};
T3(13.516514250654216, -69.97300517773098, 41.292260899675995, 0){"PPO2h"};
SP(35.732817228331854, -67.40953086060904, 25.567571584831793){0};
T3(35.732817228331854, -67.40953086060904, 30.567571584831793, 0){"PPO4h"};
SP(50.07228339058156, -61.92196703645342, 6.1828697078565815){0};
T3(50.07228339058156, -61.92196703645342, 11.182869707856582, 0){"PPO6h"};
SP(55.680323242944944, -54.89698497658643, -16.553643135023492){0};
T3(55.680323242944944, -54.89698497658643, -11.553643135023492, 0){"PPO8h"};
SP(50.45839335783428, -45.57396662995578, -43.06807369583058){0};
T3(50.45839335783428, -45.57396662995578, -38.06807369583058, 0){"PPO10h"};
SP(-35.574650172724205, -59.97746321409106, -39.20266317053827){0};
T3(-35.574650172724205, -59.97746321409106, -34.20266317053827, 0){"POO9h"};
SP(-36.22562734233645, -68.91854331492743, -18.012783203153806){0};
T3(-36.22562734233645, -68.91854331492743, -13.012783203153806, 0){"POO7h"};
SP(-29.935063198798005, -73.80722226616861, -8.505858591952702){0};
T3(-29.935063198798005, -73.80722226616861, -3.505858591952702, 0){"POO5h"};
SP(-19.054951724009502, -77.72519595367648, -2.3083337917950266){0};
T3(-19.054951724009502, -77.72519595367648, 2.6916662082049734, 0){"POO3h"};
SP(-6.805560077024744, -79.80257711450759, 0.2722014359609888){0};
T3(-6.805560077024744, -79.80257711450759, 5.272201435960989, 0){"POO1h"};
SP(6.508179060524791, -79.69940001544721, -1.4243212860611703){0};
T3(6.508179060524791, -79.69940001544721, 3.5756787139388297, 0){"POO2h"};
SP(19.04395054058893, -77.59969263609176, -4.56044977785733){0};
T3(19.04395054058893, -77.59969263609176, 0.43955022214267014, 0){"POO4h"};
SP(29.114249120868113, -74.02597507121587, -11.202056237694922){0};
T3(29.114249120868113, -74.02597507121587, -6.202056237694922, 0){"POO6h"};
SP(35.53004861796233, -69.18788471828454, -20.263340517779096){0};
T3(35.53004861796233, -69.18788471828454, -15.263340517779096, 0){"POO8h"};
SP(32.87772792326699, -59.77310928222649, -41.20181705571066){0};
T3(32.87772792326699, -59.77310928222649, -36.20181705571066, 0){"POO10h"};
SP(-13.376584774657603, -70.06336827414671, -36.9510568358185){0};
T3(-13.376584774657603, -70.06336827414671, -31.9510568358185, 0){"OI1h"};
SP(11.74360543919705, -70.36357715437461, -37.63179818606319){0};
T3(11.74360543919705, -70.36357715437461, -32.63179818606319, 0){"OI2h"};
SP(-12.95479315012005, 78.90151086805925, 3.490435947177471){0};
T3(-12.95479315012005, 78.90151086805925, 8.49043594717747, 0){"Fp1h"};
SP(12.497226212610485, 79.01358091696314, 2.716772554975882){0};
T3(12.497226212610485, 79.01358091696314, 7.716772554975882, 0){"Fp2h"};
SP(-45.09147156640762, 63.2822825686982, -21.204888937627803){0};
T3(-45.09147156640762, 63.2822825686982, -16.204888937627803, 0){"AF9h"};
SP(-43.778615296242926, 67.23106947636121, 3.7933459713189497){0};
T3(-43.778615296242926, 67.23106947636121, 8.79334597131895, 0){"AF7h"};
SP(-35.62311417960297, 69.74914477930126, 18.703386423434516){0};
T3(-35.62311417960297, 69.74914477930126, 23.703386423434516, 0){"AF5h"};
SP(-23.608006232971697, 69.48523087653302, 31.98210839508235){0};
T3(-23.608006232971697, 69.48523087653302, 36.98210839508235, 0){"AF3h"};
SP(-7.8131031462489045, 69.64643057125888, 38.436746765303795){0};
T3(-7.8131031462489045, 69.64643057125888, 43.436746765303795, 0){"AF1h"};
SP(9.40701024225214, 70.19629778322131, 38.3688862551481){0};
T3(9.40701024225214, 70.19629778322131, 43.3688862551481, 0){"AF2h"};
SP(25.0548142554323, 69.32953871464689, 31.036115705799077){0};
T3(25.0548142554323, 69.32953871464689, 36.03611570579908, 0){"AF4h"};
SP(35.8361239707081, 68.93412562099866, 16.77914827663067){0};
T3(35.8361239707081, 68.93412562099866, 21.77914827663067, 0){"AF6h"};
SP(43.85513162214354, 67.11767654312696, 1.3077028357991995){0};
T3(43.85513162214354, 67.11767654312696, 6.3077028357991995, 0){"AF8h"};
SP(44.18963353859282, 62.64651660809859, -23.195699240402124){0};
T3(44.18963353859282, 62.64651660809859, -18.195699240402124, 0){"AF10h"};
SP(-59.11890178677014, 48.06417272773469, -26.806002216567904){0};
T3(-59.11890178677014, 48.06417272773469, -21.806002216567904, 0){"F9h"};
SP(-61.800424377704594, 50.33467750411067, 4.384189479956724){0};
T3(-61.800424377704594, 50.33467750411067, 9.384189479956724, 0){"F7h"};
SP(-52.78644091978329, 50.42101919674325, 30.474059518524438){0};
T3(-52.78644091978329, 50.42101919674325, 35.47405951852444, 0){"F5h"};
SP(-35.2539430676648, 50.109779554339376, 51.64282865199118){0};
T3(-35.2539430676648, 50.109779554339376, 56.64282865199118, 0){"F3h"};
SP(-11.123893776842978, 49.61127758840616, 61.87360322140023){0};
T3(-11.123893776842978, 49.61127758840616, 66.87360322140023, 0){"F1h"};
SP(14.414821366728226, 49.140519003246595, 60.963160902740974){0};
T3(14.414821366728226, 49.140519003246595, 65.96316090274098, 0){"F2h"};
SP(38.1188080973929, 50.20769672816446, 48.78557769365024){0};
T3(38.1188080973929, 50.20769672816446, 53.78557769365024, 0){"F4h"};
SP(54.91433302258443, 50.95470197229963, 26.355721629642424){0};
T3(54.91433302258443, 50.95470197229963, 31.355721629642424, 0){"F6h"};
SP(62.89304561105058, 50.48432619451444, -0.19065895055720095){0};
T3(62.89304561105058, 50.48432619451444, 4.809341049442799, 0){"F8h"};
SP(57.66924862390275, 46.56893479837265, -31.09686545404881){0};
T3(57.66924862390275, 46.56893479837265, -26.09686545404881, 0){"F10h"};
SP(-66.72221184630433, 28.79162963604928, -32.47274913889298){0};
T3(-66.72221184630433, 28.79162963604928, -27.47274913889298, 0){"FT9h"};
SP(-74.41779498601474, 28.75134963702963, 2.9877176074984826){0};
T3(-74.41779498601474, 28.75134963702963, 7.987717607498483, 0){"FT7h"};
SP(-65.82476630640046, 26.844648350443272, 36.875820998587734){0};
T3(-65.82476630640046, 26.844648350443272, 41.875820998587734, 0){"FC5h"};
SP(-43.49102942701001, 24.47542740027378, 62.665220530041005){0};
T3(-43.49102942701001, 24.47542740027378, 67.66522053004101, 0){"FC3h"};
SP(-13.751087969162517, 22.14402862776218, 75.55674925696111){0};
T3(-13.751087969162517, 22.14402862776218, 80.55674925696111, 0){"FC1h"};
SP(16.79938762875728, 22.50356695945942, 75.01609300327192){0};
T3(16.79938762875728, 22.50356695945942, 80.01609300327192, 0){"FC2h"};
SP(46.7235015246826, 24.54921607901607, 60.1383279232871){0};
T3(46.7235015246826, 24.54921607901607, 65.13832792328711, 0){"FC4h"};
SP(68.5863341772029, 25.949594381625378, 32.84769530311578){0};
T3(68.5863341772029, 25.949594381625378, 37.84769530311578, 0){"FC6h"};
SP(74.65597427574114, 27.767425377863663, -2.46183389706059){0};
T3(74.65597427574114, 27.767425377863663, 2.53816610293941, 0){"FT8h"};
SP(66.43754279976814, 26.543139637125776, -36.401100635257116){0};
T3(66.43754279976814, 26.543139637125776, -31.401100635257116, 0){"FT10h"};
SP(-71.37348459867201, 4.460460191080696, -35.73611371012275){0};
T3(-71.37348459867201, 4.460460191080696, -30.73611371012275, 0){"T9h"};
SP(-80.17213506124638, 2.9756769965342427, -0.6828190805890686){0};
T3(-80.17213506124638, 2.9756769965342427, 4.317180919410932, 0){"T7h"};
SP(-70.90385199623371, -0.8339813058122605, 36.44390502989669){0};
T3(-70.90385199623371, -0.8339813058122605, 41.44390502989669, 0){"C5h"};
SP(-47.10969275266105, -4.1876763722820325, 65.13873454831521){0};
T3(-47.10969275266105, -4.1876763722820325, 70.13873454831521, 0){"C3h"};
SP(-14.645522593199125, -6.434749650081008, 78.18464578582719){0};
T3(-14.645522593199125, -6.434749650081008, 83.18464578582719, 0){"C1h"};
SP(18.759857234210052, -6.558103776957918, 77.74050628960553){0};
T3(18.759857234210052, -6.558103776957918, 82.74050628960553, 0){"C2h"};
SP(50.57341620769144, -4.694060931759287, 61.3785669197398){0};
T3(50.57341620769144, -4.694060931759287, 66.3785669197398, 0){"C4h"};
SP(73.55979379143366, -2.1102883046461676, 31.88371598747708){0};
T3(73.55979379143366, -2.1102883046461676, 36.883715987477075, 0){"C6h"};
SP(79.51059716433771, 1.3767134812029642, -5.772606586189847){0};
T3(79.51059716433771, 1.3767134812029642, -0.7726065861898466, 0){"T8h"};
SP(68.92332081031151, 4.421611602934787, -41.09050958303496){0};
T3(68.92332081031151, 4.421611602934787, -36.09050958303496, 0){"T10h"};
SP(-70.0541049255389, -14.641480908981858, -35.183386652579934){0};
T3(-70.0541049255389, -14.641480908981858, -30.183386652579934, 0){"TP9h"};
SP(-76.92299599219142, -23.07608917821758, -5.3317698422879225){0};
T3(-76.92299599219142, -23.07608917821758, -0.3317698422879225, 0){"TP7h"};
SP(-68.22575004866921, -28.645517475740043, 29.986153539239112){0};
T3(-68.22575004866921, -28.645517475740043, 34.98615353923911, 0){"CP5h"};
SP(-45.09882276079037, -32.45861790392895, 57.351071886732264){0};
T3(-45.09882276079037, -32.45861790392895, 62.351071886732264, 0){"CP3h"};
SP(-13.908301496347885, -34.61254800349202, 71.1965319203057){0};
T3(-13.908301496347885, -34.61254800349202, 76.1965319203057, 0){"CP1h"};
SP(18.607660843728222, -34.41035082979823, 69.66882000140316){0};
T3(18.607660843728222, -34.41035082979823, 74.66882000140316, 0){"CP2h"};
SP(48.45732964126211, -32.837317619626006, 53.95790184362575){0};
T3(48.45732964126211, -32.837317619626006, 58.95790184362575, 0){"CP4h"};
SP(70.00745944338317, -29.669185118457452, 25.58804772643885){0};
T3(70.00745944338317, -29.669185118457452, 30.58804772643885, 0){"CP6h"};
SP(75.60867647868223, -23.510957644351308, -9.897118824413578){0};
T3(75.60867647868223, -23.510957644351308, -4.897118824413578, 0){"TP8h"};
SP(65.90955034473545, -18.312238164963624, -40.85122225588849){0};
T3(65.90955034473545, -18.312238164963624, -35.85122225588849, 0){"TP10h"};
SP(-59.68276160576113, -35.74343269947985, -40.33960099223678){0};
T3(-59.68276160576113, -35.74343269947985, -35.33960099223678, 0){"P9h"};
SP(-65.16756061193794, -45.36484090851155, -10.384736501601306){0};
T3(-65.16756061193794, -45.36484090851155, -5.3847365016013065, 0){"P7h"};
SP(-57.873472831466565, -52.76432699110602, 17.86548691745873){0};
T3(-57.873472831466565, -52.76432699110602, 22.86548691745873, 0){"P5h"};
SP(-37.89714222182701, -57.68882633289316, 39.55942119538636){0};
T3(-37.89714222182701, -57.68882633289316, 44.55942119538636, 0){"P3h"};
SP(-11.75991882457202, -59.892140709499955, 51.05591154864097){0};
T3(-11.75991882457202, -59.892140709499955, 56.05591154864097, 0){"P1h"};
SP(16.259025872320766, -60.003523227916254, 50.65709528545103){0};
T3(16.259025872320766, -60.003523227916254, 55.65709528545103, 0){"P2h"};
SP(41.25647461090893, -57.780686032059236, 37.34871652310242){0};
T3(41.25647461090893, -57.780686032059236, 42.34871652310242, 0){"P4h"};
SP(58.08169779517525, -52.81499916387977, 14.074379982674634){0};
T3(58.08169779517525, -52.81499916387977, 19.074379982674635, 0){"P6h"};
SP(63.83685275634541, -45.59746296358389, -14.383185855669634){0};
T3(63.83685275634541, -45.59746296358389, -9.383185855669634, 0){"P8h"};
SP(56.89665177668963, -36.512789900499186, -43.441008216056105){0};
T3(56.89665177668963, -36.512789900499186, -38.441008216056105, 0){"P10h"};
SP(-44.60153311852827, -53.32066021676532, -40.28928118567865){0};
T3(-44.60153311852827, -53.32066021676532, -35.28928118567865, 0){"PO9h"};
SP(-47.367341982219166, -63.081240126933324, -15.979395161302708){0};
T3(-47.367341982219166, -63.081240126933324, -10.979395161302708, 0){"PO7h"};
SP(-40.54890536664799, -68.69379636156614, 0.22360018752407892){0};
T3(-40.54890536664799, -68.69379636156614, 5.223600187524079, 0){"PO5h"};
SP(-27.067338500275266, -74.0462273557591, 12.093930343752763){0};
T3(-27.067338500275266, -74.0462273557591, 17.093930343752763, 0){"PO3h"};
SP(-9.112601049688944, -77.23310280866457, 18.916339878994197){0};
T3(-9.112601049688944, -77.23310280866457, 23.916339878994197, 0){"PO1h"};
SP(10.130474069741783, -77.69069801009738, 17.567555116504373){0};
T3(10.130474069741783, -77.69069801009738, 22.567555116504373, 0){"PO2h"};
SP(28.15808567116443, -74.85646123985623, 10.233793915585412){0};
T3(28.15808567116443, -74.85646123985623, 15.233793915585412, 0){"PO4h"};
SP(40.922762188882466, -69.26756242468723, -2.470289098148479){0};
T3(40.922762188882466, -69.26756242468723, 2.529710901851521, 0){"PO6h"};
SP(45.50411680508601, -62.333360567331965, -18.692800709852143){0};
T3(45.50411680508601, -62.333360567331965, -13.692800709852143, 0){"PO8h"};
SP(42.429694354015304, -52.85007095813479, -42.37808537330641){0};
T3(42.429694354015304, -52.85007095813479, -37.37808537330641, 0){"PO10h"};
SP(-14.08617654451132, -76.22272223936939, -20.50559038166991){0};
T3(-14.08617654451132, -76.22272223936939, -15.505590381669911, 0){"O1h"};
SP(13.017062245560135, -75.43099813709338, -21.254289466101085){0};
T3(13.017062245560135, -75.43099813709338, -16.254289466101085, 0){"O2h"};
SP(-11.955725934502285, -61.288360480904615, -50.84025414328585){0};
T3(-11.955725934502285, -61.288360480904615, -45.84025414328585, 0){"I1h"};
SP(11.215790561150238, -61.09977582285741, -51.451430731418014){0};
T3(11.215790561150238, -61.09977582285741, -46.451430731418014, 0){"I2h"};
SP(-28.827791140623102, 67.26901760078448, -32.98111103405015){0};
T3(-28.827791140623102, 67.26901760078448, -27.98111103405015, 0){"AFp9"};
SP(-36.094255779680445, 71.49367708366677, -1.8301760633321678){0};
T3(-36.094255779680445, 71.49367708366677, 3.1698239366678322, 0){"AFp7"};
SP(-29.05347029759843, 74.52057250436133, 5.924258247187153){0};
T3(-29.05347029759843, 74.52057250436133, 10.924258247187154, 0){"AFp5"};
SP(-20.523342895832993, 76.63269484370986, 12.81194381364988){0};
T3(-20.523342895832993, 76.63269484370986, 17.81194381364988, 0){"AFp3"};
SP(-10.786953098326602, 76.41438096344842, 20.204100125454378){0};
T3(-10.786953098326602, 76.41438096344842, 25.204100125454378, 0){"AFp1"};
SP(-0.08967472340995819, 76.23081229702706, 22.71176827846924){0};
T3(-0.08967472340995819, 76.23081229702706, 27.71176827846924, 0){"AFpz"};
SP(11.541290611457523, 76.71752870721684, 20.59149302676211){0};
T3(11.541290611457523, 76.71752870721684, 25.59149302676211, 0){"AFp2"};
SP(20.70103551294072, 75.9271656542301, 12.68682026858561){0};
T3(20.70103551294072, 75.9271656542301, 17.68682026858561, 0){"AFp4"};
SP(28.767268543477805, 74.38299374010928, 4.170080139400184){0};
T3(28.767268543477805, 74.38299374010928, 9.170080139400184, 0){"AFp6"};
SP(35.35673898873577, 71.47616523741185, -4.003617496065329){0};
T3(35.35673898873577, 71.47616523741185, 0.9963825039346714, 0){"AFp8"};
SP(28.018740150069505, 66.44149554855015, -35.28912373130227){0};
T3(28.018740150069505, 66.44149554855015, -30.28912373130227, 0){"AFp10"};
SP(-45.88662509866559, 53.022787761213216, -38.23486434662422){0};
T3(-45.88662509866559, 53.022787761213216, -33.23486434662422, 0){"AFF9"};
SP(-54.68214017311492, 58.29712781887041, -7.205375137620285){0};
T3(-54.68214017311492, 58.29712781887041, -2.205375137620285, 0){"AFF7"};
SP(-49.760564431885705, 60.56442962989881, 15.02997316747572){0};
T3(-49.760564431885705, 60.56442962989881, 20.02997316747572, 0){"AFF5"};
SP(-38.50436859018063, 61.32466831198996, 35.196503049715375){0};
T3(-38.50436859018063, 61.32466831198996, 40.196503049715375, 0){"AFF3"};
SP(-20.22584139690745, 60.847523298417414, 48.13086726509448){0};
T3(-20.22584139690745, 60.847523298417414, 53.13086726509448, 0){"AFF1"};
SP(0.665432371662217, 60.901079618809156, 52.15077504393971){0};
T3(0.665432371662217, 60.901079618809156, 57.15077504393971, 0){"AFFz"};
SP(22.76150611099568, 60.63958719611473, 47.17602661714789){0};
T3(22.76150611099568, 60.63958719611473, 52.17602661714789, 0){"AFF2"};
SP(39.95141830864105, 60.45795913867654, 32.35364672557245){0};
T3(39.95141830864105, 60.45795913867654, 37.35364672557245, 0){"AFF4"};
SP(51.448896486408785, 60.69442010983815, 12.147144436420536){0};
T3(51.448896486408785, 60.69442010983815, 17.147144436420536, 0){"AFF6"};
SP(54.74854924676156, 58.311342717900125, -10.998312363086484){0};
T3(54.74854924676156, 58.311342717900125, -5.998312363086484, 0){"AFF8"};
SP(45.64507517683464, 51.847905024997104, -42.21629987155155){0};
T3(45.64507517683464, 51.847905024997104, -37.21629987155155, 0){"AFF10"};
SP(-56.06107545222362, 38.10502240635496, -42.132602478506215){0};
T3(-56.06107545222362, 38.10502240635496, -37.132602478506215, 0){"FFT9"};
SP(-68.62024011078007, 39.95894311391867, -12.796115140870425){0};
T3(-68.62024011078007, 39.95894311391867, -7.796115140870425, 0){"FFT7"};
SP(-65.7537505193738, 39.729400672114, 19.847916445934732){0};
T3(-65.7537505193738, 39.729400672114, 24.847916445934732, 0){"FFC5"};
SP(-50.6881626811835, 38.53154280672276, 47.15894120097265){0};
T3(-50.6881626811835, 38.53154280672276, 52.15894120097265, 0){"FFC3"};
SP(-26.60565509194533, 37.50115356549975, 66.18595252936747){0};
T3(-26.60565509194533, 37.50115356549975, 71.18595252936747, 0){"FFC1"};
SP(1.2331807420454586, 36.1524885705677, 71.2624059968727){0};
T3(1.2331807420454586, 36.1524885705677, 76.2624059968727, 0){"FFCz"};
SP(29.718418730553044, 36.932116290041435, 63.55942087335403){0};
T3(29.718418730553044, 36.932116290041435, 68.55942087335403, 0){"FFC2"};
SP(53.68574711099234, 38.929697366761346, 43.81141019887454){0};
T3(53.68574711099234, 38.929697366761346, 48.81141019887454, 0){"FFC4"};
SP(67.82133509113724, 39.81719650194465, 15.118688115116202){0};
T3(67.82133509113724, 39.81719650194465, 20.1186881151162, 0){"FFC6"};
SP(67.5827966002282, 38.8554983813472, -17.67556660229282){0};
T3(67.5827966002282, 38.8554983813472, -12.675566602292822, 0){"FFT8"};
SP(55.06533094741383, 35.826414397174865, -45.82468627005855){0};
T3(55.06533094741383, 35.826414397174865, -40.82468627005855, 0){"FFT10"};
SP(-61.653012572687686, 18.175287807368175, -46.426947723078975){0};
T3(-61.653012572687686, 18.175287807368175, -41.426947723078975, 0){"FTT9"};
SP(-76.05177660931615, 16.66477725170867, -18.08585360016731){0};
T3(-76.05177660931615, 16.66477725170867, -13.085853600167312, 0){"FTT7"};
SP(-76.51363515832911, 15.111343900541655, 20.459417300380437){0};
T3(-76.51363515832911, 15.111343900541655, 25.459417300380437, 0){"FCC5"};
SP(-59.273522405163824, 11.438354425867042, 52.41024756504029){0};
T3(-59.273522405163824, 11.438354425867042, 57.41024756504029, 0){"FCC3"};
SP(-30.85806880398897, 8.804725668001161, 73.26931105326413){0};
T3(-30.85806880398897, 8.804725668001161, 78.26931105326413, 0){"FCC1"};
SP(1.3902759744578916, 7.492695691554173, 79.54238088872876){0};
T3(1.3902759744578916, 7.492695691554173, 84.54238088872876, 0){"FCCz"};
SP(34.16128434706136, 9.028502981929408, 71.52837068305993){0};
T3(34.16128434706136, 9.028502981929408, 76.52837068305993, 0){"FCC2"};
SP(63.05966802870536, 11.476424211314022, 49.41280380411133){0};
T3(63.05966802870536, 11.476424211314022, 54.41280380411133, 0){"FCC4"};
SP(77.26005840288072, 13.589673203819295, 14.89391872036585){0};
T3(77.26005840288072, 13.589673203819295, 19.89391872036585, 0){"FCC6"};
SP(75.64112292227833, 15.560484041507427, -22.6394785459857){0};
T3(75.64112292227833, 15.560484041507427, -17.6394785459857, 0){"FTT8"};
SP(61.633623367932316, 15.663872135046923, -50.29088086589704){0};
T3(61.633623367932316, 15.663872135046923, -45.29088086589704, 0){"FTT10"};
SP(-63.13207606012317, -2.495510205674286, -47.70982017061882){0};
T3(-63.13207606012317, -2.495510205674286, -42.70982017061882, 0){"TTP9"};
SP(-77.19844362264311, -7.253089570528565, -21.001906525649865){0};
T3(-77.19844362264311, -7.253089570528565, -16.001906525649865, 0){"TTP7"};
SP(-77.6317967217483, -12.926177572148154, 16.021811838834395){0};
T3(-77.6317967217483, -12.926177572148154, 21.021811838834395, 0){"CCP5"};
SP(-60.581168568659585, -17.083439154342926, 49.79656267967838){0};
T3(-60.581168568659585, -17.083439154342926, 54.79656267967838, 0){"CCP3"};
SP(-31.616414313346297, -19.82974231785377, 70.66309823837649){0};
T3(-31.616414313346297, -19.82974231785377, 75.66309823837649, 0){"CCP1"};
SP(1.2924782333066072, -21.24177702198891, 77.59893335517408){0};
T3(1.2924782333066072, -21.24177702198891, 82.59893335517408, 0){"CCPz"};
SP(35.41392625783217, -20.656909821203005, 68.89575404824608){0};
T3(35.41392625783217, -20.656909821203005, 73.89575404824608, 0){"CCP2"};
SP(63.271739813768946, -17.92395352523353, 45.30920441049833){0};
T3(63.271739813768946, -17.92395352523353, 50.30920441049833, 0){"CCP4"};
SP(78.18335970936783, -14.379111299054232, 11.840765245760718){0};
T3(78.18335970936783, -14.379111299054232, 16.840765245760718, 0){"CCP6"};
SP(76.23069477618996, -7.982332668683158, -25.89278396003472){0};
T3(76.23069477618996, -7.982332668683158, -20.89278396003472, 0){"TTP8"};
SP(61.745636086567096, -2.1985496766705763, -50.15973803280288){0};
T3(61.745636086567096, -2.1985496766705763, -45.15973803280288, 0){"TTP10"};
SP(-60.56759876225558, -17.509146974778844, -48.360498155991834){0};
T3(-60.56759876225558, -17.509146974778844, -43.360498155991834, 0){"TPP9"};
SP(-70.42294817185636, -30.01820233269588, -23.847238585869146){0};
T3(-70.42294817185636, -30.01820233269588, -18.847238585869146, 0){"TPP7"};
SP(-69.81773491990415, -38.51097798050891, 9.051754988226875){0};
T3(-69.81773491990415, -38.51097798050891, 14.051754988226875, 0){"CPP5"};
SP(-54.57179681990651, -44.25328747663372, 38.947109566625755){0};
T3(-54.57179681990651, -44.25328747663372, 43.947109566625755, 0){"CPP3"};
SP(-28.215941011995156, -47.044175401643216, 58.643103118838845){0};
T3(-28.215941011995156, -47.044175401643216, 63.643103118838845, 0){"CPP1"};
SP(1.1212151976277074, -48.355783932515564, 63.86197288577241){0};
T3(1.1212151976277074, -48.355783932515564, 68.86197288577242, 0){"CPPz"};
SP(31.894200494612775, -47.01709377561493, 55.33173018546964){0};
T3(31.894200494612775, -47.01709377561493, 60.33173018546964, 0){"CPP2"};
SP(56.93450258242016, -44.52264590066554, 35.235328006696335){0};
T3(56.93450258242016, -44.52264590066554, 40.235328006696335, 0){"CPP4"};
SP(69.13108700543202, -38.88983449122811, 4.7976437115736115){0};
T3(69.13108700543202, -38.88983449122811, 9.797643711573611, 0){"CPP6"};
SP(68.11398247264665, -30.52712060727536, -27.961703364943418){0};
T3(68.11398247264665, -30.52712060727536, -22.961703364943418, 0){"TPP8"};
SP(54.8975226156915, -20.894343380840198, -53.72346639157269){0};
T3(54.8975226156915, -20.894343380840198, -48.72346639157269, 0){"TPP10"};
SP(-47.51112700129667, -36.80977856012135, -53.065354241713386){0};
T3(-47.51112700129667, -36.80977856012135, -48.065354241713386, 0){"PPO9"};
SP(-57.44525217673646, -50.38416805608445, -24.381746585332515){0};
T3(-57.44525217673646, -50.38416805608445, -19.381746585332515, 0){"PPO7"};
SP(-54.42855562790038, -58.1405727958314, -1.6132818434101504){0};
T3(-54.42855562790038, -58.1405727958314, 3.3867181565898496, 0){"PPO5"};
SP(-42.8833047192785, -63.98539231022001, 18.796077686400952){0};
T3(-42.8833047192785, -63.98539231022001, 23.796077686400952, 0){"PPO3"};
SP(-22.804376608113, -69.13704607641607, 32.985919637485345){0};
T3(-22.804376608113, -69.13704607641607, 37.985919637485345, 0){"PPO1"};
SP(0.8105960454296972, -70.31898275307641, 37.3144883066452){0};
T3(0.8105960454296972, -70.31898275307641, 42.3144883066452, 0){"PPOz"};
SP(25.391110749378328, -69.60746045460223, 32.246312241669145){0};
T3(25.391110749378328, -69.60746045460223, 37.246312241669145, 0){"PPO2"};
SP(43.78649044587357, -64.58675475128409, 16.425612618188236){0};
T3(43.78649044587357, -64.58675475128409, 21.425612618188236, 0){"PPO4"};
SP(54.36518757402249, -58.24848510165162, -4.714449838944809){0};
T3(54.36518757402249, -58.24848510165162, 0.28555016105519115, 0){"PPO6"};
SP(55.349326611742875, -50.53736622570456, -27.853104758726577){0};
T3(55.349326611742875, -50.53736622570456, -22.853104758726577, 0){"PPO8"};
SP(44.5771607638587, -38.47338495917113, -54.48295270768931){0};
T3(44.5771607638587, -38.47338495917113, -49.48295270768931, 0){"PPO10"};
SP(-32.26698022281733, -51.50876811808183, -51.86550535453296){0};
T3(-32.26698022281733, -51.50876811808183, -46.86550535453296, 0){"POO9"};
SP(-38.28828735290721, -66.43602091308901, -23.39971316556182){0};
T3(-38.28828735290721, -66.43602091308901, -18.39971316556182, 0){"POO7"};
SP(-33.35199134155201, -71.56029491211632, -13.14274136086739){0};
T3(-33.35199134155201, -71.56029491211632, -8.14274136086739, 0){"POO5"};
SP(-24.846190159846966, -76.28372699799333, -5.554496574356037){0};
T3(-24.846190159846966, -76.28372699799333, -0.5544965743560368, 0){"POO3"};
SP(-13.374472146273641, -78.76263375420443, 0.5390412556846524){0};
T3(-13.374472146273641, -78.76263375420443, 5.539041255684652, 0){"POO1"};
SP(0.03483036378097992, -80.04805964374111, 0.08851192990664991){0};
T3(0.03483036378097992, -80.04805964374111, 5.08851192990665, 0){"POOz"};
SP(13.064707340681249, -78.98535964095427, -2.293799830139183){0};
T3(13.064707340681249, -78.98535964095427, 2.706200169860817, 0){"POO2"};
SP(24.478908396146558, -76.05790422727306, -7.198700560463601){0};
T3(24.478908396146558, -76.05790422727306, -2.1987005604636014, 0){"POO4"};
SP(33.209751336052776, -71.80808734601516, -14.950534964677821){0};
T3(33.209751336052776, -71.80808734601516, -9.950534964677821, 0){"POO6"};
SP(36.623449060611996, -65.98586783900049, -25.56868008117584){0};
T3(36.623449060611996, -65.98586783900049, -20.56868008117584, 0){"POO8"};
SP(29.754050134695007, -52.14155049924964, -52.8247589596326){0};
T3(29.754050134695007, -52.14155049924964, -47.8247589596326, 0){"POO10"};
SP(-24.798888135425127, -65.71891964799629, -38.13698037616738){0};
T3(-24.798888135425127, -65.71891964799629, -33.13698037616738, 0){"OI1"};
SP(-0.8999692598804898, -72.42289756046176, -34.9938996953901){0};
T3(-0.8999692598804898, -72.42289756046176, -29.9938996953901, 0){"OIz"};
SP(23.105729364909855, -66.28393275187769, -40.091789634446876){0};
T3(23.105729364909855, -66.28393275187769, -35.091789634446876, 0){"OI2"};
SP(-77.72119225450481, 4.526095392156289, -20.11508485593991){0};
T3(-77.72119225450481, 4.526095392156289, -15.115084855939909, 0){"T3"};
SP(-64.94898416155888, -40.57421779953937, -24.27698095796407){0};
T3(-64.94898416155888, -40.57421779953937, -19.27698095796407, 0){"T5"};
SP(76.49153480159471, 2.963811179520624, -24.65184346551956){0};
T3(76.49153480159471, 2.963811179520624, -19.65184346551956, 0){"T4"};
SP(62.61824328746851, -40.95854470505179, -28.14274827218389){0};
T3(62.61824328746851, -40.95854470505179, -23.14274827218389, 0){"T6"};
SP(-55.028197975871834, -4.1226900512526425, -57.281841131717435){0};
T3(-55.028197975871834, -4.1226900512526425, -52.281841131717435, 0){"M1"};
SP(45.898783818021776, -5.212550907359678, -65.4872050638322){0};
T3(45.898783818021776, -5.212550907359678, -60.48720506383221, 0){"M2"};
SP(-55.80916470444914, 0.6085231059832661, -56.693756539521935){0};
T3(-55.80916470444914, 0.6085231059832661, -51.693756539521935, 0){"A1"};
SP(51.88521051936035, 2.666214671560642, -60.6807841561902){0};
T3(51.88521051936035, 2.666214671560642, -55.6807841561902, 0){"A2"};
SP(-0.17360079590553595, 74.55571916403169, -29.179290680392988){0};
T3(-0.17360079590553595, 74.55571916403169, -24.179290680392988, 0){"Nz"};
SP(-1.0959813030714454, -63.73915061263267, -49.405480533302104){0};
T3(-1.0959813030714454, -63.73915061263267, -44.405480533302104, 0){"Iz"};
SP(-61.45439700042069, 5.314619825820201, -50.286941775613045){0};
T3(-61.45439700042069, 5.314619825820201, -45.286941775613045, 0){"LPA"};
SP(62.03733007658098, 3.961361319527085, -50.08568147732535){0};
T3(62.03733007658098, 3.961361319527085, -45.08568147732535, 0){"RPA"};
};
myView = PostProcessing.NbViews-1;
View[myView].PointType=1;
View[myView].PointSize=6;
View[myView].LineType=1;
View[myView].LineWidth=2;
