View""{
SP(-0.6317729301940194, 15.60021570328339, 78.36860515920488){0};
T3(-0.6317729301940194, 15.60021570328339, 83.36860515920488, 0){"reference"};
SP(0.48977546986991305, 0.6328729941673039, 80.4585863655292){0};
T3(0.48977546986991305, 0.6328729941673039, 85.4585863655292, 0){"1"};
SP(0.10909711312978221, 30.44639525864561, 73.65300522623241){0};
T3(0.10909711312978221, 30.44639525864561, 78.65300522623241, 0){"2"};
SP(29.215405571589113, 14.29555103546622, 72.84925404025581){0};
T3(29.215405571589113, 14.29555103546622, 77.84925404025581, 0){"3"};
SP(28.46018862210267, -16.693943542200852, 73.26975038917006){0};
T3(28.46018862210267, -16.693943542200852, 78.26975038917006, 0){"4"};
SP(-0.006358842400137732, -29.079843546585607, 74.95921924537923){0};
T3(-0.006358842400137732, -29.079843546585607, 79.95921924537923, 0){"5"};
SP(-26.09053061942738, -13.660178372023578, 73.6210152991539){0};
T3(-26.09053061942738, -13.660178372023578, 78.6210152991539, 0){"6"};
SP(-27.919957639467636, 16.152422568318688, 73.58550782173103){0};
T3(-27.919957639467636, 16.152422568318688, 78.58550782173103, 0){"7"};
SP(-0.5131891777277905, 55.784955254277584, 57.50691984977339){0};
T3(-0.5131891777277905, 55.784955254277584, 62.50691984977339, 0){"8"};
SP(31.879565581375044, 45.500690086096235, 57.05793582051466){0};
T3(31.879565581375044, 45.500690086096235, 62.05793582051466, 0){"9"};
SP(52.692305656230445, 23.49052882319286, 55.75827275077211){0};
T3(52.692305656230445, 23.49052882319286, 60.75827275077211, 0){"10"};
SP(58.82422468229425, -4.641103433485821, 53.858071938545244){0};
T3(58.82422468229425, -4.641103433485821, 58.858071938545244, 0){"11"};
SP(49.22297152411151, -28.975431214144184, 56.11916639631639){0};
T3(49.22297152411151, -28.975431214144184, 61.11916639631639, 0){"12"};
SP(28.379606678632303, -47.86444939774658, 56.7745088705343){0};
T3(28.379606678632303, -47.86444939774658, 61.7745088705343, 0){"13"};
SP(0.0668487715416044, -54.15142795329993, 58.97723913749172){0};
T3(0.0668487715416044, -54.15142795329993, 63.97723913749172, 0){"14"};
SP(-28.364408150148098, -46.766420309979786, 58.86370674200646){0};
T3(-28.364408150148098, -46.766420309979786, 63.86370674200646, 0){"15"};
SP(-49.32671504966724, -27.16288643877206, 56.9443191375194){0};
T3(-49.32671504966724, -27.16288643877206, 61.9443191375194, 0){"16"};
SP(-58.03888487970793, -1.222694590775394, 55.49344755553862){0};
T3(-58.03888487970793, -1.222694590775394, 60.49344755553862, 0){"17"};
SP(-53.01011916258692, 25.182960175450233, 54.15343929549692){0};
T3(-53.01011916258692, 25.182960175450233, 59.15343929549692, 0){"18"};
SP(-32.07894298395884, 48.027741765576714, 55.615590919952226){0};
T3(-32.07894298395884, 48.027741765576714, 60.615590919952226, 0){"19"};
SP(0.8938272417364939, 72.76404303437347, 33.24325070614904){0};
T3(0.8938272417364939, 72.76404303437347, 38.24325070614904, 0){"20"};
SP(32.5206994332701, 66.23814805620322, 31.302638141102484){0};
T3(32.5206994332701, 66.23814805620322, 36.302638141102484, 0){"21"};
SP(57.359436871009294, 46.51530058276943, 29.291707828817877){0};
T3(57.359436871009294, 46.51530058276943, 34.29170782881788, 0){"22"};
SP(72.62406514124427, 19.54263919500178, 27.473005209927372){0};
T3(72.62406514124427, 19.54263919500178, 32.47300520992737, 0){"23"};
SP(74.13114056764778, -10.606468808978832, 28.39862698380587){0};
T3(74.13114056764778, -10.606468808978832, 33.39862698380587, 0){"24"};
SP(64.8056026254358, -37.248450341371004, 30.04054909147908){0};
T3(64.8056026254358, -37.248450341371004, 35.04054909147908, 0){"25"};
SP(46.5750514297166, -56.895051445509836, 33.13157230802699){0};
T3(46.5750514297166, -56.895051445509836, 38.13157230802699, 0){"26"};
SP(15.505970226423385, -71.71556650686041, 32.89080556000004){0};
T3(15.505970226423385, -71.71556650686041, 37.89080556000004, 0){"27"};
SP(-19.027316286576827, -69.81856830699361, 33.47624629982395){0};
T3(-19.027316286576827, -69.81856830699361, 38.47624629982395, 0){"28"};
SP(-47.334427857483895, -55.434022281334656, 33.086415035911266){0};
T3(-47.334427857483895, -55.434022281334656, 38.086415035911266, 0){"29"};
SP(-65.61914239505188, -32.28325711298028, 32.26265271391513){0};
T3(-65.61914239505188, -32.28325711298028, 37.26265271391513, 0){"30"};
SP(-73.78966167711062, -4.56378592391225, 30.50667442294447){0};
T3(-73.78966167711062, -4.56378592391225, 35.50667442294447, 0){"31"};
SP(-70.92315967572678, 25.01718336695602, 27.6670469064037){0};
T3(-70.92315967572678, 25.01718336695602, 32.6670469064037, 0){"32"};
SP(-53.98495125573028, 51.49171320749799, 26.317207619704387){0};
T3(-53.98495125573028, 51.49171320749799, 31.317207619704387, 0){"41"};
SP(-30.27457387789485, 68.47570122980747, 29.012321500110755){0};
T3(-30.27457387789485, 68.47570122980747, 34.01232150011076, 0){"42"};
SP(-0.8201651503335512, 79.78195019596477, 8.382817932235145){0};
T3(-0.8201651503335512, 79.78195019596477, 13.382817932235145, 0){"43"};
SP(31.228317662545255, 73.36028818210647, 5.393773855921263){0};
T3(31.228317662545255, 73.36028818210647, 10.393773855921264, 0){"44"};
SP(58.0213837058444, 56.303037716977364, -1.0023321526900648){0};
T3(58.0213837058444, 56.303037716977364, 3.997667847309935, 0){"45"};
SP(73.14476612329884, 31.836517246337923, -2.401410316675559){0};
T3(73.14476612329884, 31.836517246337923, 2.598589683324441, 0){"46"};
SP(79.61576581287876, 1.9651972261388444, -4.09602738780116){0};
T3(79.61576581287876, 1.9651972261388444, 0.9039726121988396, 0){"47"};
SP(74.91468300371398, -27.72223028386805, -2.1537589455000514){0};
T3(74.91468300371398, -27.72223028386805, 2.8462410544999486, 0){"48"};
SP(58.48310979321169, -54.53762172298853, -0.060624641216434905){0};
T3(58.48310979321169, -54.53762172298853, 4.939375358783565, 0){"49"};
SP(30.297892922563356, -74.12144418751052, 3.049738385073167){0};
T3(30.297892922563356, -74.12144418751052, 8.049738385073168, 0){"50"};
SP(-2.3095854451018427, -79.9998049026688, -0.5053485831867892){0};
T3(-2.3095854451018427, -79.9998049026688, 4.494651416813211, 0){"51"};
SP(-33.5134079812, -72.89271666445707, 3.055515929392084){0};
T3(-33.5134079812, -72.89271666445707, 8.055515929392083, 0){"52"};
SP(-60.08458626523789, -53.037245296682684, 2.2495394124012384){0};
T3(-60.08458626523789, -53.037245296682684, 7.249539412401239, 0){"53"};
SP(-75.91471972535703, -26.80727132004649, 1.4346906138331712){0};
T3(-75.91471972535703, -26.80727132004649, 6.434690613833171, 0){"54"};
SP(-80.17123807908507, 2.870181353434259, -1.1142408934429335){0};
T3(-80.17123807908507, 2.870181353434259, 3.8857591065570665, 0){"55"};
SP(-73.24139560731895, 32.35521497623531, -1.112498849180755){0};
T3(-73.24139560731895, 32.35521497623531, 3.887501150819245, 0){"56"};
SP(-56.222367594122474, 56.862880982139544, -2.10286807408413){0};
T3(-56.222367594122474, 56.862880982139544, 2.89713192591587, 0){"57"};
SP(-30.609439446006824, 74.20320545976483, 1.5042977712461028){0};
T3(-30.609439446006824, 74.20320545976483, 6.504297771246103, 0){"58"};
SP(62.799509011370326, 39.06701826120626, -30.081258920470177){0};
T3(62.799509011370326, 39.06701826120626, -25.081258920470177, 0){"59"};
SP(71.73846520577999, 13.81793927982, -33.54117174781302){0};
T3(71.73846520577999, 13.81793927982, -28.541171747813017, 0){"60"};
SP(70.61007165389445, -24.32343318351978, -28.396915710892635){0};
T3(70.61007165389445, -24.32343318351978, -23.396915710892635, 0){"61"};
SP(55.835546247906535, -49.623908127365674, -28.867735223008076){0};
T3(55.835546247906535, -49.623908127365674, -23.867735223008076, 0){"62"};
SP(29.529781540638705, -68.37862154444517, -27.89188109358834){0};
T3(29.529781540638705, -68.37862154444517, -22.89188109358834, 0){"63"};
SP(0.5480890709986055, -74.17339624091116, -29.21425800443725){0};
T3(0.5480890709986055, -74.17339624091116, -24.21425800443725, 0){"64"};
SP(-30.16896636111985, -68.69621575884527, -27.979679620278244){0};
T3(-30.16896636111985, -68.69621575884527, -22.979679620278244, 0){"65"};
SP(-57.03088659295168, -49.22815961486589, -28.166644844722203){0};
T3(-57.03088659295168, -49.22815961486589, -23.166644844722203, 0){"66"};
SP(-70.97782058796639, -24.485976939562292, -28.13651787420092){0};
T3(-70.97782058796639, -24.485976939562292, -23.13651787420092, 0){"67"};
SP(-72.38484289092496, 10.289011903391911, -32.24438382657725){0};
T3(-72.38484289092496, 10.289011903391911, -27.24438382657725, 0){"68"};
SP(-63.951655728651666, 38.19436632530325, -30.164132713944674){0};
T3(-63.951655728651666, 38.19436632530325, -25.164132713944674, 0){"69"};
SP(-59.39113343709805, 16.2621780925495, -49.90657727343141){0};
T3(-59.39113343709805, 16.2621780925495, -44.90657727343141, 0){"70"};
SP(61.18617515096907, 16.890967785548362, -50.15072544116368){0};
T3(61.18617515096907, 16.890967785548362, -45.15072544116368, 0){"71"};
};
myView = PostProcessing.NbViews-1;
View[myView].PointType=1;
View[myView].PointSize=6;
View[myView].LineType=1;
View[myView].LineWidth=2;
