View""{
SP(-22.57145109642959, 77.54449917902033, 1.1187141954160622){0};
T3(-22.57145109642959, 77.54449917902033, 6.118714195416063, 0){"Fp1"};
SP(26.465600854835667, 75.88076409343637, 1.34841706054016){0};
T3(26.465600854835667, 75.88076409343637, 6.34841706054016, 0){"Fp2"};
SP(-1.1138203131535107, 53.48604792849528, 59.41763685433703){0};
T3(-1.1138203131535107, 53.48604792849528, 64.41763685433703, 0){"Fz"};
SP(-39.670285080781554, 59.96990760993872, 34.16966437072083){0};
T3(-39.670285080781554, 59.96990760993872, 39.16966437072083, 0){"F3"};
SP(41.546302061184036, 59.40646733343307, 34.897753826377226){0};
T3(41.546302061184036, 59.40646733343307, 39.897753826377226, 0){"F4"};
SP(-63.84204112437891, 47.637273921022135, -5.83144942813839){0};
T3(-63.84204112437891, 47.637273921022135, -0.8314494281383897, 0){"F7"};
SP(65.0512362592346, 46.43602330894476, -6.933683050058047){0};
T3(65.0512362592346, 46.43602330894476, -1.9336830500580469, 0){"F8"};
SP(-0.218247073901348, 0.7988144438405094, 80.70658903660717){0};
T3(-0.218247073901348, 0.7988144438405094, 85.70658903660717, 0){"Cz"};
SP(-56.93354604206787, 2.554790480363032, 56.269725658058){0};
T3(-56.93354604206787, 2.554790480363032, 61.269725658058, 0){"C3"};
SP(55.872808999892406, 0.7758850993421884, 56.438113245389225){0};
T3(55.872808999892406, 0.7758850993421884, 61.438113245389225, 0){"C4"};
SP(-78.98002233180635, 0.5883110626338373, -13.707131203562227){0};
T3(-78.98002233180635, 0.5883110626338373, -8.707131203562227, 0){"T7"};
SP(79.1230534193794, -4.159476468783215, -11.219418581975606){0};
T3(79.1230534193794, -4.159476468783215, -6.2194185819756065, 0){"T8"};
SP(-0.7846702605087263, -45.492226908430595, 65.50501770689027){0};
T3(-0.7846702605087263, -45.492226908430595, 70.50501770689027, 0){"Pz"};
SP(-41.3496994646902, -54.25559373705265, 42.53666265356704){0};
T3(-41.3496994646902, -54.25559373705265, 47.53666265356704, 0){"P3"};
SP(38.82244697398815, -54.40445887394233, 44.106135790551534){0};
T3(38.82244697398815, -54.40445887394233, 49.106135790551534, 0){"P4"};
SP(-67.93000562473598, -41.79629579412721, -5.167368148379801){0};
T3(-67.93000562473598, -41.79629579412721, -0.16736814837980063, 0){"P7"};
SP(66.40271380647414, -44.95107663974412, -1.436021908129459){0};
T3(66.40271380647414, -44.95107663974412, 3.563978091870541, 0){"P8"};
SP(-29.186010343482096, -74.35491452164523, 7.051424378590031){0};
T3(-29.186010343482096, -74.35491452164523, 12.051424378590031, 0){"O1"};
SP(25.41701771635641, -74.89296191118756, 9.12550135474897){0};
T3(25.41701771635641, -74.89296191118756, 14.12550135474897, 0){"O2"};
SP(-0.35895728756326184, 74.51437851879248, -30.696070909887297){0};
T3(-0.35895728756326184, 74.51437851879248, -25.696070909887297, 0){"Nz"};
SP(-0.09683969245441126, -72.89370777030848, -32.740385402162886){0};
T3(-0.09683969245441126, -72.89370777030848, -27.740385402162886, 0){"Iz"};
SP(-68.11175815663152, 2.4816033912483, -42.59966703703585){0};
T3(-68.11175815663152, 2.4816033912483, -37.59966703703585, 0){"LPA"};
SP(68.21323212334929, 2.2380383261045242, -41.37998298985744){0};
T3(68.21323212334929, 2.2380383261045242, -36.37998298985744, 0){"RPA"};
};
myView = PostProcessing.NbViews-1;
View[myView].PointType=1;
View[myView].PointSize=6;
View[myView].LineType=1;
View[myView].LineWidth=2;
