View""{
SP(26.10555260098772, -52.11229059625392, 54.54916777115111){0};
T3(26.10555260098772, -52.11229059625392, 59.54916777115111, 0){"P2"};
SP(-0.1760173900736091, -72.85104297663082, 33.73412592709075){0};
T3(-0.1760173900736091, -72.85104297663082, 38.73412592709075, 0){"POz"};
SP(-47.467304937150715, -50.4178195292253, 40.28400874751973){0};
T3(-47.467304937150715, -50.4178195292253, 45.28400874751973, 0){"P3"};
SP(-0.669519277350717, -53.33482121916529, 60.30767197162852){0};
T3(-0.669519277350717, -53.33482121916529, 65.30767197162852, 0){"Pz"};
SP(-0.2481478321281504, 30.808832098609425, 73.21438995109975){0};
T3(-0.2481478321281504, 30.808832098609425, 78.21438995109975, 0){"FCz"};
SP(-73.179521484714, 22.09724134713975, 20.927234285867964){0};
T3(-73.179521484714, 22.09724134713975, 25.927234285867964, 0){"FC5"};
SP(-0.1365587635650929, 75.1392078648354, -29.45247931644851){0};
T3(-0.1365587635650929, 75.1392078648354, -24.45247931644851, 0){"Nz"};
SP(-21.85057020340557, -52.61877730459504, 56.32909264222406){0};
T3(-21.85057020340557, -52.61877730459504, 61.32909264222406, 0){"P1"};
SP(61.196262384939814, -48.04018358136257, 16.698295325827967){0};
T3(61.196262384939814, -48.04018358136257, 21.698295325827967, 0){"P6"};
SP(25.358204670426932, -75.64008002436955, -3.3888433992615346){0};
T3(25.358204670426932, -75.64008002436955, 1.6111566007384654, 0){"O2"};
SP(-25.77872188423962, -75.88573716195458, -4.001437726440544){0};
T3(-25.77872188423962, -75.88573716195458, 0.9985622735594557, 0){"O1"};
SP(-0.9482446425010731, 80.02121277597274, 2.847222397648508){0};
T3(-0.9482446425010731, 80.02121277597274, 7.847222397648508, 0){"Fpz"};
SP(48.69885838197174, -50.634501427476636, 39.485500630682154){0};
T3(48.69885838197174, -50.634501427476636, 44.485500630682154, 0){"P4"};
SP(-74.96660467857558, -25.609401046439626, -11.333877067065671){0};
T3(-74.96660467857558, -25.609401046439626, -6.333877067065671, 0){"TP7"};
SP(49.86097839417189, -63.05040284245916, -6.507017681120241){0};
T3(49.86097839417189, -63.05040284245916, -1.5070176811202414, 0){"PO8"};
SP(-77.33748283213598, 16.569411456585133, -10.197274522122072){0};
T3(-77.33748283213598, 16.569411456585133, -5.197274522122072, 0){"FT7"};
SP(78.74795230758744, 14.436502824385855, -8.7175221089928){0};
T3(78.74795230758744, 14.436502824385855, -3.7175221089927994, 0){"FT8"};
SP(0.34741394873009324, 54.04139886137223, 58.75946203080915){0};
T3(0.34741394873009324, 54.04139886137223, 63.75946203080915, 0){"Fz"};
SP(68.8364801420391, 3.7491484116043123, -40.420893215271455){0};
T3(68.8364801420391, 3.7491484116043123, -35.420893215271455, 0){"RPA"};
SP(-0.837088459756421, -28.16592316922676, 74.24419987184544){0};
T3(-0.837088459756421, -28.16592316922676, 79.24419987184544, 0){"CPz"};
SP(-57.69250545333203, -27.237431873957465, 48.72456448413561){0};
T3(-57.69250545333203, -27.237431873957465, 53.72456448413561, 0){"CP3"};
SP(54.171763065755215, 59.0123744380731, -4.816486229165755){0};
T3(54.171763065755215, 59.0123744380731, 0.18351377083424492, 0){"AF8"};
SP(-48.9827726440579, -62.3167011690848, -7.634427510815417){0};
T3(-48.9827726440579, -62.3167011690848, -2.634427510815417, 0){"PO7"};
SP(-62.32431267926004, 2.7749431188449725, 50.3590235051491){0};
T3(-62.32431267926004, 2.7749431188449725, 55.3590235051491, 0){"C3"};
SP(33.38193749831503, 2.521153033963724, 72.43003105368808){0};
T3(33.38193749831503, 2.521153033963724, 77.43003105368808, 0){"C2"};
SP(-35.56472191880658, 2.509424664943331, 72.09122922517581){0};
T3(-35.56472191880658, 2.509424664943331, 77.09122922517581, 0){"C1"};
SP(-53.63645092895433, 58.92095031333176, -5.904212715754855){0};
T3(-53.63645092895433, 58.92095031333176, -0.9042127157548547, 0){"AF7"};
SP(76.79752184534817, 3.2233563466235027, 23.236296790160754){0};
T3(76.79752184534817, 3.2233563466235027, 28.236296790160754, 0){"C6"};
SP(-76.58429595761955, 3.3904045824822906, 21.065291751796096){0};
T3(-76.58429595761955, 3.3904045824822906, 26.065291751796096, 0){"C5"};
SP(60.82306357015323, 2.7537555517077834, 51.75474934178283){0};
T3(60.82306357015323, 2.7537555517077834, 56.75474934178283, 0){"C4"};
SP(73.96945196660262, 21.178886309121, 22.682210397718165){0};
T3(73.96945196660262, 21.178886309121, 27.682210397718165, 0){"FC6"};
SP(-32.29027940772905, 30.366442823777803, 66.81381864464741){0};
T3(-32.29027940772905, 30.366442823777803, 71.81381864464741, 0){"FC1"};
SP(31.67454744484981, 29.949099511215433, 67.66463460881518){0};
T3(31.67454744484981, 29.949099511215433, 72.66463460881518, 0){"FC2"};
SP(-58.55616614218449, 27.450224193236053, 48.0508818710102){0};
T3(-58.55616614218449, 27.450224193236053, 53.0508818710102, 0){"FC3"};
SP(57.62165914179436, 26.083790372629895, 48.964471833124705){0};
T3(57.62165914179436, 26.083790372629895, 53.964471833124705, 0){"FC4"};
SP(-66.00162729931174, -44.63860805601825, -8.439816671175631){0};
T3(-66.00162729931174, -44.63860805601825, -3.439816671175631, 0){"P7"};
SP(79.65528352377345, 3.3334119879195216, -10.060191660988762){0};
T3(79.65528352377345, 3.3334119879195216, -5.060191660988762, 0){"T8"};
SP(-60.132870860431154, -48.09431955789846, 20.590418898201214){0};
T3(-60.132870860431154, -48.09431955789846, 25.590418898201214, 0){"P5"};
SP(-79.15804522954683, 3.7808431320229006, -11.20576678415234){0};
T3(-79.15804522954683, 3.7808431320229006, -6.20576678415234, 0){"T7"};
SP(66.1894159313397, -45.13936815413562, -9.103038357814098){0};
T3(66.1894159313397, -45.13936815413562, -4.103038357814098, 0){"P8"};
SP(-59.13073875163197, -36.6296733010649, -40.57842396257629){0};
T3(-59.13073875163197, -36.6296733010649, -35.57842396257629, 0){"P9"};
SP(-28.14954164835283, -70.34234972231766, 25.90905862918771){0};
T3(-28.14954164835283, -70.34234972231766, 30.90905862918771, 0){"PO3"};
SP(27.125111626361672, -70.12079690823255, 26.576615018635508){0};
T3(27.125111626361672, -70.12079690823255, 31.576615018635508, 0){"PO4"};
SP(39.25401058821021, 67.0473428166808, 17.398663532823623){0};
T3(39.25401058821021, 67.0473428166808, 22.398663532823623, 0){"AF4"};
SP(-48.731716535750486, 50.40451873665552, 38.10912659567344){0};
T3(-48.731716535750486, 50.40451873665552, 43.10912659567344, 0){"F3"};
SP(-30.132176696589617, 74.80366075175382, -1.5625081388657787){0};
T3(-30.132176696589617, 74.80366075175382, 3.4374918611342213, 0){"Fp1"};
SP(0.2768258715520857, -80.33025472935189, 0.4645223544098709){0};
T3(0.2768258715520857, -80.33025472935189, 5.464522354409871, 0){"Oz"};
SP(29.118354010311432, 75.21684994958751, -0.9591926519516001){0};
T3(29.118354010311432, 75.21684994958751, 4.0408073480484, 0){"Fp2"};
SP(-68.66182076201544, 3.636100941513148, -41.767210552948995){0};
T3(-68.66182076201544, 3.636100941513148, -36.767210552948995, 0){"LPA"};
SP(-26.56980151617489, 53.67015229639883, 52.9121048331458){0};
T3(-26.56980151617489, 53.67015229639883, 57.9121048331458, 0){"F1"};
SP(27.526625748516572, 52.50163311497482, 53.67529788183183){0};
T3(27.526625748516572, 52.50163311497482, 58.67529788183183, 0){"F2"};
SP(0.47227937632838746, -73.10350593031592, -32.22926018313011){0};
T3(0.47227937632838746, -73.10350593031592, -27.22926018313011, 0){"Iz"};
SP(50.191692281685675, 48.39332846078255, 39.27919921096649){0};
T3(50.191692281685675, 48.39332846078255, 44.27919921096649, 0){"F4"};
SP(-63.971323149431605, 44.960902457842344, 17.015342370804944){0};
T3(-63.971323149431605, 44.960902457842344, 22.015342370804944, 0){"F5"};
SP(65.44099412063859, 42.52988626577116, 18.167386472024624){0};
T3(65.44099412063859, 42.52988626577116, 23.167386472024624, 0){"F6"};
SP(-69.53039966105587, 37.80791367002104, -8.869255203240193){0};
T3(-69.53039966105587, 37.80791367002104, -3.8692552032401935, 0){"F7"};
SP(71.51981746885419, 35.55133697322184, -7.683394456997834){0};
T3(71.51981746885419, 35.55133697322184, -2.683394456997834, 0){"F8"};
SP(58.89344975713849, -36.268249762798575, -39.01044727944359){0};
T3(58.89344975713849, -36.268249762798575, -34.01044727944359, 0){"P10"};
SP(-72.6191562699585, -27.15409654270443, 21.265158961056088){0};
T3(-72.6191562699585, -27.15409654270443, 26.265158961056088, 0){"CP5"};
SP(-1.0737457681352023, 2.3276491757514313, 80.75146583011002){0};
T3(-1.0737457681352023, 2.3276491757514313, 85.75146583011002, 0){"Cz"};
SP(-1.1096977233775824, 73.45545030633359, 32.83931463176932){0};
T3(-1.1096977233775824, 73.45545030633359, 37.83931463176932, 0){"AFz"};
SP(-32.2077654634333, -28.256686072442655, 67.7617515373356){0};
T3(-32.2077654634333, -28.256686072442655, 72.7617515373356, 0){"CP1"};
SP(30.63067303110873, -28.712737257756505, 69.27112035592675){0};
T3(30.63067303110873, -28.712737257756505, 74.27112035592675, 0){"CP2"};
SP(75.74898602768292, -25.878496878584205, -9.476710056035119){0};
T3(75.74898602768292, -25.878496878584205, -4.4767100560351185, 0){"TP8"};
SP(56.43967329586039, -27.509807878044107, 50.16993067692597){0};
T3(56.43967329586039, -27.509807878044107, 55.16993067692597, 0){"CP4"};
SP(-40.59989349190517, 67.74476817670818, 15.471875692596138){0};
T3(-40.59989349190517, 67.74476817670818, 20.471875692596136, 0){"AF3"};
SP(71.79330682674747, -27.241742357668628, 22.720551350471208){0};
T3(71.79330682674747, -27.241742357668628, 27.720551350471208, 0){"CP6"};
};
myView = PostProcessing.NbViews-1;
View[myView].PointType=1;
View[myView].PointSize=6;
View[myView].LineType=1;
View[myView].LineWidth=2;
