View""{
SP(-0.9824614387357483, 73.87700992148764, -30.687103466678625){0};
T3(-0.9824614387357483, 73.87700992148764, -25.687103466678625, 0){"Nz"};
SP(-0.0896864886931017, -73.03745104063059, -32.91408305489334){0};
T3(-0.0896864886931017, -73.03745104063059, -27.91408305489334, 0){"Iz"};
SP(-67.53743131059571, 2.6210243439076684, -42.05900998599507){0};
T3(-67.53743131059571, 2.6210243439076684, -37.05900998599507, 0){"LPA"};
SP(68.81783095362643, 2.089716183640114, -41.51259393780954){0};
T3(68.81783095362643, 2.089716183640114, -36.51259393780954, 0){"RPA"};
};
myView = PostProcessing.NbViews-1;
View[myView].PointType=1;
View[myView].PointSize=6;
View[myView].LineType=1;
View[myView].LineWidth=2;
