View""{
SP(-24.21540242706952, 76.8039971222246, -2.975003413361768){0};
T3(-24.21540242706952, 76.8039971222246, 2.024996586638232, 0){"Fp1"};
SP(24.614587230903865, 76.44674785165965, -2.499908492030918){0};
T3(24.614587230903865, 76.44674785165965, 2.500091507969082, 0){"Fp2"};
SP(-1.1417119299963505, 57.49652067420356, 55.40365232934553){0};
T3(-1.1417119299963505, 57.49652067420356, 60.40365232934553, 0){"Fz"};
SP(-44.75419209859591, 57.00203446200673, 32.511209487422086){0};
T3(-44.75419209859591, 57.00203446200673, 37.511209487422086, 0){"F3"};
SP(43.60556205223199, 57.29380321210313, 35.26203625385713){0};
T3(43.60556205223199, 57.29380321210313, 40.26203625385713, 0){"F4"};
SP(-61.763257914046314, 49.38007824121533, -10.786176135967978){0};
T3(-61.763257914046314, 49.38007824121533, -5.7861761359679775, 0){"F7"};
SP(62.04637417419754, 49.83262581568246, -10.061333140723669){0};
T3(62.04637417419754, 49.83262581568246, -5.061333140723669, 0){"F8"};
SP(-1.0057758144234814, 3.955764479257451, 80.76061707849523){0};
T3(-1.0057758144234814, 3.955764479257451, 85.76061707849523, 0){"Cz"};
SP(-61.33596959712575, 4.792138963521703, 51.625708137160345){0};
T3(-61.33596959712575, 4.792138963521703, 56.625708137160345, 0){"C3"};
SP(61.08001115981324, 4.2425598107488, 51.473183821952254){0};
T3(61.08001115981324, 4.2425598107488, 56.473183821952254, 0){"C4"};
SP(-78.80636680428094, 4.925321122066382, -12.760937778092403){0};
T3(-78.80636680428094, 4.925321122066382, -7.760937778092403, 0){"T7"};
SP(79.16855198689305, 3.360346550451034, -12.130515565598737){0};
T3(79.16855198689305, 3.360346550451034, -7.130515565598737, 0){"T8"};
SP(-0.8279192799572019, -52.60262316731007, 61.07554459181847){0};
T3(-0.8279192799572019, -52.60262316731007, 66.07554459181847, 0){"Pz"};
SP(-48.00758226568956, -50.00179248609808, 40.12207439333211){0};
T3(-48.00758226568956, -50.00179248609808, 45.12207439333211, 0){"P3"};
SP(47.86825289508823, -50.195671873277654, 40.86967637605016){0};
T3(47.86825289508823, -50.195671873277654, 45.86967637605016, 0){"P4"};
SP(-67.42400254106548, -41.48302662482865, -10.547830210152963){0};
T3(-67.42400254106548, -41.48302662482865, -5.547830210152963, 0){"P7"};
SP(67.51251167938791, -43.25345498967821, -9.803971367389988){0};
T3(67.51251167938791, -43.25345498967821, -4.8039713673899875, 0){"P8"};
SP(-25.534245999408057, -75.98460663692457, -4.760932296479053){0};
T3(-25.534245999408057, -75.98460663692457, 0.23906770352094675, 0){"O1"};
SP(26.384989874047022, -75.12692985778838, -4.453231592778895){0};
T3(26.384989874047022, -75.12692985778838, 0.546768407221105, 0){"O2"};
SP(-0.8982250588711889, 80.14693541369114, 0.5122388372904743){0};
T3(-0.8982250588711889, 80.14693541369114, 5.512238837290474, 0){"Fpz"};
SP(-0.9808438297519366, 73.94488493308361, 31.611052380559887){0};
T3(-0.9808438297519366, 73.94488493308361, 36.61105238055988, 0){"AFz"};
SP(-35.336773929850956, 69.58896957564392, 20.39686944500295){0};
T3(-35.336773929850956, 69.58896957564392, 25.39686944500295, 0){"AF3"};
SP(33.28311434830079, 69.31232186454368, 20.77462162256516){0};
T3(33.28311434830079, 69.31232186454368, 25.77462162256516, 0){"AF4"};
SP(-45.49146907017234, 65.40870885948944, -7.167562912703241){0};
T3(-45.49146907017234, 65.40870885948944, -2.167562912703241, 0){"AF7"};
SP(45.95763773468432, 65.01935498697274, -6.383631014897289){0};
T3(45.95763773468432, 65.01935498697274, -1.383631014897289, 0){"AF8"};
SP(-26.75938615695165, 59.128482866829295, 46.207047859748826){0};
T3(-26.75938615695165, 59.128482866829295, 51.207047859748826, 0){"F1"};
SP(24.02017973226974, 58.233245422036894, 49.25734951182905){0};
T3(24.02017973226974, 58.233245422036894, 54.25734951182905, 0){"F2"};
SP(-57.85446502695194, 53.50148656609282, 10.888995525010557){0};
T3(-57.85446502695194, 53.50148656609282, 15.888995525010557, 0){"F5"};
SP(57.80487507163647, 53.543586154259984, 13.543719314544914){0};
T3(57.80487507163647, 53.543586154259984, 18.543719314544916, 0){"F6"};
SP(-1.0887797327732824, 32.189081153230106, 72.70849138252213){0};
T3(-1.0887797327732824, 32.189081153230106, 77.70849138252213, 0){"FCz"};
SP(-33.21092607402549, 34.84735293728883, 63.95019819572221){0};
T3(-33.21092607402549, 34.84735293728883, 68.95019819572221, 0){"FC1"};
SP(30.59754714365226, 34.112521245985526, 65.87913477325154){0};
T3(30.59754714365226, 34.112521245985526, 70.87913477325154, 0){"FC2"};
SP(-56.92032653441749, 35.02256130590834, 44.91125338476028){0};
T3(-56.92032653441749, 35.02256130590834, 49.91125338476028, 0){"FC3"};
SP(56.30913693301047, 33.25113446038769, 46.35957180969579){0};
T3(56.30913693301047, 33.25113446038769, 51.35957180969579, 0){"FC4"};
SP(-71.2013158415537, 32.726133200955175, 14.84825319205792){0};
T3(-71.2013158415537, 32.726133200955175, 19.848253192057918, 0){"FC5"};
SP(70.91041948369285, 33.406531695146604, 18.255232131302876){0};
T3(70.91041948369285, 33.406531695146604, 23.255232131302876, 0){"FC6"};
SP(-73.04771250523824, 29.794705400825883, -14.727388068075879){0};
T3(-73.04771250523824, 29.794705400825883, -9.727388068075879, 0){"FT7"};
SP(73.52008584246818, 28.744218426573863, -14.585110524054704){0};
T3(73.52008584246818, 28.744218426573863, -9.585110524054704, 0){"FT8"};
SP(-34.54697511970196, 5.431233501667492, 72.50229645242104){0};
T3(-34.54697511970196, 5.431233501667492, 77.50229645242104, 0){"C1"};
SP(32.683235234654454, 3.8413671894264185, 72.81855595507758){0};
T3(32.683235234654454, 3.8413671894264185, 77.81855595507758, 0){"C2"};
SP(-76.8423540220837, 3.8763459761383454, 20.059206933185173){0};
T3(-76.8423540220837, 3.8763459761383454, 25.059206933185173, 0){"C5"};
SP(77.3833723310514, 4.230102561721846, 20.93363426826511){0};
T3(77.3833723310514, 4.230102561721846, 25.93363426826511, 0){"C6"};
SP(-0.747505339835687, -25.2346344721914, 75.37585028141268){0};
T3(-0.747505339835687, -25.2346344721914, 80.37585028141268, 0){"CPz"};
SP(-31.962575887254065, -24.727004049135488, 69.31511829382089){0};
T3(-31.962575887254065, -24.727004049135488, 74.31511829382089, 0){"CP1"};
SP(30.823618088519506, -27.493600936023743, 69.50331131824638){0};
T3(30.823618088519506, -27.493600936023743, 74.50331131824638, 0){"CP2"};
SP(-57.68858460050562, -25.578256737855803, 49.88131582035279){0};
T3(-57.68858460050562, -25.578256737855803, 54.88131582035279, 0){"CP3"};
SP(57.192950121101376, -26.729492294275346, 49.84257641669814){0};
T3(57.192950121101376, -26.729492294275346, 54.84257641669814, 0){"CP4"};
SP(-74.35499846964984, -22.760083093122002, 21.30630275923179){0};
T3(-74.35499846964984, -22.760083093122002, 26.30630275923179, 0){"CP5"};
SP(73.13196884286737, -24.35015433089842, 21.405862045911515){0};
T3(73.13196884286737, -24.35015433089842, 26.405862045911515, 0){"CP6"};
SP(-76.60134138306783, -19.836611638754345, -12.258259996375287){0};
T3(-76.60134138306783, -19.836611638754345, -7.258259996375287, 0){"TP7"};
SP(76.62188839054443, -20.433401349305967, -12.18785508031078){0};
T3(76.62188839054443, -20.433401349305967, -7.187855080310779, 0){"TP8"};
SP(-25.389577197299868, -51.72662155130437, 55.95976965611891){0};
T3(-25.389577197299868, -51.72662155130437, 60.95976965611891, 0){"P1"};
SP(25.794733060241313, -51.5860286477821, 55.12513053524759){0};
T3(25.794733060241313, -51.5860286477821, 60.12513053524759, 0){"P2"};
SP(-61.36658755260941, -48.00842740759797, 16.184519571238216){0};
T3(-61.36658755260941, -48.00842740759797, 21.184519571238216, 0){"P5"};
SP(61.226845947893835, -47.78145882163835, 17.442759609525936){0};
T3(61.226845947893835, -47.78145882163835, 22.442759609525936, 0){"P6"};
SP(-0.42660586108422827, -72.3268429030845, 34.864835851745255){0};
T3(-0.42660586108422827, -72.3268429030845, 39.864835851745255, 0){"POz"};
SP(-34.86855068433625, -67.5402433791701, 25.437668406739046){0};
T3(-34.86855068433625, -67.5402433791701, 30.437668406739046, 0){"PO3"};
SP(35.808573356055646, -66.622574968692, 25.94485158255962){0};
T3(35.808573356055646, -66.622574968692, 30.94485158255962, 0){"PO4"};
SP(-50.25649458012124, -61.412906543324766, -6.997267378013698){0};
T3(-50.25649458012124, -61.412906543324766, -1.9972673780136976, 0){"PO7"};
SP(49.31098755330927, -63.45771964555961, -6.449657017515796){0};
T3(49.31098755330927, -63.45771964555961, -1.4496570175157961, 0){"PO8"};
SP(-0.185946220400256, -80.23196197951094, 1.5306393261503661){0};
T3(-0.185946220400256, -80.23196197951094, 6.530639326150366, 0){"Oz"};
SP(-0.35895728756326184, 74.51437851879248, -30.696070909887297){0};
T3(-0.35895728756326184, 74.51437851879248, -25.696070909887297, 0){"Nz"};
SP(-0.09683969245441126, -72.89370777030848, -32.740385402162886){0};
T3(-0.09683969245441126, -72.89370777030848, -27.740385402162886, 0){"Iz"};
SP(-68.11175815663152, 2.4816033912483, -42.59966703703585){0};
T3(-68.11175815663152, 2.4816033912483, -37.59966703703585, 0){"LPA"};
SP(68.21323212334929, 2.2380383261045242, -41.37998298985744){0};
T3(68.21323212334929, 2.2380383261045242, -36.37998298985744, 0){"RPA"};
};
myView = PostProcessing.NbViews-1;
View[myView].PointType=1;
View[myView].PointSize=6;
View[myView].LineType=1;
View[myView].LineWidth=2;
