View""{
SP(-0.35895728756326184, 74.51437851879248, -30.696070909887297){0};
T3(-0.35895728756326184, 74.51437851879248, -25.696070909887297, 0){"Nz"};
SP(-0.09683969245441126, -72.89370777030848, -32.740385402162886){0};
T3(-0.09683969245441126, -72.89370777030848, -27.740385402162886, 0){"Iz"};
SP(-68.11175815663152, 2.4816033912483, -42.59966703703585){0};
T3(-68.11175815663152, 2.4816033912483, -37.59966703703585, 0){"LPA"};
SP(68.21323212334929, 2.2380383261045242, -41.37998298985744){0};
T3(68.21323212334929, 2.2380383261045242, -36.37998298985744, 0){"RPA"};
};
myView = PostProcessing.NbViews-1;
View[myView].PointType=1;
View[myView].PointSize=6;
View[myView].LineType=1;
View[myView].LineWidth=2;
