View""{
SP(25.881631209687892, -52.44827553642398, 54.760665194436605){0};
T3(25.881631209687892, -52.44827553642398, 59.760665194436605, 0){"P2"};
SP(-0.1969569082239495, -72.24260355526441, 33.60607348008466){0};
T3(-0.1969569082239495, -72.24260355526441, 38.60607348008466, 0){"POz"};
SP(-48.00059211640495, -50.68604261438929, 40.73791448211121){0};
T3(-48.00059211640495, -50.68604261438929, 45.73791448211121, 0){"P3"};
SP(-0.30943637524295914, -53.0540928708911, 60.070928949639615){0};
T3(-0.30943637524295914, -53.0540928708911, 65.07092894963961, 0){"Pz"};
SP(-0.24676098403581648, 30.909270633683093, 73.47915627124449){0};
T3(-0.24676098403581648, 30.909270633683093, 78.47915627124449, 0){"FCz"};
SP(-73.63833159950127, 22.649679784925503, 21.139317416631535){0};
T3(-73.63833159950127, 22.649679784925503, 26.139317416631535, 0){"FC5"};
SP(-0.8762554084375521, 74.52624188031973, -29.280782018406832){0};
T3(-0.8762554084375521, 74.52624188031973, -24.280782018406832, 0){"Nz"};
SP(-21.60556686622202, -52.36129881134586, 56.28172573160277){0};
T3(-21.60556686622202, -52.36129881134586, 61.28172573160277, 0){"P1"};
SP(61.42995427807016, -48.339763368890026, 16.77430392670475){0};
T3(61.42995427807016, -48.339763368890026, 21.77430392670475, 0){"P6"};
SP(25.474693322102603, -76.23154011676858, -3.2921063725976265){0};
T3(25.474693322102603, -76.23154011676858, 1.7078936274023735, 0){"O2"};
SP(-25.911182839192264, -76.22917051017545, -4.29512991367294){0};
T3(-25.911182839192264, -76.22917051017545, 0.7048700863270598, 0){"O1"};
SP(-0.7961563024543552, 79.80248093511656, 3.049908017800144){0};
T3(-0.7961563024543552, 79.80248093511656, 8.049908017800144, 0){"Fpz"};
SP(48.482367504581156, -50.28171780247982, 39.234472282468886){0};
T3(48.482367504581156, -50.28171780247982, 44.234472282468886, 0){"P4"};
SP(-75.43085710361254, -25.655135642274445, -11.33827610663378){0};
T3(-75.43085710361254, -25.655135642274445, -6.33827610663378, 0){"TP7"};
SP(49.26716969670938, -62.6862833482845, -6.4415517799425706){0};
T3(49.26716969670938, -62.6862833482845, -1.4415517799425706, 0){"PO8"};
SP(-77.72687587970776, 16.47317323076942, -10.329411290947766){0};
T3(-77.72687587970776, 16.47317323076942, -5.329411290947766, 0){"FT7"};
SP(77.85003928956799, 14.651446621123338, -8.905370365021511){0};
T3(77.85003928956799, 14.651446621123338, -3.9053703650215112, 0){"FT8"};
SP(0.3078897631513584, 54.217674373914356, 58.90780391697795){0};
T3(0.3078897631513584, 54.217674373914356, 63.90780391697795, 0){"Fz"};
SP(69.11637526408471, 3.529046459913882, -40.83510436956267){0};
T3(69.11637526408471, 3.529046459913882, -35.83510436956267, 0){"RPA"};
SP(-0.9524097641446163, -28.400865453810205, 75.25048770658432){0};
T3(-0.9524097641446163, -28.400865453810205, 80.25048770658432, 0){"CPz"};
SP(-57.09787607837846, -27.22672825624942, 48.61674051128137){0};
T3(-57.09787607837846, -27.22672825624942, 53.61674051128137, 0){"CP3"};
SP(54.51655530160592, 59.45745865601479, -4.902932113732025){0};
T3(54.51655530160592, 59.45745865601479, 0.09706788626797458, 0){"AF8"};
SP(-49.21932562720709, -62.58086397855313, -7.6511973461029115){0};
T3(-49.21932562720709, -62.58086397855313, -2.6511973461029115, 0){"PO7"};
SP(-62.21692997103299, 2.8201716363320046, 50.31031297330731){0};
T3(-62.21692997103299, 2.8201716363320046, 55.31031297330731, 0){"C3"};
SP(33.47698899984287, 2.518954498203769, 72.61029701580556){0};
T3(33.47698899984287, 2.518954498203769, 77.61029701580556, 0){"C2"};
SP(-35.42864723466754, 2.5029761332872424, 71.89062662854859){0};
T3(-35.42864723466754, 2.5029761332872424, 76.89062662854859, 0){"C1"};
SP(-53.929999804160424, 59.02578761147364, -5.945135188068047){0};
T3(-53.929999804160424, 59.02578761147364, -0.945135188068047, 0){"AF7"};
SP(76.98744612308028, 3.127004317529095, 22.85050534326161){0};
T3(76.98744612308028, 3.127004317529095, 27.85050534326161, 0){"C6"};
SP(-77.7760793593314, 3.3616648135430776, 21.2972816643225){0};
T3(-77.7760793593314, 3.3616648135430776, 26.2972816643225, 0){"C5"};
SP(61.12682430884087, 2.7276362088496504, 52.020285876668076){0};
T3(61.12682430884087, 2.7276362088496504, 57.020285876668076, 0){"C4"};
SP(73.73666205546341, 20.902171584056852, 22.36105325911555){0};
T3(73.73666205546341, 20.902171584056852, 27.36105325911555, 0){"FC6"};
SP(-32.32389973559545, 30.615002702792086, 67.33322633015383){0};
T3(-32.32389973559545, 30.615002702792086, 72.33322633015383, 0){"FC1"};
SP(31.6187241706562, 29.597173900946395, 66.84036060231456){0};
T3(31.6187241706562, 29.597173900946395, 71.84036060231456, 0){"FC2"};
SP(-57.458723614825914, 27.326316303779038, 47.623019760119895){0};
T3(-57.458723614825914, 27.326316303779038, 52.623019760119895, 0){"FC3"};
SP(57.826729110063084, 26.15111733664098, 48.899592006265266){0};
T3(57.826729110063084, 26.15111733664098, 53.899592006265266, 0){"FC4"};
SP(-65.99494701102586, -44.74436290749432, -8.440109639538493){0};
T3(-65.99494701102586, -44.74436290749432, -3.440109639538493, 0){"P7"};
SP(79.2606377757946, 3.523143412880353, -9.347035352506495){0};
T3(79.2606377757946, 3.523143412880353, -4.347035352506495, 0){"T8"};
SP(-60.761911639256596, -48.58875538401257, 20.78271000477482){0};
T3(-60.761911639256596, -48.58875538401257, 25.78271000477482, 0){"P5"};
SP(-79.20116931315695, 3.901029682660676, -10.93145566630136){0};
T3(-79.20116931315695, 3.901029682660676, -5.9314556663013605, 0){"T7"};
SP(65.61368049200377, -44.421972580143915, -8.974624684490013){0};
T3(65.61368049200377, -44.421972580143915, -3.9746246844900135, 0){"P8"};
SP(-58.79667807180738, -36.83438779046072, -40.953712990247055){0};
T3(-58.79667807180738, -36.83438779046072, -35.953712990247055, 0){"P9"};
SP(-28.2923514788721, -70.49088128295703, 26.118236560998987){0};
T3(-28.2923514788721, -70.49088128295703, 31.118236560998987, 0){"PO3"};
SP(27.33594634682734, -70.95722948062266, 26.8213685214522){0};
T3(27.33594634682734, -70.95722948062266, 31.8213685214522, 0){"PO4"};
SP(39.17016917393028, 66.92135946171246, 17.541803937553425){0};
T3(39.17016917393028, 66.92135946171246, 22.541803937553425, 0){"AF4"};
SP(-48.95941306033552, 50.3461348578714, 38.213636197888334){0};
T3(-48.95941306033552, 50.3461348578714, 43.213636197888334, 0){"F3"};
SP(-29.870433311583373, 74.50780605871783, -1.7060959177916604){0};
T3(-29.870433311583373, 74.50780605871783, 3.2939040822083396, 0){"Fp1"};
SP(0.31277219433667014, -80.03056263124937, -0.02652284798029214){0};
T3(0.31277219433667014, -80.03056263124937, 4.973477152019708, 0){"Oz"};
SP(28.95575722632285, 74.64699441106022, -1.2566654073415942){0};
T3(28.95575722632285, 74.64699441106022, 3.743334592658406, 0){"Fp2"};
SP(-68.1283343526232, 3.7651817917635766, -41.26539258357696){0};
T3(-68.1283343526232, 3.7651817917635766, -36.26539258357696, 0){"LPA"};
SP(-26.719200099491736, 53.94172566574254, 53.21538798259872){0};
T3(-26.719200099491736, 53.94172566574254, 58.21538798259872, 0){"F1"};
SP(27.489955180484174, 52.42040929009981, 53.59445099707483){0};
T3(27.489955180484174, 52.42040929009981, 58.59445099707483, 0){"F2"};
SP(0.4758389390057225, -73.17892635663975, -32.37159908842519){0};
T3(0.4758389390057225, -73.17892635663975, -27.371599088425192, 0){"Iz"};
SP(49.78746983901045, 48.04004039563223, 38.890997440485975){0};
T3(49.78746983901045, 48.04004039563223, 43.890997440485975, 0){"F4"};
SP(-63.13261114199037, 44.63513444681722, 16.80394178716021){0};
T3(-63.13261114199037, 44.63513444681722, 21.80394178716021, 0){"F5"};
SP(65.20730799303644, 42.46315759953381, 18.200423726010214){0};
T3(65.20730799303644, 42.46315759953381, 23.200423726010214, 0){"F6"};
SP(-70.08573591556765, 37.95916896443096, -8.692935721129215){0};
T3(-70.08573591556765, 37.95916896443096, -3.6929357211292153, 0){"F7"};
SP(71.44718637819925, 35.02952714934895, -7.948135670062013){0};
T3(71.44718637819925, 35.02952714934895, -2.9481356700620127, 0){"F8"};
SP(59.683240543746855, -36.767341538685926, -39.37344287649729){0};
T3(59.683240543746855, -36.767341538685926, -34.37344287649729, 0){"P10"};
SP(-72.35566505580533, -26.987033157072062, 21.176484116978877){0};
T3(-72.35566505580533, -26.987033157072062, 26.176484116978877, 0){"CP5"};
SP(-1.0901046857426298, 2.2727995024046725, 80.41322518249021){0};
T3(-1.0901046857426298, 2.2727995024046725, 85.41322518249021, 0){"Cz"};
SP(-0.9224297867765432, 73.00003138682222, 32.650109978473765){0};
T3(-0.9224297867765432, 73.00003138682222, 37.650109978473765, 0){"AFz"};
SP(-31.791431497533523, -28.187425071095873, 67.34725734646895){0};
T3(-31.791431497533523, -28.187425071095873, 72.34725734646895, 0){"CP1"};
SP(30.57048503938144, -28.03578386290052, 68.75047828226248){0};
T3(30.57048503938144, -28.03578386290052, 73.75047828226248, 0){"CP2"};
SP(74.98582275806211, -25.72172410224553, -9.380820762564918){0};
T3(74.98582275806211, -25.72172410224553, -4.380820762564918, 0){"TP8"};
SP(55.950895306875594, -27.513744472025113, 49.88238773425976){0};
T3(55.950895306875594, -27.513744472025113, 54.88238773425976, 0){"CP4"};
SP(-40.718870450097704, 67.77775713147105, 15.502888392992078){0};
T3(-40.718870450097704, 67.77775713147105, 20.502888392992077, 0){"AF3"};
SP(71.82205586034576, -27.162312422778527, 22.80590887844281){0};
T3(71.82205586034576, -27.162312422778527, 27.80590887844281, 0){"CP6"};
};
myView = PostProcessing.NbViews-1;
View[myView].PointType=1;
View[myView].PointSize=6;
View[myView].LineType=1;
View[myView].LineWidth=2;
