Electrode,-25.6179044567284,75.38647758661583,-5.501923438747995,Fp1
Electrode,-0.7061142004451066,79.74996143834491,-2.5729304098944557,Fpz
Electrode,24.163684861980723,76.07856660477705,-5.428721493013629,Fp2
Electrode,-47.083981630033584,64.69040181576081,-8.454890897337963,AF7
Electrode,-31.094442867035113,72.25339597097549,16.847509441986528,AF3
Electrode,-0.9137766915983319,74.57817252504235,27.79040281130319,AFz
Electrode,29.616418489241234,71.99968444731807,17.798270833971984,AF4
Electrode,46.442874267888016,64.77870791966792,-7.44964108057763,AF8
Electrode,-55.55900484236877,42.58869680043578,-39.3969622338871,F9
Electrode,-63.58407933183878,48.021287570585486,-10.220989741674751,F7
Electrode,-57.7863996728917,52.43047800487495,13.42424966295907,F5
Electrode,-46.003620849241734,56.78414564218498,33.766896516299305,F3
Electrode,-25.696980853075534,58.669178485408494,48.42586814136422,F1
Electrode,-0.8020639631789988,58.967958988265764,54.35138637559074,Fz
Electrode,24.37322170981163,58.30552171213103,49.09451375979177,F2
Electrode,44.68546270541515,55.84855205202942,34.695908206420555,F4
Electrode,58.3035300587893,53.259029977801426,14.938840648018111,F6
Electrode,63.581744849728864,48.39043464544388,-9.19586697664135,F8
Electrode,55.439333700136174,43.17616229374557,-37.847948624966705,F10
Electrode,-63.481935682712376,24.47872893597259,-41.34719566196622,FT9
Electrode,-74.59111069262327,27.06757076231041,-11.663492829874109,FT7
Electrode,-70.74055324021431,30.41427744934833,19.549960482998102,FC5
Electrode,-55.75026800039724,32.40514336312842,45.91586142577476,FC3
Electrode,-31.74281074602647,34.267842320168995,65.51887336342463,FC1
Electrode,-0.5911628231629624,34.10421645875921,72.15969436085516,FCz
Electrode,30.343447700073675,33.630560984062235,65.1611838858779,FC2
Electrode,55.45704800441897,32.339593778262895,47.32519871809451,FC4
Electrode,71.33941488285463,29.962515372040976,21.054114510228832,FC6
Electrode,74.19261161742139,27.219353181648845,-10.44536879945279,FT8
Electrode,64.84733173063098,24.609236920767277,-40.65348428059458,FT10
Electrode,-67.61855912871425,5.1616479970131826,-41.98766475021315,T9
Electrode,-79.0919537577866,4.130610735861451,-11.853281945630759,T7
Electrode,-77.92052814087884,4.436653029396531,20.4787665365257,C5
Electrode,-62.50142617843055,4.677897972768674,49.75544576764084,C3
Electrode,-35.63661985501996,4.985773803445967,71.60310794940065,C1
ReferenceElectrode,-0.9833909587596609,4.929439318392143,80.01972407056043,Cz
Electrode,33.86231202266861,4.831699047781278,72.29144786436464,C2
Electrode,61.68394922427151,4.269932093146396,51.49766551052114,C4
Electrode,77.16930542911598,4.168206997772053,21.83596346212359,C6
Electrode,79.19225351358438,3.4063708254663414,-10.406426707208425,T8
Electrode,68.55794584618698,4.5531193792657465,-41.72997676085443,T10
Electrode,-67.58150684842443,-15.670709648659958,-38.52095121385843,TP9
Electrode,-76.86475968562269,-20.321645573881476,-11.651842076267313,TP7
Electrode,-73.98278714177638,-22.43074184794358,21.450373979490223,CP5
Electrode,-58.40492620162584,-23.335957077094893,49.48191010538776,CP3
Electrode,-32.34944096081106,-24.695376011213,68.42120487857294,CP1
Electrode,-0.8348034564415465,-25.220105298877765,76.64867189592601,CPz
Electrode,31.408666993289152,-24.922395259980867,69.93926664772697,CP2
Electrode,57.094598710504364,-23.865621333117847,50.34258694495746,CP4
Electrode,73.38876156772552,-23.03278086266051,22.888015247258974,CP6
Electrode,76.41061399986428,-20.83346931945655,-9.852611061777292,TP8
Electrode,68.47781769371541,-16.81473324099126,-37.540343648295504,TP10
Electrode,-58.64564366637583,-36.410216261130856,-41.59805356863443,P9
Electrode,-67.03186911893354,-42.785713438824,-9.95957217064301,P7
Electrode,-63.267482269387855,-46.96091607115191,16.327968350463614,P5
Electrode,-50.023005217234676,-49.98396721748501,39.3264914315144,P3
Electrode,-27.54769630450359,-51.51347830198868,54.24330238102402,P1
Electrode,-0.8280018382787631,-52.80560945124963,60.26190544364091,Pz
Electrode,25.66669393670478,-52.12868434216129,55.132412291225144,P2
Electrode,48.32879719268611,-49.667338871119675,40.13266317555279,P4
Electrode,62.066952984843304,-47.33407282919884,17.66747280980303,P6
Electrode,66.57104298966898,-42.84926008783169,-8.606966028631415,P8
Electrode,59.15778155857385,-36.802491343702755,-40.0768548069913,P10
Electrode,-44.54347052523829,-54.34564918496684,-39.07188537458904,PO9
Electrode,-50.05247292835786,-61.83905483421237,-7.356216931467419,PO7
Electrode,-33.96783307700468,-68.79457035391601,21.50146161464689,PO3
Electrode,-0.7455149166935513,-72.48429010453835,33.0069729164527,POz
Electrode,33.28181957667235,-69.59313050994169,22.227197290460037,PO4
Electrode,49.82945324085288,-62.287501173386964,-6.313599472175673,PO8
Electrode,44.91391484446868,-54.171096332232544,-37.99454567626301,PO10
Electrode,-27.348799934193654,-75.60346137879866,-4.188845851128941,O1
Electrode,-0.1387934411284597,-79.96012660464397,-0.6292426687540331,Oz
Electrode,26.87968444802858,-75.76073032378787,-3.5401936415042865,O2
Electrode,-0.0896864886931017,-73.03745104063059,-32.91408305489334,Iz
Electrode,-24.1594970119703,-67.3061770137873,-36.0351095155023,I1
Electrode,24.193318855234182,-67.70301475370465,-35.8091477412106,I2
Fiducial,-0.9824614387357483,73.87700992148764,-30.687103466678625,Nz
Fiducial,-0.0896864886931017,-73.03745104063059,-32.91408305489334,Iz
Fiducial,-67.53743131059571,2.6210243439076684,-42.05900998599507,LPA
Fiducial,68.81783095362643,2.089716183640114,-41.51259393780954,RPA
