View""{
SP(-22.51245466801508, 76.64112740057232, 0.9059420561882792){0};
T3(-22.51245466801508, 76.64112740057232, 5.905942056188279, 0){"Fp1"};
SP(26.29316755640405, 75.508713151171, 1.5382648014643985){0};
T3(26.29316755640405, 75.508713151171, 6.538264801464399, 0){"Fp2"};
SP(-1.0548524892341642, 53.60031388555611, 59.50414656355124){0};
T3(-1.0548524892341642, 53.60031388555611, 64.50414656355125, 0){"Fz"};
SP(-40.147474350420296, 60.64025530659503, 34.55327987694365){0};
T3(-40.147474350420296, 60.64025530659503, 39.55327987694365, 0){"F3"};
SP(40.949205154422735, 58.59977494119665, 34.4473896826125){0};
T3(40.949205154422735, 58.59977494119665, 39.4473896826125, 0){"F4"};
SP(-64.01946492348547, 47.65676439052074, -5.852548254520034){0};
T3(-64.01946492348547, 47.65676439052074, -0.852548254520034, 0){"F7"};
SP(65.2847825982338, 46.37138850011925, -6.975890512760758){0};
T3(65.2847825982338, 46.37138850011925, -1.975890512760758, 0){"F8"};
SP(-0.23190850196600965, 0.8097037736821786, 80.52692405363432){0};
T3(-0.23190850196600965, 0.8097037736821786, 85.52692405363432, 0){"Cz"};
SP(-57.21375252384764, 2.5193710742202384, 56.46523925472196){0};
T3(-57.21375252384764, 2.5193710742202384, 61.46523925472196, 0){"C3"};
SP(56.35849614166852, 0.7789888632526774, 56.94686089084703){0};
T3(56.35849614166852, 0.7789888632526774, 61.94686089084703, 0){"C4"};
SP(-79.31486628537361, 0.7245008093478031, -13.497828364530715){0};
T3(-79.31486628537361, 0.7245008093478031, -8.497828364530715, 0){"T7"};
SP(79.22104209836195, -4.0202285748998925, -10.825826870526166){0};
T3(79.22104209836195, -4.0202285748998925, -5.825826870526166, 0){"T8"};
SP(-0.4418160531450487, -45.539658977053165, 65.80673989130165){0};
T3(-0.4418160531450487, -45.539658977053165, 70.80673989130165, 0){"Pz"};
SP(-41.28641911505156, -53.62647392505543, 42.39333925769135){0};
T3(-41.28641911505156, -53.62647392505543, 47.39333925769135, 0){"P3"};
SP(38.50283130322147, -54.32778481235069, 43.797807676537744){0};
T3(38.50283130322147, -54.32778481235069, 48.797807676537744, 0){"P4"};
SP(-68.23181485668064, -42.27746615651406, -5.217546621925491){0};
T3(-68.23181485668064, -42.27746615651406, -0.21754662192549112, 0){"P7"};
SP(65.84146093198764, -44.56372327017383, -1.7547883775706938){0};
T3(65.84146093198764, -44.56372327017383, 3.245211622429306, 0){"P8"};
SP(-29.23071621068809, -74.02476693066244, 7.103726153419851){0};
T3(-29.23071621068809, -74.02476693066244, 12.103726153419851, 0){"O1"};
SP(25.452094900588776, -76.12193745345223, 9.363997637027289){0};
T3(25.452094900588776, -76.12193745345223, 14.363997637027289, 0){"O2"};
SP(-0.9824614387357483, 73.87700992148764, -30.687103466678625){0};
T3(-0.9824614387357483, 73.87700992148764, -25.687103466678625, 0){"Nz"};
SP(-0.0896864886931017, -73.03745104063059, -32.91408305489334){0};
T3(-0.0896864886931017, -73.03745104063059, -27.91408305489334, 0){"Iz"};
SP(-67.53743131059571, 2.6210243439076684, -42.05900998599507){0};
T3(-67.53743131059571, 2.6210243439076684, -37.05900998599507, 0){"LPA"};
SP(68.81783095362643, 2.089716183640114, -41.51259393780954){0};
T3(68.81783095362643, 2.089716183640114, -36.51259393780954, 0){"RPA"};
};
myView = PostProcessing.NbViews-1;
View[myView].PointType=1;
View[myView].PointSize=6;
View[myView].LineType=1;
View[myView].LineWidth=2;
