View""{
SP(-24.294535671546605, 75.92871254143365, -2.78713077943968){0};
T3(-24.294535671546605, 75.92871254143365, 2.21286922056032, 0){"Fp1"};
SP(24.496783938362974, 76.00825396922956, -2.8871987024358177){0};
T3(24.496783938362974, 76.00825396922956, 2.1128012975641823, 0){"Fp2"};
SP(-1.1803057352689723, 57.779579537633, 55.66222872011218){0};
T3(-1.1803057352689723, 57.779579537633, 60.66222872011218, 0){"Fz"};
SP(-45.40743895671575, 57.7279273201542, 32.82565961399755){0};
T3(-45.40743895671575, 57.7279273201542, 37.82565961399755, 0){"F3"};
SP(43.1937894438853, 56.74764800634505, 34.95636047277084){0};
T3(43.1937894438853, 56.74764800634505, 39.95636047277084, 0){"F4"};
SP(-62.22386284123735, 49.760920322828454, -10.867350428094483){0};
T3(-62.22386284123735, 49.760920322828454, -5.867350428094483, 0){"F7"};
SP(62.24833125367321, 49.96862010725075, -10.120351672850894){0};
T3(62.24833125367321, 49.96862010725075, -5.120351672850894, 0){"F8"};
SP(-1.0162904369003591, 3.8983681965805492, 80.17209728806074){0};
T3(-1.0162904369003591, 3.8983681965805492, 85.17209728806074, 0){"Cz"};
SP(-61.13725446034114, 4.800672047090789, 51.517137111183686){0};
T3(-61.13725446034114, 4.800672047090789, 56.517137111183686, 0){"C3"};
SP(61.43302058665307, 4.211150575474847, 51.761638436103){0};
T3(61.43302058665307, 4.211150575474847, 56.761638436103, 0){"C4"};
SP(-78.93273825361034, 5.058326081870634, -12.485293412176214){0};
T3(-78.93273825361034, 5.058326081870634, -7.485293412176214, 0){"T7"};
SP(79.11920374854925, 3.533339549505369, -11.508957379325626){0};
T3(79.11920374854925, 3.533339549505369, -6.508957379325626, 0){"T8"};
SP(-0.47465976887060346, -52.268122205478804, 60.867929680828865){0};
T3(-0.47465976887060346, -52.268122205478804, 65.86792968082887, 0){"Pz"};
SP(-48.51415322699453, -50.403634912946515, 40.53580497501254){0};
T3(-48.51415322699453, -50.403634912946515, 45.53580497501254, 0){"P3"};
SP(47.679081265598484, -49.8575384608947, 40.49354067313231){0};
T3(47.679081265598484, -49.8575384608947, 45.49354067313231, 0){"P4"};
SP(-67.633402933028, -41.72370456127379, -10.592349506605457){0};
T3(-67.633402933028, -41.72370456127379, -5.592349506605457, 0){"P7"};
SP(66.69903994216797, -42.34868570036252, -9.633608577063606){0};
T3(66.69903994216797, -42.34868570036252, -4.633608577063606, 0){"P8"};
SP(-25.321864102145867, -76.27057222057338, -5.060368541630625){0};
T3(-25.321864102145867, -76.27057222057338, -0.060368541630625216, 0){"O1"};
SP(26.558276876721568, -75.86260868531674, -4.3681734815457){0};
T3(26.558276876721568, -75.86260868531674, 0.6318265184543002, 0){"O2"};
SP(-0.7407321391870882, 79.78130982992795, 0.7138674343435469){0};
T3(-0.7407321391870882, 79.78130982992795, 5.7138674343435465, 0){"Fpz"};
SP(-1.1042317692583197, 73.35746826412647, 31.56292686928664){0};
T3(-1.1042317692583197, 73.35746826412647, 36.56292686928664, 0){"AFz"};
SP(-35.29763655675918, 69.39985037376937, 20.223572850029726){0};
T3(-35.29763655675918, 69.39985037376937, 25.223572850029726, 0){"AF3"};
SP(33.139386000608845, 69.30441622337351, 20.63169546104434){0};
T3(33.139386000608845, 69.30441622337351, 25.63169546104434, 0){"AF4"};
SP(-45.94154213304494, 65.54275759746291, -7.03297933516356){0};
T3(-45.94154213304494, 65.54275759746291, -2.03297933516356, 0){"AF7"};
SP(46.03173028565023, 65.12630514796295, -6.220704158064569){0};
T3(46.03173028565023, 65.12630514796295, -1.220704158064569, 0){"AF8"};
SP(-27.041437734573137, 59.507197106247474, 46.54644937702373){0};
T3(-27.041437734573137, 59.507197106247474, 51.54644937702373, 0){"F1"};
SP(24.055849553849082, 58.28021809155302, 49.26397958685403){0};
T3(24.055849553849082, 58.28021809155302, 54.26397958685403, 0){"F2"};
SP(-57.6702766307547, 53.32054057076829, 10.854714699020136){0};
T3(-57.6702766307547, 53.32054057076829, 15.854714699020136, 0){"F5"};
SP(58.19067510872887, 53.880519756619876, 13.720097143514012){0};
T3(58.19067510872887, 53.880519756619876, 18.72009714351401, 0){"F6"};
SP(-1.0988298710347504, 32.280013438945026, 72.96347423463044){0};
T3(-1.0988298710347504, 32.280013438945026, 77.96347423463044, 0){"FCz"};
SP(-33.37504404607126, 35.05709487582546, 64.25642857204926){0};
T3(-33.37504404607126, 35.05709487582546, 69.25642857204926, 0){"FC1"};
SP(30.455640204735133, 33.72690382943861, 65.04367367801296){0};
T3(30.455640204735133, 33.72690382943861, 70.04367367801296, 0){"FC2"};
SP(-56.078483124066636, 34.4116551846549, 44.04525252465114){0};
T3(-56.078483124066636, 34.4116551846549, 49.04525252465114, 0){"FC3"};
SP(55.77998285672283, 33.22333980507289, 46.40790145732046){0};
T3(55.77998285672283, 33.22333980507289, 51.40790145732046, 0){"FC4"};
SP(-70.89793869257569, 32.51111947877939, 14.509145549249354){0};
T3(-70.89793869257569, 32.51111947877939, 19.509145549249354, 0){"FC5"};
SP(70.85533298708845, 33.37654009300909, 18.745667282920785){0};
T3(70.85533298708845, 33.37654009300909, 23.745667282920785, 0){"FC6"};
SP(-73.5479478573541, 29.028724230680538, -14.627316964073511){0};
T3(-73.5479478573541, 29.028724230680538, -9.627316964073511, 0){"FT7"};
SP(72.82075074787714, 28.548943413064794, -14.537995432834684){0};
T3(72.82075074787714, 28.548943413064794, -9.537995432834684, 0){"FT8"};
SP(-34.29162787413671, 5.383954885337877, 72.2570165679307){0};
T3(-34.29162787413671, 5.383954885337877, 77.2570165679307, 0){"C1"};
SP(32.67534875959289, 3.853524693296496, 72.85309805269017){0};
T3(32.67534875959289, 3.853524693296496, 77.85309805269017, 0){"C2"};
SP(-78.00220923117917, 3.9912491589892944, 20.25413617177155){0};
T3(-78.00220923117917, 3.9912491589892944, 25.25413617177155, 0){"C5"};
SP(77.2846358099325, 4.637351607517237, 21.110058986339826){0};
T3(77.2846358099325, 4.637351607517237, 26.110058986339826, 0){"C6"};
SP(-0.8596298088746495, -25.534442937332326, 76.51037546768872){0};
T3(-0.8596298088746495, -25.534442937332326, 81.51037546768872, 0){"CPz"};
SP(-31.873980765038752, -24.435891889541292, 68.75613202848382){0};
T3(-31.873980765038752, -24.435891889541292, 73.75613202848382, 0){"CP1"};
SP(30.864212423744725, -26.860065723565626, 69.20877425984536){0};
T3(30.864212423744725, -26.860065723565626, 74.20877425984536, 0){"CP2"};
SP(-57.28794216053997, -25.227066413878244, 49.692001251517695){0};
T3(-57.28794216053997, -25.227066413878244, 54.692001251517695, 0){"CP3"};
SP(56.6261261524665, -26.689493926065428, 49.48389380835454){0};
T3(56.6261261524665, -26.689493926065428, 54.48389380835454, 0){"CP4"};
SP(-73.91423748840577, -22.797097058707404, 21.23608017923208){0};
T3(-73.91423748840577, -22.797097058707404, 26.23608017923208, 0){"CP5"};
SP(73.25524703162309, -24.41720081052462, 21.575796178855768){0};
T3(73.25524703162309, -24.41720081052462, 26.575796178855768, 0){"CP6"};
SP(-76.8950423053473, -19.841763078023025, -12.239046820473895){0};
T3(-76.8950423053473, -19.841763078023025, -7.239046820473895, 0){"TP7"};
SP(76.37049563750465, -20.49130331507832, -11.853902235947258){0};
T3(76.37049563750465, -20.49130331507832, -6.853902235947258, 0){"TP8"};
SP(-25.05469218497068, -51.27484105827265, 55.72751604607985){0};
T3(-25.05469218497068, -51.27484105827265, 60.72751604607985, 0){"P1"};
SP(25.64817785237211, -51.918193736432734, 55.30409665941831){0};
T3(25.64817785237211, -51.918193736432734, 60.30409665941831, 0){"P2"};
SP(-62.21358083469478, -48.57538661839308, 16.373155586453304){0};
T3(-62.21358083469478, -48.57538661839308, 21.373155586453304, 0){"P5"};
SP(61.47080677679432, -48.087399859475234, 17.52075144941227){0};
T3(61.47080677679432, -48.087399859475234, 22.52075144941227, 0){"P6"};
SP(-0.3232539785882693, -71.74479443437033, 34.60081728435146){0};
T3(-0.3232539785882693, -71.74479443437033, 39.60081728435146, 0){"POz"};
SP(-34.66378013529604, -67.06227627520647, 25.25003923539966){0};
T3(-34.66378013529604, -67.06227627520647, 30.25003923539966, 0){"PO3"};
SP(36.0560792664604, -67.05687400044738, 26.082275125161352){0};
T3(36.0560792664604, -67.05687400044738, 31.082275125161352, 0){"PO4"};
SP(-50.39263964980578, -61.550414212469924, -7.004478627718111){0};
T3(-50.39263964980578, -61.550414212469924, -2.004478627718111, 0){"PO7"};
SP(49.037615204113656, -62.849520796020876, -6.364503419377387){0};
T3(49.037615204113656, -62.849520796020876, -1.364503419377387, 0){"PO8"};
SP(-0.14794705756853155, -80.16643641205778, 1.0177299431348974){0};
T3(-0.14794705756853155, -80.16643641205778, 6.017729943134897, 0){"Oz"};
SP(-0.9824614387357483, 73.87700992148764, -30.687103466678625){0};
T3(-0.9824614387357483, 73.87700992148764, -25.687103466678625, 0){"Nz"};
SP(-0.0896864886931017, -73.03745104063059, -32.91408305489334){0};
T3(-0.0896864886931017, -73.03745104063059, -27.91408305489334, 0){"Iz"};
SP(-67.53743131059571, 2.6210243439076684, -42.05900998599507){0};
T3(-67.53743131059571, 2.6210243439076684, -37.05900998599507, 0){"LPA"};
SP(68.81783095362643, 2.089716183640114, -41.51259393780954){0};
T3(68.81783095362643, 2.089716183640114, -36.51259393780954, 0){"RPA"};
};
myView = PostProcessing.NbViews-1;
View[myView].PointType=1;
View[myView].PointSize=6;
View[myView].LineType=1;
View[myView].LineWidth=2;
