View""{
SP(-25.316530342999563, 76.31634556160861, -5.569872311478488){0};
T3(-25.316530342999563, 76.31634556160861, -0.5698723114784876, 0){"Fp1"};
SP(-0.8729484994073724, 80.32373352684395, -2.7746612391471484){0};
T3(-0.8729484994073724, 80.32373352684395, 2.2253387608528516, 0){"Fpz"};
SP(24.202638837963956, 76.27445730280812, -4.959530898870252){0};
T3(24.202638837963956, 76.27445730280812, 0.040469101129748, 0){"Fp2"};
SP(-46.69165904569817, 64.44170323347576, -8.499574646664271){0};
T3(-46.69165904569817, 64.44170323347576, -3.4995746466642714, 0){"AF7"};
SP(-30.959632356447788, 72.49671506047038, 16.993940536842185){0};
T3(-30.959632356447788, 72.49671506047038, 21.993940536842185, 0){"AF3"};
SP(-0.7831090096940425, 75.41134577863996, 27.91650067544352){0};
T3(-0.7831090096940425, 75.41134577863996, 32.916500675443515, 0){"AFz"};
SP(29.632342915107447, 71.71675551606378, 17.877741339466716){0};
T3(29.632342915107447, 71.71675551606378, 22.877741339466716, 0){"AF4"};
SP(45.96430017921256, 64.90804509025604, -7.301414416511952){0};
T3(45.96430017921256, 64.90804509025604, -2.3014144165119523, 0){"AF8"};
SP(-56.003904012139714, 43.04706100567249, -38.77033747554873){0};
T3(-56.003904012139714, 43.04706100567249, -33.77033747554873, 0){"F9"};
SP(-63.18622487775902, 47.70572307391985, -10.237276829337784){0};
T3(-63.18622487775902, 47.70572307391985, -5.237276829337784, 0){"F7"};
SP(-58.068618379454556, 52.73650444260537, 13.469689796042957){0};
T3(-58.068618379454556, 52.73650444260537, 18.469689796042957, 0){"F5"};
SP(-45.31268939500644, 56.03415571988368, 33.45853074678478){0};
T3(-45.31268939500644, 56.03415571988368, 38.45853074678478, 0){"F3"};
SP(-25.467508291550786, 58.32444861816382, 48.13082503705594){0};
T3(-25.467508291550786, 58.32444861816382, 53.13082503705594, 0){"F1"};
SP(-0.8242573548040157, 58.783367729857716, 54.092878975474555){0};
T3(-0.8242573548040157, 58.783367729857716, 59.092878975474555, 0){"Fz"};
SP(24.33211024149534, 58.247590039134735, 49.078345850147514){0};
T3(24.33211024149534, 58.247590039134735, 54.078345850147514, 0){"F2"};
SP(44.98148320733972, 56.22656595677253, 34.9085992572168){0};
T3(44.98148320733972, 56.22656595677253, 39.9085992572168, 0){"F4"};
SP(57.956888908414, 52.956026294634576, 14.775541031163208){0};
T3(57.956888908414, 52.956026294634576, 19.775541031163208, 0){"F6"};
SP(63.37719025258623, 48.26012891363903, -9.123452081083983){0};
T3(63.37719025258623, 48.26012891363903, -4.1234520810839825, 0){"F8"};
SP(55.2686316036214, 43.18242448427182, -37.671668094770304){0};
T3(55.2686316036214, 43.18242448427182, -32.671668094770304, 0){"F10"};
SP(-63.85420937256554, 25.253246806708177, -41.32506873346407){0};
T3(-63.85420937256554, 25.253246806708177, -36.32506873346407, 0){"FT9"};
SP(-74.497919016134, 26.962839836144298, -11.307472724448257){0};
T3(-74.497919016134, 26.962839836144298, -6.307472724448257, 0){"FT7"};
SP(-71.01936442709429, 30.604909199521718, 19.58447655197292){0};
T3(-71.01936442709429, 30.604909199521718, 24.58447655197292, 0){"FC5"};
SP(-56.56966375030326, 32.999888061204004, 46.75899754214928){0};
T3(-56.56966375030326, 32.999888061204004, 51.75899754214928, 0){"FC3"};
SP(-31.566791947129573, 34.04499540215755, 65.1873071588535){0};
T3(-31.566791947129573, 34.04499540215755, 70.1873071588535, 0){"FC1"};
SP(-0.582886004169332, 33.976620836972394, 71.89151336223586){0};
T3(-0.582886004169332, 33.976620836972394, 76.89151336223586, 0){"FCz"};
SP(30.47945387849917, 34.00383837240082, 65.97105012220119){0};
T3(30.47945387849917, 34.00383837240082, 70.97105012220119, 0){"FC2"};
SP(55.741313085999145, 32.31049437010144, 47.53301500153811){0};
T3(55.741313085999145, 32.31049437010144, 52.53301500153811, 0){"FC4"};
SP(71.16291063405569, 30.108228733408136, 21.213567333385754){0};
T3(71.16291063405569, 30.108228733408136, 26.213567333385754, 0){"FC6"};
SP(74.77982609654802, 27.155652202486554, -10.238481489124037){0};
T3(74.77982609654802, 27.155652202486554, -5.238481489124037, 0){"FT8"};
SP(64.53855922353395, 24.057815655229543, -40.421833786632355){0};
T3(64.53855922353395, 24.057815655229543, -35.421833786632355, 0){"FT10"};
SP(-68.12661768443671, 5.0134102038807935, -42.48891498710979){0};
T3(-68.12661768443671, 5.0134102038807935, -37.48891498710979, 0){"T9"};
SP(-78.9853545365775, 4.002529799153529, -12.124080486875377){0};
T3(-78.9853545365775, 4.002529799153529, -7.124080486875377, 0){"T7"};
SP(-76.76021195093693, 4.320543234847539, 20.286034715022964){0};
T3(-76.76021195093693, 4.320543234847539, 25.286034715022964, 0){"C5"};
SP(-62.631350925026425, 4.6689714565592535, 49.82019474259337){0};
T3(-62.631350925026425, 4.6689714565592535, 54.82019474259337, 0){"C3"};
SP(-35.77965283619383, 5.025936104470148, 71.77165093486936){0};
T3(-35.77965283619383, 5.025936104470148, 76.77165093486936, 0){"C1"};
SP(-0.9824016617519016, 4.97604720789741, 80.76577121339956){0};
T3(-0.9824016617519016, 4.97604720789741, 85.76577121339956, 0){"Cz"};
SP(33.825484115756986, 4.809836100135245, 72.14541412768737){0};
T3(33.825484115756986, 4.809836100135245, 77.14541412768737, 0){"C2"};
SP(61.34314108877782, 4.302638216029985, 51.225513368301414){0};
T3(61.34314108877782, 4.302638216029985, 56.225513368301414, 0){"C4"};
SP(77.25178539461643, 3.7724061195984344, 21.662025836580984){0};
T3(77.25178539461643, 3.7724061195984344, 26.662025836580984, 0){"C6"};
SP(79.41223528855278, 3.2251062053280037, -11.073249716003414){0};
T3(79.41223528855278, 3.2251062053280037, -6.073249716003414, 0){"T8"};
SP(68.30222665919675, 4.816744618105481, -41.2832503897274){0};
T3(68.30222665919675, 4.816744618105481, -36.2832503897274, 0){"T10"};
SP(-67.53300733176437, -16.600086485773033, -40.25741398568253){0};
T3(-67.53300733176437, -16.600086485773033, -35.25741398568253, 0){"TP9"};
SP(-76.57190988888358, -20.319528252047284, -11.67379207594732){0};
T3(-76.57190988888358, -20.319528252047284, -6.67379207594732, 0){"TP7"};
SP(-74.38732340847325, -22.37950128512165, 21.50865345819667){0};
T3(-74.38732340847325, -22.37950128512165, 26.50865345819667, 0){"CP5"};
SP(-58.93822748434547, -23.721062972506953, 49.4442310399119){0};
T3(-58.93822748434547, -23.721062972506953, 54.4442310399119, 0){"CP3"};
SP(-32.42250437837417, -24.9827524705761, 68.96313806993298){0};
T3(-32.42250437837417, -24.9827524705761, 73.96313806993298, 0){"CP1"};
SP(-0.7218988132717854, -24.91523509454973, 75.49974371989441){0};
T3(-0.7218988132717854, -24.91523509454973, 80.49974371989441, 0){"CPz"};
SP(31.21942666590348, -25.383182870067028, 69.87524227158069){0};
T3(31.21942666590348, -25.383182870067028, 74.87524227158069, 0){"CP2"};
SP(57.63985618792825, -24.172740295298556, 50.57211622226154){0};
T3(57.63985618792825, -24.172740295298556, 55.57211622226154, 0){"CP4"};
SP(73.21580172363142, -22.834823753965573, 22.842425960086732){0};
T3(73.21580172363142, -22.834823753965573, 27.842425960086732, 0){"CP6"};
SP(76.92421735470738, -20.842460726453332, -10.232146590553473){0};
T3(76.92421735470738, -20.842460726453332, -5.232146590553473, 0){"TP8"};
SP(67.95840046843907, -16.768884050405862, -40.19440686705971){0};
T3(67.95840046843907, -16.768884050405862, -35.19440686705971, 0){"TP10"};
SP(-58.96151006061965, -36.15991016882483, -41.157026214442084){0};
T3(-58.96151006061965, -36.15991016882483, -36.157026214442084, 0){"P9"};
SP(-66.89578308440153, -42.59747408024075, -9.9301590886065){0};
T3(-66.89578308440153, -42.59747408024075, -4.9301590886065, 0){"P7"};
SP(-62.5062711984995, -46.453948874859, 16.160294818142802){0};
T3(-62.5062711984995, -46.453948874859, 21.160294818142802, 0){"P5"};
SP(-49.52575483855707, -49.517697597982526, 39.03491466762728){0};
T3(-49.52575483855707, -49.517697597982526, 44.03491466762728, 0){"P3"};
SP(-27.590294564671712, -52.2538583669115, 54.634164603593064){0};
T3(-27.590294564671712, -52.2538583669115, 59.634164603593064, 0){"P1"};
SP(-1.1863855049590977, -53.16449725512388, 60.57485386398293){0};
T3(-1.1863855049590977, -53.16449725512388, 65.57485386398292, 0){"Pz"};
SP(25.901215765775436, -51.78107162141012, 54.91493774951589){0};
T3(25.901215765775436, -51.78107162141012, 59.91493774951589, 0){"P2"};
SP(48.512908370669365, -50.00739172333129, 40.366573365671805){0};
T3(48.512908370669365, -50.00739172333129, 45.366573365671805, 0){"P4"};
SP(61.76363661743417, -47.026905414746935, 17.56656037818883){0};
T3(61.76363661743417, -47.026905414746935, 22.56656037818883, 0){"P6"};
SP(67.33428515321508, -43.72130140272476, -8.769163786198323){0};
T3(67.33428515321508, -43.72130140272476, -3.769163786198323, 0){"P8"};
SP(58.39252429698565, -36.31229552892198, -39.746178363567665){0};
T3(58.39252429698565, -36.31229552892198, -34.746178363567665, 0){"P10"};
SP(-44.22163780959455, -53.92495881447802, -38.6332397160958){0};
T3(-44.22163780959455, -53.92495881447802, -33.6332397160958, 0){"PO9"};
SP(-49.88708585421972, -61.66185390249249, -7.3457503533651325){0};
T3(-49.88708585421972, -61.66185390249249, -2.3457503533651325, 0){"PO7"};
SP(-34.05493522669734, -69.30257500114558, 21.58793421599144){0};
T3(-34.05493522669734, -69.30257500114558, 26.58793421599144, 0){"PO3"};
SP(-0.7230071544855805, -73.06813226752399, 33.12457933408675){0};
T3(-0.7230071544855805, -73.06813226752399, 38.12457933408675, 0){"POz"};
SP(33.02070279099885, -69.3412242684133, 22.37258771453523){0};
T3(33.02070279099885, -69.3412242684133, 27.37258771453523, 0){"PO4"};
SP(50.35057339375317, -62.56278345603167, -6.3769252968425){0};
T3(50.35057339375317, -62.56278345603167, -1.3769252968424999, 0){"PO8"};
SP(44.499795316363326, -53.96727507499787, -37.69042332720961){0};
T3(44.499795316363326, -53.96727507499787, -32.69042332720961, 0){"PO10"};
SP(-27.142998374405757, -75.31005685902286, -4.0917321379698635){0};
T3(-27.142998374405757, -75.31005685902286, 0.9082678620301365, 0){"O1"};
SP(-0.17252689426592194, -80.38476845902483, -0.16490041784688003){0};
T3(-0.17252689426592194, -80.38476845902483, 4.83509958215312, 0){"Oz"};
SP(26.72404550888021, -75.06661215706978, -3.6302072038291913){0};
T3(26.72404550888021, -75.06661215706978, 1.3697927961708087, 0){"O2"};
SP(-0.09683969245441126, -72.89370777030848, -32.740385402162886){0};
T3(-0.09683969245441126, -72.89370777030848, -27.740385402162886, 0){"Iz"};
SP(-24.09952857470427, -67.2853336515463, -36.1326665366675){0};
T3(-24.09952857470427, -67.2853336515463, -31.1326665366675, 0){"I1"};
SP(24.36716185344983, -67.46795555283522, -35.67353962781837){0};
T3(24.36716185344983, -67.46795555283522, -30.67353962781837, 0){"I2"};
SP(-0.35895728756326184, 74.51437851879248, -30.696070909887297){0};
T3(-0.35895728756326184, 74.51437851879248, -25.696070909887297, 0){"Nz"};
SP(-0.09683969245441126, -72.89370777030848, -32.740385402162886){0};
T3(-0.09683969245441126, -72.89370777030848, -27.740385402162886, 0){"Iz"};
SP(-68.11175815663152, 2.4816033912483, -42.59966703703585){0};
T3(-68.11175815663152, 2.4816033912483, -37.59966703703585, 0){"LPA"};
SP(68.21323212334929, 2.2380383261045242, -41.37998298985744){0};
T3(68.21323212334929, 2.2380383261045242, -36.37998298985744, 0){"RPA"};
};
myView = PostProcessing.NbViews-1;
View[myView].PointType=1;
View[myView].PointSize=6;
View[myView].LineType=1;
View[myView].LineWidth=2;
