View"E at target"{
VP(15.339619203942794, 27.961958061838903, -2.9000252823515953){0.11292630936023691, 0.39285403881579756, 0.11171745048701132};
SP(15.339619203942794, 27.961958061838903, -2.9000252823515953){0.42375398039773726};
VP(8.176236594144507, 20.748306689762064, 0.8529366289837863){0.3674088594338016, 0.6223253398182809, 0.35507956106541994};
SP(8.176236594144507, 20.748306689762064, 0.8529366289837863){0.8052077950795042};
VP(-0.7653655833354602, 17.161730876532985, -0.30297004339653066){0.1177093018347542, 0.5670792478947302, 0.6548213131071834};
SP(-0.7653655833354602, 17.161730876532985, -0.30297004339653066){0.8741998085281729};
VP(12.674204395183061, 33.969139259495854, 4.274412164122686){0.05529999160886139, 0.5265208058895944, 0.1873502391337623};
SP(12.674204395183061, 33.969139259495854, 4.274412164122686){0.561589138258608};
VP(4.9663860565025875, 27.340684139969355, 7.187285009383718){0.1540517551388777, 0.647418575987508, 0.3688338249090782};
SP(4.9663860565025875, 27.340684139969355, 7.187285009383718){0.7608686786772878};
VP(-3.7621905549176904, 23.473759424501374, 6.03817191254701){-0.07053642260377209, 0.5239367633822024, 0.1905679000116115};
SP(-3.7621905549176904, 23.473759424501374, 6.03817191254701){0.5619619590790744};
VP(8.370398218094614, 41.74810863427154, 9.608039914096272){0.10314883234063646, 0.5201281877933326, 0.1588060156222916};
SP(8.370398218094614, 41.74810863427154, 9.608039914096272){0.5535272025368225};
VP(-0.23131160461705497, 37.74170457724761, 8.855279608720675){-0.016665669760121876, 0.47464893303081074, 0.1993311789025509};
SP(-0.23131160461705497, 37.74170457724761, 8.855279608720675){0.515075016923284};
VP(-9.12609926357182, 33.36623091911662, 8.585297695161614){-0.030532841405164695, 0.36345703250240663, 0.13337719268805978};
SP(-9.12609926357182, 33.36623091911662, 8.585297695161614){0.3883590405914046};
};
