View""{
SP(-0.640573309816272, 15.65277085056892, 78.633648847985){0};
T3(-0.640573309816272, 15.65277085056892, 83.633648847985, 0){"reference"};
SP(0.5036826702262194, 0.6215306680088934, 80.6368526292533){0};
T3(0.5036826702262194, 0.6215306680088934, 85.6368526292533, 0){"1"};
SP(0.12112459645520461, 30.34760061080174, 73.37447795653014){0};
T3(0.12112459645520461, 30.34760061080174, 78.37447795653014, 0){"2"};
SP(29.32422950585473, 14.20781725090905, 74.22678356387803){0};
T3(29.32422950585473, 14.20781725090905, 79.22678356387803, 0){"3"};
SP(28.386579600773544, -16.64174388856028, 73.09211662011292){0};
T3(28.386579600773544, -16.64174388856028, 78.09211662011292, 0){"4"};
SP(0.2779074302228164, -28.838927321832713, 74.0264073644699){0};
T3(0.2779074302228164, -28.838927321832713, 79.0264073644699, 0){"5"};
SP(-26.535718241740586, -13.736834226673539, 74.63708345889512){0};
T3(-26.535718241740586, -13.736834226673539, 79.63708345889512, 0){"6"};
SP(-27.758288904824557, 16.155418117644317, 73.0458983418556){0};
T3(-27.758288904824557, 16.155418117644317, 78.0458983418556, 0){"7"};
SP(-0.4986003898325453, 55.55971201220093, 57.2981762359455){0};
T3(-0.4986003898325453, 55.55971201220093, 62.2981762359455, 0){"8"};
SP(32.061546408849146, 45.78766664921554, 57.375236691994445){0};
T3(32.061546408849146, 45.78766664921554, 62.375236691994445, 0){"9"};
SP(52.779080508906766, 23.30550782850998, 55.494567678836034){0};
T3(52.779080508906766, 23.30550782850998, 60.494567678836034, 0){"10"};
SP(58.884223961855426, -4.705450509399583, 53.873538673892064){0};
T3(58.884223961855426, -4.705450509399583, 58.873538673892064, 0){"11"};
SP(49.1913850390432, -29.469032354834976, 56.251319048206476){0};
T3(49.1913850390432, -29.469032354834976, 61.251319048206476, 0){"12"};
SP(28.97270765087932, -47.93417866085957, 57.119549762563366){0};
T3(28.97270765087932, -47.93417866085957, 62.119549762563366, 0){"13"};
SP(-0.13545666337582452, -54.36767799644762, 59.16718518037066){0};
T3(-0.13545666337582452, -54.36767799644762, 64.16718518037067, 0){"14"};
SP(-27.982954009090804, -46.97184285581239, 58.57149323585222){0};
T3(-27.982954009090804, -46.97184285581239, 63.57149323585222, 0){"15"};
SP(-49.475242057322426, -27.43483145572567, 56.67554021143468){0};
T3(-49.475242057322426, -27.43483145572567, 61.67554021143468, 0){"16"};
SP(-57.84242048044624, -1.2126327162125174, 55.28881002758146){0};
T3(-57.84242048044624, -1.2126327162125174, 60.28881002758146, 0){"17"};
SP(-53.37090238607865, 25.29476735855592, 54.665603194441076){0};
T3(-53.37090238607865, 25.29476735855592, 59.665603194441076, 0){"18"};
SP(-31.83701685155184, 47.6681220518156, 55.25994706749518){0};
T3(-31.83701685155184, 47.6681220518156, 60.25994706749518, 0){"19"};
SP(0.9710769894982294, 73.32020063601684, 33.34043194506782){0};
T3(0.9710769894982294, 73.32020063601684, 38.34043194506782, 0){"20"};
SP(32.69925460249525, 66.08733342275848, 31.23610367691401){0};
T3(32.69925460249525, 66.08733342275848, 36.23610367691401, 0){"21"};
SP(58.04849504483232, 46.933918370715375, 29.393285258417073){0};
T3(58.04849504483232, 46.933918370715375, 34.39328525841707, 0){"22"};
SP(72.18834139944796, 19.288198016116713, 27.831402865531413){0};
T3(72.18834139944796, 19.288198016116713, 32.831402865531416, 0){"23"};
SP(74.2515809862737, -10.43989180571068, 28.61913285887964){0};
T3(74.2515809862737, -10.43989180571068, 33.61913285887964, 0){"24"};
SP(64.31908867274412, -36.999720772103636, 29.815091741815838){0};
T3(64.31908867274412, -36.999720772103636, 34.815091741815834, 0){"25"};
SP(46.44935703011397, -56.77429755156743, 32.985268425284126){0};
T3(46.44935703011397, -56.77429755156743, 37.985268425284126, 0){"26"};
SP(15.748880195888734, -71.6511249397508, 32.45462633410081){0};
T3(15.748880195888734, -71.6511249397508, 37.45462633410081, 0){"27"};
SP(-19.02679593109304, -69.69615549195612, 33.369061024755126){0};
T3(-19.02679593109304, -69.69615549195612, 38.369061024755126, 0){"28"};
SP(-47.39034860311994, -55.55635849087455, 33.1291742573956){0};
T3(-47.39034860311994, -55.55635849087455, 38.1291742573956, 0){"29"};
SP(-65.99733386852947, -32.42673345693653, 32.44259656668412){0};
T3(-65.99733386852947, -32.42673345693653, 37.44259656668412, 0){"30"};
SP(-74.09159748030336, -4.44468087055271, 30.45722459818582){0};
T3(-74.09159748030336, -4.44468087055271, 35.45722459818582, 0){"31"};
SP(-70.1871728766445, 24.430801685075476, 27.67248817286511){0};
T3(-70.1871728766445, 24.430801685075476, 32.67248817286511, 0){"32"};
SP(-54.699177847648485, 52.42279447791386, 26.83444366345256){0};
T3(-54.699177847648485, 52.42279447791386, 31.83444366345256, 0){"41"};
SP(-30.12901111495377, 68.1460838470045, 28.776718860252185){0};
T3(-30.12901111495377, 68.1460838470045, 33.77671886025219, 0){"42"};
SP(-0.9856829586725175, 79.4548163654461, 8.425725125012814){0};
T3(-0.9856829586725175, 79.4548163654461, 13.425725125012814, 0){"43"};
SP(31.398349647908194, 73.48682513721387, 5.392749777463104){0};
T3(31.398349647908194, 73.48682513721387, 10.392749777463104, 0){"44"};
SP(57.58624842755297, 56.0888960460791, -1.0167827476159235){0};
T3(57.58624842755297, 56.0888960460791, 3.9832172523840765, 0){"45"};
SP(73.50057831446487, 32.11115164501069, -2.2015906812443014){0};
T3(73.50057831446487, 32.11115164501069, 2.7984093187556986, 0){"46"};
SP(79.94399068161091, 2.209812311925651, -3.7003067334889206){0};
T3(79.94399068161091, 2.209812311925651, 1.2996932665110794, 0){"47"};
SP(74.87378204990151, -28.092710441004613, -1.8286159961879647){0};
T3(74.87378204990151, -28.092710441004613, 3.1713840038120353, 0){"48"};
SP(58.12412064279142, -54.39536086590541, -0.13192253350456484){0};
T3(58.12412064279142, -54.39536086590541, 4.868077466495436, 0){"49"};
SP(29.89672053094453, -73.83789684419287, 3.254200143744594){0};
T3(29.89672053094453, -73.83789684419287, 8.254200143744594, 0){"50"};
SP(-2.365374285808997, -80.33639485874549, 0.25359512896616465){0};
T3(-2.365374285808997, -80.33639485874549, 5.253595128966165, 0){"51"};
SP(-33.54142278647945, -72.47477375829156, 2.6820214798271564){0};
T3(-33.54142278647945, -72.47477375829156, 7.682021479827156, 0){"52"};
SP(-59.70536267687682, -52.50099789570239, 2.1966936615057606){0};
T3(-59.70536267687682, -52.50099789570239, 7.19669366150576, 0){"53"};
SP(-75.75355418931022, -27.47729674754065, 1.106494470145083){0};
T3(-75.75355418931022, -27.47729674754065, 6.106494470145083, 0){"54"};
SP(-80.45927794306569, 2.411859927902583, -0.8875613213574252){0};
T3(-80.45927794306569, 2.411859927902583, 4.112438678642575, 0){"55"};
SP(-73.55070223710196, 31.952112192192686, -1.571745745590166){0};
T3(-73.55070223710196, 31.952112192192686, 3.428254254409834, 0){"56"};
SP(-56.01026175467433, 56.67068749884965, -2.068999552155569){0};
T3(-56.01026175467433, 56.67068749884965, 2.931000447844431, 0){"57"};
SP(-30.981201074619875, 74.91215687552979, 1.7156349785652285){0};
T3(-30.981201074619875, 74.91215687552979, 6.7156349785652285, 0){"58"};
SP(62.919127564274504, 39.51137483647651, -29.731030798873295){0};
T3(62.919127564274504, 39.51137483647651, -24.731030798873295, 0){"59"};
SP(71.58953275535067, 13.752219998365765, -33.38573338476447){0};
T3(71.58953275535067, 13.752219998365765, -28.38573338476447, 0){"60"};
SP(70.84834135404434, -24.122065957589392, -28.462108669069565){0};
T3(70.84834135404434, -24.122065957589392, -23.462108669069565, 0){"61"};
SP(55.657959781880436, -49.44134852308722, -28.776190929032936){0};
T3(55.657959781880436, -49.44134852308722, -23.776190929032936, 0){"62"};
SP(29.759383922201224, -68.87959090107579, -28.090495584601143){0};
T3(29.759383922201224, -68.87959090107579, -23.090495584601143, 0){"63"};
SP(0.5536889083654604, -74.26786153768302, -29.26411429508351){0};
T3(0.5536889083654604, -74.26786153768302, -24.26411429508351, 0){"64"};
SP(-30.22480164290914, -68.8904321755492, -28.075429713845306){0};
T3(-30.22480164290914, -68.8904321755492, -23.075429713845306, 0){"65"};
SP(-56.92984826664728, -49.18806285446573, -28.154544142512265){0};
T3(-56.92984826664728, -49.18806285446573, -23.154544142512265, 0){"66"};
SP(-71.02115906979158, -24.42730145918154, -28.158077024365312){0};
T3(-71.02115906979158, -24.42730145918154, -23.158077024365312, 0){"67"};
SP(-72.62616184740169, 10.298055846923575, -32.333739637537406){0};
T3(-72.62616184740169, 10.298055846923575, -27.333739637537406, 0){"68"};
SP(-63.58447827853732, 38.21191929240909, -30.339122173789377){0};
T3(-63.58447827853732, 38.21191929240909, -25.339122173789377, 0){"69"};
SP(-59.438240146111156, 16.914330525842654, -50.733138553873026){0};
T3(-59.438240146111156, 16.914330525842654, -45.733138553873026, 0){"70"};
SP(59.336413878866864, 18.460844993654447, -49.31184650717484){0};
T3(59.336413878866864, 18.460844993654447, -44.31184650717484, 0){"71"};
};
myView = PostProcessing.NbViews-1;
View[myView].PointType=1;
View[myView].PointSize=6;
View[myView].LineType=1;
View[myView].LineWidth=2;
