View""{
SP(-25.430044902493233, 76.65799917277762, 1.075841184928114){0};
T3(-25.430044902493233, 76.65799917277762, 6.075841184928114, 0){"Fp1"};
SP(-0.23730796801464837, 79.87693602211998, 5.5833623409162225){0};
T3(-0.23730796801464837, 79.87693602211998, 10.583362340916223, 0){"Fpz"};
SP(24.7580550126809, 76.48756275387167, -0.761424877709614){0};
T3(24.7580550126809, 76.48756275387167, 4.238575122290386, 0){"Fp2"};
SP(-38.095133751115476, 61.07793949235933, -34.77060394520378){0};
T3(-38.095133751115476, 61.07793949235933, -29.77060394520378, 0){"AF9"};
SP(-45.77943415926029, 65.36655582278428, -4.481510815433282){0};
T3(-45.77943415926029, 65.36655582278428, 0.5184891845667181, 0){"AF7"};
SP(-40.176644952387925, 69.28425508047405, 11.25852467460283){0};
T3(-40.176644952387925, 69.28425508047405, 16.258524674602832, 0){"AF5"};
SP(-29.92648712746226, 69.8268071439001, 25.806287777363632){0};
T3(-29.92648712746226, 69.8268071439001, 30.806287777363632, 0){"AF3"};
SP(-15.874323435991405, 69.72006771713335, 36.20045043039912){0};
T3(-15.874323435991405, 69.72006771713335, 41.20045043039912, 0){"AF1"};
SP(0.4444350250120458, 70.41256547686913, 38.547642023160535){0};
T3(0.4444350250120458, 70.41256547686913, 43.547642023160535, 0){"AFz"};
SP(17.338290036525393, 69.64369482509942, 35.33226470078817){0};
T3(17.338290036525393, 69.64369482509942, 40.33226470078817, 0){"AF2"};
SP(31.30335591398617, 69.24547859058346, 24.822528050604724){0};
T3(31.30335591398617, 69.24547859058346, 29.822528050604724, 0){"AF4"};
SP(40.44872418131227, 68.57990870752083, 9.257354759650585){0};
T3(40.44872418131227, 68.57990870752083, 14.257354759650585, 0){"AF6"};
SP(45.51196239264028, 65.22776575810312, -7.469568356807951){0};
T3(45.51196239264028, 65.22776575810312, -2.469568356807951, 0){"AF8"};
SP(35.84182924365602, 60.464349139219564, -37.92710651600238){0};
T3(35.84182924365602, 60.464349139219564, -32.92710651600238, 0){"AF10"};
SP(-52.475511187648515, 45.376245159167695, -40.72761833840646){0};
T3(-52.475511187648515, 45.376245159167695, -35.72761833840646, 0){"F9"};
SP(-61.95856899812391, 49.41288246953117, -9.888287756887866){0};
T3(-61.95856899812391, 49.41288246953117, -4.888287756887866, 0){"F7"};
SP(-58.889554641913115, 51.215444272675455, 17.75558151604787){0};
T3(-58.889554641913115, 51.215444272675455, 22.75558151604787, 0){"F5"};
SP(-44.90858138382257, 50.14131247031367, 42.26321075014934){0};
T3(-44.90858138382257, 50.14131247031367, 47.26321075014934, 0){"F3"};
SP(-23.515186627941283, 49.576321383007006, 58.1254909824335){0};
T3(-23.515186627941283, 49.576321383007006, 63.1254909824335, 0){"F1"};
SP(0.9506984146617423, 49.060180729971755, 62.741383726953515){0};
T3(0.9506984146617423, 49.060180729971755, 67.74138372695352, 0){"Fz"};
SP(26.950451258820973, 50.08560692541277, 56.613337355105116){0};
T3(26.950451258820973, 50.08560692541277, 61.613337355105116, 0){"F2"};
SP(48.09097848907066, 51.14575353814229, 38.67623622948771){0};
T3(48.09097848907066, 51.14575353814229, 43.67623622948771, 0){"F4"};
SP(60.38681850658088, 50.4860334912711, 13.750193276367558){0};
T3(60.38681850658088, 50.4860334912711, 18.750193276367558, 0){"F6"};
SP(61.947265749458204, 49.03509219165598, -14.460670944307084){0};
T3(61.947265749458204, 49.03509219165598, -9.460670944307084, 0){"F8"};
SP(50.132447729327005, 44.22600143909296, -43.54855258030634){0};
T3(50.132447729327005, 44.22600143909296, -38.54855258030634, 0){"F10"};
SP(-60.824751938930675, 28.254726879569134, -44.11734396305959){0};
T3(-60.824751938930675, 28.254726879569134, -39.11734396305959, 0){"FT9"};
SP(-73.02179025243122, 29.507785226776605, -15.610453759703976){0};
T3(-73.02179025243122, 29.507785226776605, -10.610453759703976, 0){"FT7"};
SP(-72.03724626580782, 27.205595208380807, 20.668143086462262){0};
T3(-72.03724626580782, 27.205595208380807, 25.668143086462262, 0){"FC5"};
SP(-56.293349594971374, 25.967592008983193, 51.89049876592416){0};
T3(-56.293349594971374, 25.967592008983193, 56.89049876592416, 0){"FC3"};
SP(-29.05057472675302, 23.038920728902365, 70.65890828501288){0};
T3(-29.05057472675302, 23.038920728902365, 75.65890828501288, 0){"FC1"};
SP(1.2557406532323494, 22.134899733686048, 76.68915992496619){0};
T3(1.2557406532323494, 22.134899733686048, 81.68915992496619, 0){"FCz"};
SP(32.82617916193843, 23.652716028950184, 69.78517173874606){0};
T3(32.82617916193843, 23.652716028950184, 74.78517173874606, 0){"FC2"};
SP(59.03240083450184, 25.464194456517525, 47.799923198183365){0};
T3(59.03240083450184, 25.464194456517525, 52.799923198183365, 0){"FC4"};
SP(73.77812678197604, 27.009504386594628, 15.791046375179807){0};
T3(73.77812678197604, 27.009504386594628, 20.791046375179807, 0){"FC6"};
SP(72.49717180534942, 28.057295619485362, -20.76933458387376){0};
T3(72.49717180534942, 28.057295619485362, -15.76933458387376, 0){"FT8"};
SP(58.54779142192281, 26.86634584414532, -46.757509356964206){0};
T3(58.54779142192281, 26.86634584414532, -41.757509356964206, 0){"FT10"};
SP(-63.179700975955924, 9.43812181987197, -48.44849649715472){0};
T3(-63.179700975955924, 9.43812181987197, -43.44849649715472, 0){"T9"};
SP(-77.32924450133514, 4.305401786857744, -19.989775214107127){0};
T3(-77.32924450133514, 4.305401786857744, -14.989775214107127, 0){"T7"};
SP(-77.36656157798372, 0.9699934182846013, 18.62282635951317){0};
T3(-77.36656157798372, 0.9699934182846013, 23.62282635951317, 0){"C5"};
SP(-60.512627891191066, -2.6157450408574734, 52.2570781770688){0};
T3(-60.512627891191066, -2.6157450408574734, 57.2570781770688, 0){"C3"};
SP(-31.47108858518476, -5.707108591722488, 73.97263452637617){0};
T3(-31.47108858518476, -5.707108591722488, 78.97263452637617, 0){"C1"};
SP(1.3622310330046141, -6.721680475948909, 79.96590906239105){0};
T3(1.3622310330046141, -6.721680475948909, 84.96590906239105, 0){"Cz"};
SP(35.058439218573035, -5.851639771037751, 71.150351901078){0};
T3(35.058439218573035, -5.851639771037751, 76.150351901078, 0){"C2"};
SP(63.74793171085453, -3.422614268042701, 47.88974261135806){0};
T3(63.74793171085453, -3.422614268042701, 52.88974261135806, 0){"C4"};
SP(78.84270593726004, -0.27011036811135813, 13.763171589896215){0};
T3(78.84270593726004, -0.27011036811135813, 18.763171589896217, 0){"C6"};
SP(76.11225368508023, 2.895898199998321, -24.581663368699864){0};
T3(76.11225368508023, 2.895898199998321, -19.581663368699864, 0){"T8"};
SP(61.594817000594716, 6.4099929236654045, -50.20220486885725){0};
T3(61.594817000594716, 6.4099929236654045, -45.20220486885725, 0){"T10"};
SP(-63.27634485727328, -10.385377781517235, -47.944433551025625){0};
T3(-63.27634485727328, -10.385377781517235, -42.944433551025625, 0){"TP9"};
SP(-74.55598626442195, -17.589939471956477, -22.813582763269583){0};
T3(-74.55598626442195, -17.589939471956477, -17.813582763269583, 0){"TP7"};
SP(-75.16780970421568, -26.441629155988565, 12.999173957837183){0};
T3(-75.16780970421568, -26.441629155988565, 17.999173957837183, 0){"CP5"};
SP(-58.37889882103962, -30.784503477649146, 45.51533760334474){0};
T3(-58.37889882103962, -30.784503477649146, 50.51533760334474, 0){"CP3"};
SP(-30.12018885881766, -33.584079559672645, 66.2176939618607){0};
T3(-30.12018885881766, -33.584079559672645, 71.2176939618607, 0){"CP1"};
SP(1.119640368724446, -34.853927455840214, 71.47459997127113){0};
T3(1.119640368724446, -34.853927455840214, 76.47459997127113, 0){"CPz"};
SP(34.94654900028161, -34.49331643566719, 64.00975963539481){0};
T3(34.94654900028161, -34.49331643566719, 69.00975963539481, 0){"CP2"};
SP(61.03879863786409, -31.825412071818683, 40.98385942007315){0};
T3(61.03879863786409, -31.825412071818683, 45.98385942007315, 0){"CP4"};
SP(74.72550394258944, -26.813132003151814, 8.531421007681699){0};
T3(74.72550394258944, -26.813132003151814, 13.531421007681699, 0){"CP6"};
SP(72.71308889194201, -19.312458503900796, -26.60012913800878){0};
T3(72.71308889194201, -19.312458503900796, -21.60012913800878, 0){"TP8"};
SP(60.6028721644314, -13.48224537363325, -51.51134739677333){0};
T3(60.6028721644314, -13.48224537363325, -46.51134739677333, 0){"TP10"};
SP(-53.68928200798396, -29.038775651326894, -52.24516791723189){0};
T3(-53.68928200798396, -29.038775651326894, -47.24516791723189, 0){"P9"};
SP(-64.9147763826128, -40.635636213616664, -24.261223142387255){0};
T3(-64.9147763826128, -40.635636213616664, -19.261223142387255, 0){"P7"};
SP(-62.55216827470176, -48.8703168393874, 4.129304989421372){0};
T3(-62.55216827470176, -48.8703168393874, 9.129304989421371, 0){"P5"};
SP(-49.353645920159146, -55.611851064397776, 29.863068627560978){0};
T3(-49.353645920159146, -55.611851064397776, 34.86306862756098, 0){"P3"};
SP(-25.606982013025178, -59.61321964403057, 47.304821635876685){0};
T3(-25.606982013025178, -59.61321964403057, 52.304821635876685, 0){"P1"};
SP(1.094020248254, -60.32846140391335, 52.19455499304965){0};
T3(1.094020248254, -60.32846140391335, 57.19455499304965, 0){"Pz"};
SP(29.27878493433554, -58.78440965458099, 45.61186395458552){0};
T3(29.27878493433554, -58.78440965458099, 50.61186395458552, 0){"P2"};
SP(51.20517628410744, -55.78530788497509, 26.90972321242969){0};
T3(51.20517628410744, -55.78530788497509, 31.90972321242969, 0){"P4"};
SP(62.1496582644248, -50.03272637021311, -0.13386622639191548){0};
T3(62.1496582644248, -50.03272637021311, 4.866133773608085, 0){"P6"};
SP(62.79009550774722, -41.08107811916268, -28.21118489312026){0};
T3(62.79009550774722, -41.08107811916268, -23.21118489312026, 0){"P8"};
SP(50.10269068812292, -30.16060135690556, -54.49414899880895){0};
T3(50.10269068812292, -30.16060135690556, -49.49414899880895, 0){"P10"};
SP(-39.89985799044677, -45.29596158551446, -52.50198524506092){0};
T3(-39.89985799044677, -45.29596158551446, -47.50198524506092, 0){"PO9"};
SP(-48.14208432966233, -58.712826721165136, -24.026465983165842){0};
T3(-48.14208432966233, -58.712826721165136, -19.026465983165842, 0){"PO7"};
SP(-44.558617182495034, -65.51128367299779, -7.434345491194838){0};
T3(-44.558617182495034, -65.51128367299779, -2.434345491194838, 0){"PO5"};
SP(-34.76407783891185, -71.72786006716689, 6.9174976798572585){0};
T3(-34.76407783891185, -71.72786006716689, 11.91749767985726, 0){"PO3"};
SP(-18.29692044763307, -76.0554299998826, 16.298524649350085){0};
T3(-18.29692044763307, -76.0554299998826, 21.298524649350085, 0){"PO1"};
SP(0.40821815394552496, -77.53313275723877, 19.73927190272395){0};
T3(0.40821815394552496, -77.53313275723877, 24.73927190272395, 0){"POz"};
SP(19.67044059531031, -76.27601417176132, 14.56372478143309){0};
T3(19.67044059531031, -76.27601417176132, 19.563724781433088, 0){"PO2"};
SP(34.66343536324102, -71.73529819431343, 3.923174393712963){0};
T3(34.66343536324102, -71.73529819431343, 8.923174393712962, 0){"PO4"};
SP(44.34552213364683, -66.1002615439784, -10.201399076867446){0};
T3(44.34552213364683, -66.1002615439784, -5.201399076867446, 0){"PO6"};
SP(46.770270635401815, -59.2426491016042, -27.18288372401573){0};
T3(46.770270635401815, -59.2426491016042, -22.18288372401573, 0){"PO8"};
SP(37.4060469815466, -44.43990089295309, -55.41230231572022){0};
T3(37.4060469815466, -44.43990089295309, -50.41230231572022, 0){"PO10"};
SP(-26.687674145188932, -72.23116776277347, -22.25901642670143){0};
T3(-26.687674145188932, -72.23116776277347, -17.25901642670143, 0){"O1"};
SP(-0.4937379445905843, -77.67415362029952, -18.55212804412124){0};
T3(-0.4937379445905843, -77.67415362029952, -13.55212804412124, 0){"Oz"};
SP(25.55492185949278, -72.00734182661148, -23.788797775982218){0};
T3(25.55492185949278, -72.00734182661148, -18.788797775982218, 0){"O2"};
SP(-22.924915169396353, -56.605187172134066, -51.80826276492823){0};
T3(-22.924915169396353, -56.605187172134066, -46.80826276492823, 0){"I1"};
SP(-1.430416613071423, -63.305057000551855, -49.66512502864978){0};
T3(-1.430416613071423, -63.305057000551855, -44.66512502864978, 0){"Iz"};
SP(19.7712832172189, -57.32531046219352, -53.28208389395057){0};
T3(19.7712832172189, -57.32531046219352, -48.28208389395057, 0){"I2"};
SP(-34.97815703537228, 69.62712010845823, -17.961822987759955){0};
T3(-34.97815703537228, 69.62712010845823, -12.961822987759955, 0){"AFp9h"};
SP(-32.90200307589592, 73.93019998486373, 2.292781112913662){0};
T3(-32.90200307589592, 73.93019998486373, 7.292781112913662, 0){"AFp7h"};
SP(-25.010330782924214, 76.18357440285345, 9.544532884057453){0};
T3(-25.010330782924214, 76.18357440285345, 14.544532884057453, 0){"AFp5h"};
SP(-15.281235037723748, 76.90939869654294, 16.16331561741146){0};
T3(-15.281235037723748, 76.90939869654294, 21.16331561741146, 0){"AFp3h"};
SP(-5.237840195333987, 76.94572559247577, 22.091512014647847){0};
T3(-5.237840195333987, 76.94572559247577, 27.091512014647847, 0){"AFp1h"};
SP(5.89460281385795, 76.94622283707216, 22.178488223119395){0};
T3(5.89460281385795, 76.94622283707216, 27.178488223119395, 0){"AFp2h"};
SP(16.453582930934907, 76.4278446681568, 16.99352560385057){0};
T3(16.453582930934907, 76.4278446681568, 21.99352560385057, 0){"AFp4h"};
SP(24.899898502891297, 75.9584360135756, 8.409197137880325){0};
T3(24.899898502891297, 75.9584360135756, 13.409197137880325, 0){"AFp6h"};
SP(32.39124864102498, 73.67592798796308, 0.545433583769988){0};
T3(32.39124864102498, 73.67592798796308, 5.545433583769988, 0){"AFp8h"};
SP(33.76104066190571, 68.85875135135142, -20.171895582833134){0};
T3(33.76104066190571, 68.85875135135142, -15.171895582833134, 0){"AFp10h"};
SP(-51.869468157467246, 55.94866242135808, -23.649434943881147){0};
T3(-51.869468157467246, 55.94866242135808, -18.649434943881147, 0){"AFF9h"};
SP(-53.510006722302954, 59.38571798994527, 4.357095624100685){0};
T3(-53.510006722302954, 59.38571798994527, 9.357095624100685, 0){"AFF7h"};
SP(-44.97835883946814, 60.6798271758348, 25.687589399233726){0};
T3(-44.97835883946814, 60.6798271758348, 30.687589399233726, 0){"AFF5h"};
SP(-29.645281378112998, 60.602570510802, 42.2988564022378){0};
T3(-29.645281378112998, 60.602570510802, 47.2988564022378, 0){"AFF3h"};
SP(-9.70726821051068, 61.28556442582449, 51.16420937550592){0};
T3(-9.70726821051068, 61.28556442582449, 56.16420937550592, 0){"AFF1h"};
SP(12.36504296815725, 60.7497101618455, 50.75475406367533){0};
T3(12.36504296815725, 60.7497101618455, 55.75475406367533, 0){"AFF2h"};
SP(32.37255914510335, 60.91936979707331, 41.12418141795083){0};
T3(32.37255914510335, 60.91936979707331, 46.12418141795083, 0){"AFF4h"};
SP(46.77009972116021, 60.94914633612518, 22.93672536502294){0};
T3(46.77009972116021, 60.94914633612518, 27.93672536502294, 0){"AFF6h"};
SP(54.186108283566035, 59.42646211945319, 0.933080074488972){0};
T3(54.186108283566035, 59.42646211945319, 5.933080074488972, 0){"AFF8h"};
SP(50.818105856742605, 55.89556100787941, -26.237013162884345){0};
T3(50.818105856742605, 55.89556100787941, -21.237013162884345, 0){"AFF10h"};
SP(-63.66831245484227, 38.15561164258542, -30.22438847234228){0};
T3(-63.66831245484227, 38.15561164258542, -25.22438847234228, 0){"FFT9h"};
SP(-69.37442762600637, 40.78179551906315, 4.081796771098079){0};
T3(-69.37442762600637, 40.78179551906315, 9.08179677109808, 0){"FFT7h"};
SP(-60.38578663450757, 39.910196089701515, 34.7317320902693){0};
T3(-60.38578663450757, 39.910196089701515, 39.7317320902693, 0){"FFC5h"};
SP(-39.81557217063704, 38.32447880581, 58.30223006348738){0};
T3(-39.81557217063704, 38.32447880581, 63.30223006348738, 0){"FFC3h"};
SP(-12.359154716977805, 36.29855220733762, 70.3408765821643){0};
T3(-12.359154716977805, 36.29855220733762, 75.3408765821643, 0){"FFC1h"};
SP(15.861572253074767, 36.1654375941678, 69.14131227400263){0};
T3(15.861572253074767, 36.1654375941678, 74.14131227400263, 0){"FFC2h"};
SP(43.09460099430854, 38.41638005879866, 55.96697118990502){0};
T3(43.09460099430854, 38.41638005879866, 60.96697118990502, 0){"FFC4h"};
SP(62.97506591233335, 39.55461974881818, 30.482745536424485){0};
T3(62.97506591233335, 39.55461974881818, 35.48274553642449, 0){"FFC6h"};
SP(69.64620106627251, 39.70052105328657, -1.1439179005881202){0};
T3(69.64620106627251, 39.70052105328657, 3.85608209941188, 0){"FFT8h"};
SP(62.275460977059005, 36.970712084699784, -33.24638268634304){0};
T3(62.275460977059005, 36.970712084699784, -28.24638268634304, 0){"FFT10h"};
SP(-69.8021007247882, 17.760442240987828, -35.17383900328155){0};
T3(-69.8021007247882, 17.760442240987828, -30.17383900328155, 0){"FTT9h"};
SP(-78.10068598392702, 16.429189216947375, 0.8236825178071884){0};
T3(-78.10068598392702, 16.429189216947375, 5.823682517807188, 0){"FTT7h"};
SP(-69.04366657908388, 12.71177198731207, 37.20648383095533){0};
T3(-69.04366657908388, 12.71177198731207, 42.20648383095533, 0){"FCC5h"};
SP(-45.983727493884984, 10.070121084928346, 64.52308038317987){0};
T3(-45.983727493884984, 10.070121084928346, 69.52308038317987, 0){"FCC3h"};
SP(-14.89633809859948, 8.003718737302702, 78.65176378283887){0};
T3(-14.89633809859948, 8.003718737302702, 83.65176378283887, 0){"FCC1h"};
SP(17.72969572020735, 8.076027660204746, 77.32431903167493){0};
T3(17.72969572020735, 8.076027660204746, 82.32431903167493, 0){"FCC2h"};
SP(49.456200253245086, 9.90609239236535, 62.06206595640526){0};
T3(49.456200253245086, 9.90609239236535, 67.06206595640526, 0){"FCC4h"};
SP(71.74926022503618, 11.857565461945839, 32.94631155811766){0};
T3(71.74926022503618, 11.857565461945839, 37.94631155811766, 0){"FCC6h"};
SP(78.83523347135774, 14.621323544894762, -3.714958191257139){0};
T3(78.83523347135774, 14.621323544894762, 1.2850418087428608, 0){"FTT8h"};
SP(68.24619376469116, 15.670360660430783, -38.648407307534576){0};
T3(68.24619376469116, 15.670360660430783, -33.648407307534576, 0){"FTT10h"};
SP(-71.62932137902482, -6.417652097190951, -36.21245920382494){0};
T3(-71.62932137902482, -6.417652097190951, -31.21245920382494, 0){"TTP9h"};
SP(-79.3461083127152, -10.33679606518616, -2.8647142574638913){0};
T3(-79.3461083127152, -10.33679606518616, 2.1352857425361087, 0){"TTP7h"};
SP(-71.25964852857891, -15.092576411317205, 33.81430343238173){0};
T3(-71.25964852857891, -15.092576411317205, 38.81430343238173, 0){"CCP5h"};
SP(-46.94594945917367, -18.482014570062614, 61.99108752118705){0};
T3(-46.94594945917367, -18.482014570062614, 66.99108752118704, 0){"CCP3h"};
SP(-14.884205804543486, -20.608965915726312, 76.31535205129825){0};
T3(-14.884205804543486, -20.608965915726312, 81.31535205129825, 0){"CCP1h"};
SP(19.13710871224952, -20.72228882527348, 75.14441667597835){0};
T3(19.13710871224952, -20.72228882527348, 80.14441667597835, 0){"CCP2h"};
SP(50.672549222359955, -19.624706324199977, 59.00369746261307){0};
T3(50.672549222359955, -19.624706324199977, 64.00369746261308, 0){"CCP4h"};
SP(72.89969108727364, -16.18806958508927, 29.535327800506128){0};
T3(72.89969108727364, -16.18806958508927, 34.535327800506124, 0){"CCP6h"};
SP(79.45114926526307, -11.338279807836566, -8.210059222940009){0};
T3(79.45114926526307, -11.338279807836566, -3.210059222940009, 0){"TTP8h"};
SP(69.92082199947731, -10.453725888947972, -38.2271349021634){0};
T3(69.92082199947731, -10.453725888947972, -33.2271349021634, 0){"TTP10h"};
SP(-64.91530892302359, -25.778753694582306, -39.540368806354124){0};
T3(-64.91530892302359, -25.778753694582306, -34.540368806354124, 0){"TPP9h"};
SP(-71.69066212976973, -34.84909061204609, -7.425105358480981){0};
T3(-71.69066212976973, -34.84909061204609, -2.425105358480981, 0){"TPP7h"};
SP(-63.77531938611331, -41.50741706426741, 24.952789554335908){0};
T3(-63.77531938611331, -41.50741706426741, 29.952789554335908, 0){"CPP5h"};
SP(-41.430994392860626, -46.12799798738882, 50.14153955733209){0};
T3(-41.430994392860626, -46.12799798738882, 55.14153955733209, 0){"CPP3h"};
SP(-12.900234633044745, -48.542430505059315, 63.159429099791815){0};
T3(-12.900234633044745, -48.542430505059315, 68.15942909979182, 0){"CPP1h"};
SP(17.554333503744132, -47.75120726759389, 61.56489365436256){0};
T3(17.554333503744132, -47.75120726759389, 66.56489365436255, 0){"CPP2h"};
SP(45.87271531423982, -46.21670772999603, 47.35390750443343){0};
T3(45.87271531423982, -46.21670772999603, 52.35390750443343, 0){"CPP4h"};
SP(64.80571522267978, -42.023223924969, 20.75488216030445){0};
T3(64.80571522267978, -42.023223924969, 25.75488216030445, 0){"CPP6h"};
SP(71.19875044916087, -35.69150895986289, -12.191545515605){0};
T3(71.19875044916087, -35.69150895986289, -7.191545515605, 0){"TPP8h"};
SP(62.628751435790626, -25.744323580943952, -43.35779728932067){0};
T3(62.628751435790626, -25.744323580943952, -38.35779728932067, 0){"TPP10h"};
SP(-52.93407996642408, -44.717249937312566, -40.2231562745898){0};
T3(-52.93407996642408, -44.717249937312566, -35.2231562745898, 0){"PPO9h"};
SP(-57.28880362759034, -54.366834852883834, -12.881082948374216){0};
T3(-57.28880362759034, -54.366834852883834, -7.881082948374216, 0){"PPO7h"};
SP(-49.954092123755316, -61.01536149367839, 9.567291199011153){0};
T3(-49.954092123755316, -61.01536149367839, 14.567291199011153, 0){"PPO5h"};
SP(-33.697470052607784, -67.45585294559325, 26.99343175764126){0};
T3(-33.697470052607784, -67.45585294559325, 31.99343175764126, 0){"PPO3h"};
SP(-11.038823948488801, -70.38406607884403, 36.02330309938811){0};
T3(-11.038823948488801, -70.38406607884403, 41.02330309938811, 0){"PPO1h"};
SP(13.633022331097276, -70.01444096465406, 36.430054787205485){0};
T3(13.633022331097276, -70.01444096465406, 41.430054787205485, 0){"PPO2h"};
SP(35.48428928590178, -66.9780319318548, 25.433073869740404){0};
T3(35.48428928590178, -66.9780319318548, 30.433073869740404, 0){"PPO4h"};
SP(50.17195363999666, -61.84618846077337, 6.125830416074976){0};
T3(50.17195363999666, -61.84618846077337, 11.125830416074976, 0){"PPO6h"};
SP(56.001809987230246, -55.15330637231642, -16.816052758526443){0};
T3(56.001809987230246, -55.15330637231642, -11.816052758526443, 0){"PPO8h"};
SP(49.67928882422065, -45.61540757571033, -43.004394185830236){0};
T3(49.67928882422065, -45.61540757571033, -38.004394185830236, 0){"PPO10h"};
SP(-35.281339214182, -59.77421106288363, -39.26287891335327){0};
T3(-35.281339214182, -59.77421106288363, -34.26287891335327, 0){"POO9h"};
SP(-36.255019342201095, -68.9427831780135, -18.01840644720178){0};
T3(-36.255019342201095, -68.9427831780135, -13.01840644720178, 0){"POO7h"};
SP(-29.936128141672416, -74.00811635994181, -8.528528163228572){0};
T3(-29.936128141672416, -74.00811635994181, -3.5285281632285717, 0){"POO5h"};
SP(-19.23125674696711, -78.16157834002327, -2.2099717028332058){0};
T3(-19.23125674696711, -78.16157834002327, 2.7900282971667942, 0){"POO3h"};
SP(-6.83417134263386, -80.1799973037739, 0.09088570695021836){0};
T3(-6.83417134263386, -80.1799973037739, 5.0908857069502185, 0){"POO1h"};
SP(6.644480437523063, -80.08160789734671, -1.1183380176586541){0};
T3(6.644480437523063, -80.08160789734671, 3.881661982341346, 0){"POO2h"};
SP(19.32226165903167, -77.86195121066694, -4.290760168221436){0};
T3(19.32226165903167, -77.86195121066694, 0.7092398317785644, 0){"POO4h"};
SP(28.991748190485872, -73.44654301293613, -10.968621322842692){0};
T3(28.991748190485872, -73.44654301293613, -5.968621322842692, 0){"POO6h"};
SP(35.45435293914768, -69.09232780635055, -20.14814248907584){0};
T3(35.45435293914768, -69.09232780635055, -15.148142489075841, 0){"POO8h"};
SP(33.00818662326823, -59.70039386892327, -41.248421468691916){0};
T3(33.00818662326823, -59.70039386892327, -36.248421468691916, 0){"POO10h"};
SP(-13.425928957839897, -69.86933046464942, -36.847994868874956){0};
T3(-13.425928957839897, -69.86933046464942, -31.847994868874956, 0){"OI1h"};
SP(11.68866308008175, -70.00690002911954, -37.509848535216065){0};
T3(11.68866308008175, -70.00690002911954, -32.509848535216065, 0){"OI2h"};
SP(-13.366513153214731, 79.22758582443427, 3.2265008174102197){0};
T3(-13.366513153214731, 79.22758582443427, 8.22650081741022, 0){"Fp1h"};
SP(12.345593217915818, 79.1028665838772, 2.5579306890136717){0};
T3(12.345593217915818, 79.1028665838772, 7.557930689013672, 0){"Fp2h"};
SP(-44.685308459493406, 62.867277171234235, -20.834679015083083){0};
T3(-44.685308459493406, 62.867277171234235, -15.834679015083083, 0){"AF9h"};
SP(-43.71441433904042, 67.05533297379077, 3.9164647889286424){0};
T3(-43.71441433904042, 67.05533297379077, 8.916464788928643, 0){"AF7h"};
SP(-35.60001871731327, 69.81359049042601, 18.852011407521804){0};
T3(-35.60001871731327, 69.81359049042601, 23.852011407521804, 0){"AF5h"};
SP(-23.396556521666458, 69.49648104342214, 32.052057796800675){0};
T3(-23.396556521666458, 69.49648104342214, 37.052057796800675, 0){"AF3h"};
SP(-7.974222636121332, 70.17531835127275, 38.556409860211375){0};
T3(-7.974222636121332, 70.17531835127275, 43.556409860211375, 0){"AF1h"};
SP(9.385529928394025, 70.00280357333281, 37.93064851639669){0};
T3(9.385529928394025, 70.00280357333281, 42.93064851639669, 0){"AF2h"};
SP(25.060048629033936, 69.21654301422528, 30.84549185409653){0};
T3(25.060048629033936, 69.21654301422528, 35.84549185409653, 0){"AF4h"};
SP(36.060010422506394, 69.02251703916903, 16.669131112192634){0};
T3(36.060010422506394, 69.02251703916903, 21.669131112192634, 0){"AF6h"};
SP(43.604432776281165, 66.57114002632305, 1.2083642417621832){0};
T3(43.604432776281165, 66.57114002632305, 6.208364241762183, 0){"AF8h"};
SP(43.657740023423344, 61.9706290159152, -23.20172301047269){0};
T3(43.657740023423344, 61.9706290159152, -18.20172301047269, 0){"AF10h"};
SP(-58.40321728227559, 47.55546330021543, -27.075600283437595){0};
T3(-58.40321728227559, 47.55546330021543, -22.075600283437595, 0){"F9h"};
SP(-61.50208175005575, 50.106533706956284, 4.255428621535051){0};
T3(-61.50208175005575, 50.106533706956284, 9.255428621535051, 0){"F7h"};
SP(-53.43461360813127, 51.16322825309266, 30.89819074122782){0};
T3(-53.43461360813127, 51.16322825309266, 35.89819074122782, 0){"F5h"};
SP(-35.08600196429513, 49.861805644102034, 51.40240335721202){0};
T3(-35.08600196429513, 49.861805644102034, 56.40240335721202, 0){"F3h"};
SP(-11.157756575624298, 49.82314115950681, 62.12455974866436){0};
T3(-11.157756575624298, 49.82314115950681, 67.12455974866435, 0){"F1h"};
SP(14.390007402444478, 49.09402437370431, 60.839996223125155){0};
T3(14.390007402444478, 49.09402437370431, 65.83999622312515, 0){"F2h"};
SP(38.76793862763418, 50.835983412837265, 49.40792410814087){0};
T3(38.76793862763418, 50.835983412837265, 54.40792410814087, 0){"F4h"};
SP(55.358097698261844, 51.45581430573919, 26.6526553774286){0};
T3(55.358097698261844, 51.45581430573919, 31.6526553774286, 0){"F6h"};
SP(62.622699474330474, 50.23429857616906, -0.23747759192138918){0};
T3(62.622699474330474, 50.23429857616906, 4.762522408078611, 0){"F8h"};
SP(57.89109138787022, 45.57246370566393, -30.39148456360525){0};
T3(57.89109138787022, 45.57246370566393, -25.39148456360525, 0){"F10h"};
SP(-66.79189884247963, 28.633026146500086, -32.65314060850348){0};
T3(-66.79189884247963, 28.633026146500086, -27.653140608503477, 0){"FT9h"};
SP(-74.72589087792403, 28.410688245838475, 2.585604284785638){0};
T3(-74.72589087792403, 28.410688245838475, 7.585604284785639, 0){"FT7h"};
SP(-65.90088257004714, 26.556122210881163, 36.70596691699383){0};
T3(-65.90088257004714, 26.556122210881163, 41.70596691699383, 0){"FC5h"};
SP(-43.518763655609355, 24.303080818791116, 62.8632908902913){0};
T3(-43.518763655609355, 24.303080818791116, 67.8632908902913, 0){"FC3h"};
SP(-13.69529781555848, 22.079444537368424, 75.21880273820088){0};
T3(-13.69529781555848, 22.079444537368424, 80.21880273820088, 0){"FC1h"};
SP(16.66288393095139, 22.436865774134592, 74.41165974015513){0};
T3(16.66288393095139, 22.436865774134592, 79.41165974015513, 0){"FC2h"};
SP(46.89766612663239, 24.43425667286223, 60.542865923577345){0};
T3(46.89766612663239, 24.43425667286223, 65.54286592357735, 0){"FC4h"};
SP(68.24516566845003, 25.69279616112779, 32.60844098338446){0};
T3(68.24516566845003, 25.69279616112779, 37.60844098338446, 0){"FC6h"};
SP(75.10362851311648, 27.82552501478084, -2.4021662253740166){0};
T3(75.10362851311648, 27.82552501478084, 2.5978337746259834, 0){"FT8h"};
SP(66.02477435577256, 26.062230427876553, -36.12576138020053){0};
T3(66.02477435577256, 26.062230427876553, -31.12576138020053, 0){"FT10h"};
SP(-71.70376233679305, 4.543403087194073, -35.83210364936655){0};
T3(-71.70376233679305, 4.543403087194073, -30.83210364936655, 0){"T9h"};
SP(-80.45247453882155, 2.577358172413851, -0.48537804574659305){0};
T3(-80.45247453882155, 2.577358172413851, 4.514621954253407, 0){"T7h"};
SP(-71.23126335579582, -0.7954838755179754, 36.57362948660133){0};
T3(-71.23126335579582, -0.7954838755179754, 41.57362948660133, 0){"C5h"};
SP(-46.73448441752306, -4.106388036122557, 64.67937742157872){0};
T3(-46.73448441752306, -4.106388036122557, 69.67937742157872, 0){"C3h"};
SP(-14.744790402123034, -6.451858127592537, 78.71403563578293){0};
T3(-14.744790402123034, -6.451858127592537, 83.71403563578293, 0){"C1h"};
SP(18.785950238732887, -6.491783430338607, 77.96320917748766){0};
T3(18.785950238732887, -6.491783430338607, 82.96320917748766, 0){"C2h"};
SP(50.657907145640706, -4.721848830511615, 61.3756925589449){0};
T3(50.657907145640706, -4.721848830511615, 66.3756925589449, 0){"C4h"};
SP(73.29211187467419, -2.091070975960992, 31.760335051565782){0};
T3(73.29211187467419, -2.091070975960992, 36.76033505156578, 0){"C6h"};
SP(80.00396123933538, 1.557791796838317, -5.499308372181819){0};
T3(80.00396123933538, 1.557791796838317, -0.4993083721818188, 0){"T8h"};
SP(68.67879473214538, 4.65345181827673, -40.685446986121256){0};
T3(68.67879473214538, 4.65345181827673, -35.685446986121256, 0){"T10h"};
SP(-69.70379775237316, -15.327285288002464, -36.42808344940542){0};
T3(-69.70379775237316, -15.327285288002464, -31.42808344940542, 0){"TP9h"};
SP(-76.66027738746472, -22.860799277546118, -5.521433130089737){0};
T3(-76.66027738746472, -22.860799277546118, -0.5214331300897372, 0){"TP7h"};
SP(-68.71185476639899, -28.805093519214193, 30.210040086896818){0};
T3(-68.71185476639899, -28.805093519214193, 35.21004008689682, 0){"CP5h"};
SP(-45.18154925905974, -32.206363383962575, 57.16542511923389){0};
T3(-45.18154925905974, -32.206363383962575, 62.16542511923389, 0){"CP3h"};
SP(-14.313697312565973, -34.763846530615396, 70.68844300670527){0};
T3(-14.313697312565973, -34.763846530615396, 75.68844300670527, 0){"CP1h"};
SP(18.599407310666546, -34.43239204411999, 69.80370218894186){0};
T3(18.599407310666546, -34.43239204411999, 74.80370218894186, 0){"CP2h"};
SP(48.95214696934126, -33.49686743296156, 54.53668711978658){0};
T3(48.95214696934126, -33.49686743296156, 59.53668711978658, 0){"CP4h"};
SP(69.7497175036513, -29.625424224916593, 25.549347401477746){0};
T3(69.7497175036513, -29.625424224916593, 30.549347401477746, 0){"CP6h"};
SP(76.25232119607952, -23.543658842036375, -10.321773521497066){0};
T3(76.25232119607952, -23.543658842036375, -5.321773521497066, 0){"TP8h"};
SP(66.79268581571296, -19.525393440684514, -41.549746046291595){0};
T3(66.79268581571296, -19.525393440684514, -36.549746046291595, 0){"TP10h"};
SP(-59.93994366855908, -35.83981607547793, -40.25921586950003){0};
T3(-59.93994366855908, -35.83981607547793, -35.25921586950003, 0){"P9h"};
SP(-65.0547353839335, -45.30560316220653, -10.391811672066472){0};
T3(-65.0547353839335, -45.30560316220653, -5.391811672066472, 0){"P7h"};
SP(-57.43663467238818, -52.32296161954664, 17.732362291163007){0};
T3(-57.43663467238818, -52.32296161954664, 22.732362291163007, 0){"P5h"};
SP(-38.30497979029843, -58.43162653633924, 40.0940566186186){0};
T3(-38.30497979029843, -58.43162653633924, 45.0940566186186, 0){"P3h"};
SP(-11.881702271957042, -60.18336188612729, 51.342916327236466){0};
T3(-11.881702271957042, -60.18336188612729, 56.342916327236466, 0){"P1h"};
SP(16.225770677887027, -59.597295566788006, 50.226077809474944){0};
T3(16.225770677887027, -59.597295566788006, 55.226077809474944, 0){"P2h"};
SP(41.19345199642746, -57.719079653409025, 37.26362210248013){0};
T3(41.19345199642746, -57.719079653409025, 42.26362210248013, 0){"P4h"};
SP(57.9988518089547, -52.76812888562485, 14.042788218859755){0};
T3(57.9988518089547, -52.76812888562485, 19.042788218859755, 0){"P6h"};
SP(64.49511191326121, -46.140083620191035, -14.426051212867243){0};
T3(64.49511191326121, -46.140083620191035, -9.426051212867243, 0){"P8h"};
SP(56.490738829346995, -35.73912335994248, -43.077802613302204){0};
T3(56.490738829346995, -35.73912335994248, -38.077802613302204, 0){"P10h"};
SP(-44.26890506234197, -52.87924389445788, -39.81900947317884){0};
T3(-44.26890506234197, -52.87924389445788, -34.81900947317884, 0){"PO9h"};
SP(-47.30588654266903, -62.866859230761676, -15.931067669338553){0};
T3(-47.30588654266903, -62.866859230761676, -10.931067669338553, 0){"PO7h"};
SP(-40.45951566021394, -68.60410403575823, 0.23898053052549795){0};
T3(-40.45951566021394, -68.60410403575823, 5.238980530525498, 0){"PO5h"};
SP(-27.00674181818308, -74.15292935037375, 12.168582577493531){0};
T3(-27.00674181818308, -74.15292935037375, 17.16858257749353, 0){"PO3h"};
SP(-9.077674304986598, -76.91907233607814, 18.712937918086162){0};
T3(-9.077674304986598, -76.91907233607814, 23.712937918086162, 0){"PO1h"};
SP(10.09242692657197, -77.70273042083151, 17.505974483217912){0};
T3(10.09242692657197, -77.70273042083151, 22.505974483217912, 0){"PO2h"};
SP(27.516069457394103, -74.0150230552033, 9.944010921713152){0};
T3(27.516069457394103, -74.0150230552033, 14.944010921713152, 0){"PO4h"};
SP(40.24861062944034, -68.73736701542964, -2.5879957063271837){0};
T3(40.24861062944034, -68.73736701542964, 2.4120042936728163, 0){"PO6h"};
SP(46.18053100782651, -63.328338435319324, -19.141991212285596){0};
T3(46.18053100782651, -63.328338435319324, -14.141991212285596, 0){"PO8h"};
SP(41.895565840182286, -52.79994796318121, -42.16757746395859){0};
T3(41.895565840182286, -52.79994796318121, -37.16757746395859, 0){"PO10h"};
SP(-13.977118235712824, -75.9677185755649, -20.523009210356165){0};
T3(-13.977118235712824, -75.9677185755649, -15.523009210356165, 0){"O1h"};
SP(13.118409696621299, -75.9265163922477, -21.403572769384727){0};
T3(13.118409696621299, -75.9265163922477, -16.403572769384727, 0){"O2h"};
SP(-13.203601330601424, -61.33834921448522, -50.510484647209275){0};
T3(-13.203601330601424, -61.33834921448522, -45.510484647209275, 0){"I1h"};
SP(10.823391600275446, -60.83219447115547, -51.399323068143644){0};
T3(10.823391600275446, -60.83219447115547, -46.399323068143644, 0){"I2h"};
SP(-28.48974223914089, 66.90423384382262, -32.9868866442346){0};
T3(-28.48974223914089, 66.90423384382262, -27.986886644234602, 0){"AFp9"};
SP(-36.044331338470386, 71.96318842494887, -2.01333175344762){0};
T3(-36.044331338470386, 71.96318842494887, 2.98666824655238, 0){"AFp7"};
SP(-29.369800465252574, 75.17838753365987, 5.894955493748025){0};
T3(-29.369800465252574, 75.17838753365987, 10.894955493748025, 0){"AFp5"};
SP(-20.190418091243206, 76.64088215756928, 12.687130123793565){0};
T3(-20.190418091243206, 76.64088215756928, 17.687130123793565, 0){"AFp3"};
SP(-10.670668204736428, 76.79121472383105, 20.16561361517534){0};
T3(-10.670668204736428, 76.79121472383105, 25.16561361517534, 0){"AFp1"};
SP(0.15356098708438282, 77.3229951033481, 23.152227739274434){0};
T3(0.15356098708438282, 77.3229951033481, 28.152227739274434, 0){"AFpz"};
SP(11.65646772422085, 76.5058377968052, 20.7960189564453){0};
T3(11.65646772422085, 76.5058377968052, 25.7960189564453, 0){"AFp2"};
SP(21.1880487990772, 76.42816207609467, 12.823439830504066){0};
T3(21.1880487990772, 76.42816207609467, 17.823439830504064, 0){"AFp4"};
SP(28.732312524633006, 74.9040156838392, 4.126575637676248){0};
T3(28.732312524633006, 74.9040156838392, 9.126575637676247, 0){"AFp6"};
SP(35.27446891804844, 71.70353418778936, -4.321287073307692){0};
T3(35.27446891804844, 71.70353418778936, 0.6787129266923078, 0){"AFp8"};
SP(28.190263436696473, 65.87747490919838, -34.863477941098964){0};
T3(28.190263436696473, 65.87747490919838, -29.863477941098964, 0){"AFp10"};
SP(-46.15254102510445, 53.12573314260163, -39.28864857570579){0};
T3(-46.15254102510445, 53.12573314260163, -34.28864857570579, 0){"AFF9"};
SP(-54.301005011447536, 58.10180460744111, -7.1589091820629145){0};
T3(-54.301005011447536, 58.10180460744111, -2.1589091820629145, 0){"AFF7"};
SP(-49.91287367060701, 60.70256285750136, 15.067821999081556){0};
T3(-49.91287367060701, 60.70256285750136, 20.067821999081556, 0){"AFF5"};
SP(-38.103749804734825, 60.77107175114898, 34.880158531068226){0};
T3(-38.103749804734825, 60.77107175114898, 39.880158531068226, 0){"AFF3"};
SP(-20.25412648115281, 60.957054659954274, 48.137492166144185){0};
T3(-20.25412648115281, 60.957054659954274, 53.137492166144185, 0){"AFF1"};
SP(0.6480910812899436, 60.80189582912071, 51.96875862721723){0};
T3(0.6480910812899436, 60.80189582912071, 56.96875862721723, 0){"AFFz"};
SP(22.71259987124332, 60.55999335239825, 47.25104282036214){0};
T3(22.71259987124332, 60.55999335239825, 52.25104282036214, 0){"AFF2"};
SP(40.6361714276204, 61.409777918971784, 32.88302062719799){0};
T3(40.6361714276204, 61.409777918971784, 37.88302062719799, 0){"AFF4"};
SP(51.21933802653834, 60.35186895975657, 12.081505469537786){0};
T3(51.21933802653834, 60.35186895975657, 17.081505469537788, 0){"AFF6"};
SP(54.41496715225128, 57.70774776750303, -10.830697849508622){0};
T3(54.41496715225128, 57.70774776750303, -5.830697849508622, 0){"AFF8"};
SP(45.3282089667028, 51.157597037591856, -42.019157983031555){0};
T3(45.3282089667028, 51.157597037591856, -37.019157983031555, 0){"AFF10"};
SP(-56.784909836684434, 37.99005224372889, -42.246119779177526){0};
T3(-56.784909836684434, 37.99005224372889, -37.246119779177526, 0){"FFT9"};
SP(-67.6546576668474, 39.509644394917515, -12.80308594373373){0};
T3(-67.6546576668474, 39.509644394917515, -7.8030859437337305, 0){"FFT7"};
SP(-66.07062295763814, 39.7987682199203, 19.803738069203007){0};
T3(-66.07062295763814, 39.7987682199203, 24.803738069203007, 0){"FFC5"};
SP(-51.28345923590517, 39.16659357980958, 47.64581170727371){0};
T3(-51.28345923590517, 39.16659357980958, 52.64581170727371, 0){"FFC3"};
SP(-26.269297030401553, 37.19649079840346, 65.75585278725403){0};
T3(-26.269297030401553, 37.19649079840346, 70.75585278725403, 0){"FFC1"};
SP(1.2334983814693525, 35.96358114139379, 70.85614802200321){0};
T3(1.2334983814693525, 35.96358114139379, 75.85614802200321, 0){"FFCz"};
SP(29.845366403853035, 37.432471464429824, 64.28727855570958){0};
T3(29.845366403853035, 37.432471464429824, 69.28727855570958, 0){"FFC2"};
SP(54.144023760126686, 39.296499761901686, 44.06360759530246){0};
T3(54.144023760126686, 39.296499761901686, 49.06360759530246, 0){"FFC4"};
SP(67.88408835616367, 39.73216881846562, 14.949176960946058){0};
T3(67.88408835616367, 39.73216881846562, 19.94917696094606, 0){"FFC6"};
SP(68.05824704667417, 39.141790750028406, -17.718272693704876){0};
T3(68.05824704667417, 39.141790750028406, -12.718272693704876, 0){"FFT8"};
SP(54.142899534220774, 36.06580928356678, -46.64904694180385){0};
T3(54.142899534220774, 36.06580928356678, -41.64904694180385, 0){"FFT10"};
SP(-61.67311750822318, 18.74461246307431, -47.13999566771525){0};
T3(-61.67311750822318, 18.74461246307431, -42.13999566771525, 0){"FTT9"};
SP(-76.22549717598427, 16.484194877300737, -18.179989029503968){0};
T3(-76.22549717598427, 16.484194877300737, -13.179989029503968, 0){"FTT7"};
SP(-75.1521797938196, 14.30961462291952, 20.047499259281413){0};
T3(-75.1521797938196, 14.30961462291952, 25.047499259281413, 0){"FCC5"};
SP(-59.518680855818175, 11.368197328020635, 52.92806892541454){0};
T3(-59.518680855818175, 11.368197328020635, 57.92806892541454, 0){"FCC3"};
SP(-30.953631985852677, 8.929604129352631, 73.46499354186088){0};
T3(-30.953631985852677, 8.929604129352631, 78.46499354186088, 0){"FCC1"};
SP(1.3817766458970806, 7.698488961773613, 80.55593297216413){0};
T3(1.3817766458970806, 7.698488961773613, 85.55593297216413, 0){"FCCz"};
SP(34.33783896912115, 8.987074987398865, 71.78687444771477){0};
T3(34.33783896912115, 8.987074987398865, 76.78687444771477, 0){"FCC2"};
SP(62.16105683260454, 11.079370120718643, 48.58493352174764){0};
T3(62.16105683260454, 11.079370120718643, 53.58493352174764, 0){"FCC4"};
SP(77.34563312301984, 13.445562205564142, 15.364104550883429){0};
T3(77.34563312301984, 13.445562205564142, 20.36410455088343, 0){"FCC6"};
SP(75.16524814575169, 15.576728086025454, -22.70085915323368){0};
T3(75.16524814575169, 15.576728086025454, -17.70085915323368, 0){"FTT8"};
SP(59.81231028074465, 17.190132871449357, -49.1272186408906){0};
T3(59.81231028074465, 17.190132871449357, -44.1272186408906, 0){"FTT10"};
SP(-63.31410510318897, -3.6320785293489646, -49.72073385701132){0};
T3(-63.31410510318897, -3.6320785293489646, -44.72073385701132, 0){"TTP9"};
SP(-77.02559498292229, -7.112756395670585, -21.022873427938798){0};
T3(-77.02559498292229, -7.112756395670585, -16.022873427938798, 0){"TTP7"};
SP(-77.74642256671238, -12.866403053923934, 15.934859804873966){0};
T3(-77.74642256671238, -12.866403053923934, 20.934859804873966, 0){"CCP5"};
SP(-60.557540447395304, -17.092497646423567, 49.46697490839491){0};
T3(-60.557540447395304, -17.092497646423567, 54.46697490839491, 0){"CCP3"};
SP(-31.468350412612452, -19.9196461368554, 71.311660642159){0};
T3(-31.468350412612452, -19.9196461368554, 76.311660642159, 0){"CCP1"};
SP(1.5892543231147265, -20.622972859586472, 77.2374904189417){0};
T3(1.5892543231147265, -20.622972859586472, 82.2374904189417, 0){"CCPz"};
SP(35.645405281215396, -20.537930829599226, 69.02137775137298){0};
T3(35.645405281215396, -20.537930829599226, 74.02137775137298, 0){"CCP2"};
SP(63.424437658202905, -18.058600904185507, 45.44117224326806){0};
T3(63.424437658202905, -18.058600904185507, 50.44117224326806, 0){"CCP4"};
SP(78.1344598953491, -14.121562507048626, 11.573674382261387){0};
T3(78.1344598953491, -14.121562507048626, 16.573674382261387, 0){"CCP6"};
SP(75.11978805949843, -8.209264988352679, -25.564003996080977){0};
T3(75.11978805949843, -8.209264988352679, -20.564003996080977, 0){"TTP8"};
SP(62.45733869447818, -3.315729077496554, -49.714007805376575){0};
T3(62.45733869447818, -3.315729077496554, -44.714007805376575, 0){"TTP10"};
SP(-60.31774483021683, -16.74055161632283, -50.13862330742206){0};
T3(-60.31774483021683, -16.74055161632283, -45.13862330742206, 0){"TPP9"};
SP(-70.37293027000976, -29.959863841513346, -23.7202903000381){0};
T3(-70.37293027000976, -29.959863841513346, -18.7202903000381, 0){"TPP7"};
SP(-69.53569449152243, -38.54766005278373, 9.250435595257976){0};
T3(-69.53569449152243, -38.54766005278373, 14.250435595257976, 0){"CPP5"};
SP(-54.27602997630777, -43.91260082263639, 38.84049893931861){0};
T3(-54.27602997630777, -43.91260082263639, 43.84049893931861, 0){"CPP3"};
SP(-27.840417402320895, -47.3152245012669, 58.387730388453335){0};
T3(-27.840417402320895, -47.3152245012669, 63.387730388453335, 0){"CPP1"};
SP(1.0418765367625507, -48.306764241810214, 63.56387547248129){0};
T3(1.0418765367625507, -48.306764241810214, 68.5638754724813, 0){"CPPz"};
SP(32.3623282392559, -47.20209297692665, 55.977806725047195){0};
T3(32.3623282392559, -47.20209297692665, 60.977806725047195, 0){"CPP2"};
SP(57.10746906445176, -44.68047164171817, 35.32630910578099){0};
T3(57.10746906445176, -44.68047164171817, 40.32630910578099, 0){"CPP4"};
SP(69.11815233699339, -38.9738856689671, 5.025611569264688){0};
T3(69.11815233699339, -38.9738856689671, 10.025611569264688, 0){"CPP6"};
SP(68.7091823558321, -30.828252602584918, -28.234306637728032){0};
T3(68.7091823558321, -30.828252602584918, -23.234306637728032, 0){"TPP8"};
SP(55.24134613534582, -20.75793658845702, -53.55918206436131){0};
T3(55.24134613534582, -20.75793658845702, -48.55918206436131, 0){"TPP10"};
SP(-47.536081131005794, -37.16317145438924, -52.649364742643485){0};
T3(-47.536081131005794, -37.16317145438924, -47.649364742643485, 0){"PPO9"};
SP(-57.49856461064292, -50.42275214467484, -24.40603990157642){0};
T3(-57.49856461064292, -50.42275214467484, -19.40603990157642, 0){"PPO7"};
SP(-54.472522086031255, -58.186962892574, -1.6022953443491625){0};
T3(-54.472522086031255, -58.186962892574, 3.3977046556508377, 0){"PPO5"};
SP(-43.47770728329822, -64.80078569042914, 19.01942657061617){0};
T3(-43.47770728329822, -64.80078569042914, 24.01942657061617, 0){"PPO3"};
SP(-22.743872072842997, -68.88990990044238, 32.93295816548344){0};
T3(-22.743872072842997, -68.88990990044238, 37.93295816548344, 0){"PPO1"};
SP(0.7693127945118219, -70.9366224815489, 37.90456680295621){0};
T3(0.7693127945118219, -70.9366224815489, 42.90456680295621, 0){"PPOz"};
SP(25.115736528522383, -68.60911871107568, 31.93244520013469){0};
T3(25.115736528522383, -68.60911871107568, 36.932445200134694, 0){"PPO2"};
SP(44.07204477573082, -64.95128885486095, 16.51359607072702){0};
T3(44.07204477573082, -64.95128885486095, 21.51359607072702, 0){"PPO4"};
SP(54.437151221691366, -58.27201179282606, -4.637912603489781){0};
T3(54.437151221691366, -58.27201179282606, 0.36208739651021915, 0){"PPO6"};
SP(55.16757854993354, -50.43564979368897, -27.80295092062769){0};
T3(55.16757854993354, -50.43564979368897, -22.80295092062769, 0){"PPO8"};
SP(43.81184509723166, -38.29550139619618, -55.03860956690094){0};
T3(43.81184509723166, -38.29550139619618, -50.03860956690094, 0){"PPO10"};
SP(-32.21146293300984, -51.381313074914985, -52.15875363239017){0};
T3(-32.21146293300984, -51.381313074914985, -47.15875363239017, 0){"POO9"};
SP(-38.24748060549417, -66.36477486132685, -23.380633196276758){0};
T3(-38.24748060549417, -66.36477486132685, -18.380633196276758, 0){"POO7"};
SP(-33.44147062628078, -71.76490050026618, -13.24736441971738){0};
T3(-33.44147062628078, -71.76490050026618, -8.24736441971738, 0){"POO5"};
SP(-25.10633656417184, -76.16216837846623, -5.275248332033038){0};
T3(-25.10633656417184, -76.16216837846623, -0.2752483320330379, 0){"POO3"};
SP(-13.55390208701613, -79.3199635876271, 0.6742610395778268){0};
T3(-13.55390208701613, -79.3199635876271, 5.674261039577827, 0){"POO1"};
SP(-0.0011352645693902819, -80.31858014974478, 0.5790996091503509){0};
T3(-0.0011352645693902819, -80.31858014974478, 5.579099609150351, 0){"POOz"};
SP(13.17440018035278, -79.23092450612289, -2.0201740607427694){0};
T3(13.17440018035278, -79.23092450612289, 2.9798259392572306, 0){"POO2"};
SP(24.588530657281318, -75.61115356434313, -7.042097613529271){0};
T3(24.588530657281318, -75.61115356434313, -2.042097613529271, 0){"POO4"};
SP(33.124019720864815, -71.34235543503033, -14.744227847483272){0};
T3(33.124019720864815, -71.34235543503033, -9.744227847483272, 0){"POO6"};
SP(36.70574431601823, -66.21141434775659, -25.692147164026153){0};
T3(36.70574431601823, -66.21141434775659, -20.692147164026153, 0){"POO8"};
SP(29.65678919102039, -51.42157076779792, -54.117640378692585){0};
T3(29.65678919102039, -51.42157076779792, -49.117640378692585, 0){"POO10"};
SP(-24.75165210101717, -65.7726307401506, -38.31915445132564){0};
T3(-24.75165210101717, -65.7726307401506, -33.31915445132564, 0){"OI1"};
SP(-0.9206069833500745, -72.02200894584898, -34.691390444277445){0};
T3(-0.9206069833500745, -72.02200894584898, -29.691390444277445, 0){"OIz"};
SP(23.323747566070313, -65.79613915265135, -40.056792310722656){0};
T3(23.323747566070313, -65.79613915265135, -35.056792310722656, 0){"OI2"};
SP(-77.32924450133514, 4.305401786857744, -19.989775214107127){0};
T3(-77.32924450133514, 4.305401786857744, -14.989775214107127, 0){"T3"};
SP(-64.9147763826128, -40.635636213616664, -24.261223142387255){0};
T3(-64.9147763826128, -40.635636213616664, -19.261223142387255, 0){"T5"};
SP(76.11225368508023, 2.895898199998321, -24.581663368699864){0};
T3(76.11225368508023, 2.895898199998321, -19.581663368699864, 0){"T4"};
SP(62.79009550774722, -41.08107811916268, -28.21118489312026){0};
T3(62.79009550774722, -41.08107811916268, -23.21118489312026, 0){"T6"};
SP(-57.13350635326312, -4.003565416640347, -55.88655304037897){0};
T3(-57.13350635326312, -4.003565416640347, -50.88655304037897, 0){"M1"};
SP(48.78318418177781, -5.613297361946081, -63.087764892266094){0};
T3(48.78318418177781, -5.613297361946081, -58.087764892266094, 0){"M2"};
SP(-55.546485949615054, 1.7857712501935232, -57.31848309029107){0};
T3(-55.546485949615054, 1.7857712501935232, -52.31848309029107, 0){"A1"};
SP(51.66861370776284, 1.5362628605026936, -61.047883763255236){0};
T3(51.66861370776284, 1.5362628605026936, -56.047883763255236, 0){"A2"};
SP(0.2983465402423916, 75.24580622112633, -29.27374720601168){0};
T3(0.2983465402423916, 75.24580622112633, -24.27374720601168, 0){"Nz"};
SP(-1.430416613071423, -63.305057000551855, -49.66512502864978){0};
T3(-1.430416613071423, -63.305057000551855, -44.66512502864978, 0){"Iz"};
SP(-61.7943005902669, 3.7574056355557515, -50.78432087049833){0};
T3(-61.7943005902669, 3.7574056355557515, -45.78432087049833, 0){"LPA"};
SP(63.003045655467915, 3.4598458440958684, -49.26331883211056){0};
T3(63.003045655467915, 3.4598458440958684, -44.26331883211056, 0){"RPA"};
};
myView = PostProcessing.NbViews-1;
View[myView].PointType=1;
View[myView].PointSize=6;
View[myView].LineType=1;
View[myView].LineWidth=2;
