0.000000000000000000e+00	0.000000000000000000e+00	1.000000000000000000e+00	2.000000000000000000e+00	3.000000000000000000e+00	4.000000000000000000e+00	5.000000000000000000e+00	6.000000000000000000e+00
0.000000000000000000e+00	5.659395160797819901e-01	5.909547511133509540e-02	7.891067093422899498e-03	5.525375548110112757e-03	5.380095116356085026e-03	5.364966010573936350e-03	5.363799123767145662e-03
1.000000000000000000e+00	2.566474128017401379e-01	2.402311937268819184e-02	3.268717060253186098e-03	1.529716808129281350e-03	1.422225016467581473e-03	1.413313070850598418e-03	1.410015266988997890e-03
2.000000000000000000e+00	1.455826361953231618e-01	1.239727279980827775e-02	1.585627706097599921e-03	4.316545879259954966e-04	3.611186537613936070e-04	3.591964979630244879e-04	3.593591770847269409e-04
3.000000000000000000e+00	1.038812608360407952e-01	8.227250676802301890e-03	9.135858245743508181e-04	1.560538196222500257e-04	9.155235261849075583e-05	9.002108734358086532e-05	9.008621753013584940e-05
4.000000000000000000e+00	8.780375028668606363e-02	6.700379564685417580e-03	6.963021016943777338e-04	9.017374002577822434e-05	2.500479204528739544e-05	2.255573023212372130e-05	2.257691817029549279e-05
5.000000000000000000e+00	8.284752427591615676e-02	6.796511996446181515e-03	6.150577802088874222e-04	7.525016757472213736e-05	1.027051422815531843e-05	5.600954545908491963e-06	5.637812421187586138e-06
