ID,Name,X,Y,Length,Width,StartDateInt,EndDateInt,HasCollision,IsStatic,IsScenario
69723dac-6d2e-4ee5-96eb-019f081b2733,myVormontagefläche,2.5,17.0,9.0,23.5,0,20,False,False,False
2be3dce2-a41c-40aa-b0c1-94b3c60cf7d5,myVormontagefläche,2.0,2.0,8.5,22.0,0,20,False,False,False
1c6acf52-7de9-446a-aa28-a43523b2353e,myVormontagefläche,58.0,15.5,10.5,17.0,0,20,False,False,False
ab747bae-2503-4761-b395-cc54f568ff76,myVormontagefläche,76.5,14.5,11.5,17.0,0,20,False,False,False
6ed4e058-1917-4a73-83dc-e7b7e54d4b6e,myVormontagefläche,25.0,2.0,9.0,12.0,0,20,False,False,False
d774b295-e82b-4ef8-9b6e-cc5eca4ec745,myCol1,28.0,15.5,10.5,29.0,10,20,False,False,False
05ded900-63aa-4967-b5c1-54afd2f633d1,myCol2,45.5,0.0,11.5,9.0,15,20,False,False,False
887b570a-9017-45ce-9ad2-74b9904b6448,myWeg,66.5,2.0,10.0,15.5,0,5,False,False,False
46a3eac4-b16f-441f-aefc-b824b7849e10,myWeg,45.0,2.0,10.0,11.5,0,5,False,False,False
599d13fb-f488-479e-9022-1aaabe9a2b5e,myWeg,58.5,2.0,9.5,7.0,0,20,False,False,False
557013fb-9ad2-479e-9022-1c54bcc52b5e,myWeg,90.0,3.0,10.0,9.0,0,20,False,False,False
bd10eda3-fd50-4a51-b3ce-36feea0044e6,Loading zone 1,83.5,3.0,10.0,5.0,0,20,False,True,False
25a85f64-8fed-4364-aa30-73b99fbb314c,Loading zone 2,3.5,11.5,4.5,10.0,0,20,False,True,False
ad605f2c-d74f-4e76-beb3-90ccb234324c,Loading zone 4,38.0,3.0,10.0,6.5,0,20,False,True,False
