ID,Name,X,Y,Length,Width,StartDateInt,EndDateInt,HasCollision,IsStatic,IsScenario
bd10eda3-fd50-4a51-b3ce-36feea0044e6,Loading zone 1,83.5,3.0,10.0,5.0,0,500,False,True,False
25a85f64-8fed-4364-aa30-73b99fbb314c,Loading zone 2,3.5,11.5,4.5,10.0,0,500,False,True,False
ad605f2c-d74f-4e76-beb3-90ccb234324c,Loading zone 4,38.0,3.0,10.0,6.5,0,500,False,True,False
