ID,Name,X,Y,Length,Width,StartDateInt,EndDateInt,HasCollision,IsStatic,IsScenario
ae9be8eb-a81b-485e-a391-b5f6b5b4f99d,myNew1,0.0,0.0,10.0,13.0,6,20,False,False,True
293d3b2b-7400-4060-a7a8-4f39e1fdd579,myNew2,0.0,0.0,5.0,7.5,6,20,False,False,True
acaaf046-c806-4e0b-9068-f28fd8b779c0,myNew3,0.0,0.0,3.5,8.5,6,20,False,False,True
a14df832-4ec4-4029-80d2-fcd92c67ea0e,myNew4,0.0,0.0,10.0,11.5,6,20,False,False,True
