{
  "$schema": "https://json-schema.org/draft/2020-12/schema",
  "$id": "actor.json",
  "title": "TextAPI: Actor",
  "type": "object",
  "properties": {
    "@context": {
      "enum": [
        "https://gitlab.gwdg.de/subugoe/emo/text-api/-/raw/main/jsonld/actor.jsonld",
        "https://gitlab.gwdg.de/subugoe/textapi/specs/-/raw/main/jsonld/actor.jsonld"
      ]
    },
    "role": {
      "description": "the role of a personal entity in relation to the parent object, MUST be collector in case of collections",
      "type": "array",
      "items": {
        "type": "string",
        "minLength": 1
      }
    },
    "name": {
      "description": "the principal name of the person",
      "type": "string"
    },
    "id": {
      "description": "internal identifier",
      "type": "string"
    },
    "idref": {
      "description": "authority files related to the person",
      "type": "array",
      "items": {
        "$ref": "idref.json",
        "minItems": 1,
        "uniqueItems": true
      }
    }
  },
  "required": [ "@context", "role", "name" ],
  "patternProperties": {
    "^x-": {}
  }
}
