{
    "$schema": "https://json-schema.org/draft/2020-12/schema",
    "$id": "target.json",
    "title": "AnnotationAPI: Target Object",
    "description": "Provides information about the target resource the annotation refers to.",
    "type": "object",
    "properties": {
        "selector": {
            "description": "a selector pointing to the target",
            "anyOf": [
                {
                    "$ref": "selector-css.json"
                },
                {
                    "$ref": "selector-range.json"
                }
            ]
        },
        "format": {
            "description": "MIME type of the target resource",
            "type": "string",
            "enum": [
                "audio/aacapplication/x-abiword",
                "image/apng",
                "application/x-freearc",
                "image/avif",
                "video/x-msvideo",
                "application/vnd.amazon.ebook",
                "application/octet-stream",
                "image/bmp",
                "application/x-bzip",
                "application/x-bzip2",
                "application/x-cdf",
                "application/x-csh",
                "text/css",
                "text/csv",
                "application/msword",
                "application/vnd.openxmlformats-officedocument.wordprocessingml.document",
                "application/vnd.ms-fontobject",
                "application/epub+zip",
                "application/gzip",
                "image/gif",
                "text/html",
                "image/vnd.microsoft.icon",
                "text/calendar",
                "application/java-archive",
                "image/jpeg",
                "text/javascript",
                "application/json",
                "application/ld+json",
                "audio/midi, audio/x-midi",
                "text/javascript",
                "audio/mpeg",
                "video/mp4",
                "video/mpeg",
                "application/vnd.apple.installer+xml",
                "application/vnd.oasis.opendocument.presentation",
                "application/vnd.oasis.opendocument.spreadsheet",
                "application/vnd.oasis.opendocument.text",
                "audio/ogg",
                "video/ogg",
                "application/ogg",
                "audio/opus",
                "font/otf",
                "image/png",
                "application/pdf",
                "application/x-httpd-php",
                "application/vnd.ms-powerpoint",
                "application/vnd.openxmlformats-officedocument.presentationml.presentation",
                "application/vnd.rar",
                "application/rtf",
                "application/x-sh",
                "image/svg+xml",
                "application/x-tar",
                "image/tiff",
                "video/mp2t",
                "font/ttf",
                "text/plain",
                "application/vnd.visio",
                "audio/wav",
                "audio/webm",
                "video/webm",
                "image/webp",
                "font/woff",
                "font/woff2",
                "application/xhtml+xml",
                "application/vnd.ms-excel",
                "application/vnd.openxmlformats-officedocument.spreadsheetml.sheet",
                "application/xml",
                "application/vnd.mozilla.xul+xml",
                "application/zip",
                "video/3gpp",
                "audio/3gpp",
                "video/3gpp2",
                "audio/3gpp2",
                "application/x-7z-compressed"
            ]
        },
        "language": {
            "description": "the language of the target resource",
            "type": "string",
            "maxLength": 3
        },
        "source": {
            "description": "a URL to the resource to which the annotation points to",
            "type": "string",
            "pattern": "^(([^:/?#]+):)?(//([^/?#]*))?([^?#]*)(\\?([^#]*))?(#(.*))?"
        }
    },
    "required": [
        "selector",
        "format",
        "language",
        "source"
    ],
    "additionalProperties": false
}