[
    "https://ahiqar.uni-goettingen.de/api",
    "https://ahikar.sub.uni-goettingen.de/api",
    "https://ahikar-dev.sub.uni-goettingen.de/api",
    "https://ahikar-test.sub.uni-goettingen.de/api",
    "https://dev.gfl.sub.uni-goettingen.de/textapi",
    "https://goethes-farbenlehre-berlin.sub.uni-goettingen.de/tido/gfl",
    "https://textgridlab.org/textapi",
    "https://dev.textgridlab.org/textapi",
    "https://test.textgridlab.org/textapi",
    "https://eupt-dev.sub.uni-goettingen.de/api/eupt/"
]
