{
  "$schema": "https://json-schema.org/draft/2020-12/schema",
  "$id": "repository.json",
  "title": "TextAPI: Repository",
  "description": "A repository archiving the source or derivates, e.g. facsimiles or digitized versions.",
  "type": "object",
  "properties": {
    "@context": {
      "enum": [
        "https://gitlab.gwdg.de/subugoe/emo/text-api/-/raw/main/jsonld/repository.jsonld",
        "https://gitlab.gwdg.de/subugoe/textapi/specs/-/raw/main/jsonld/repository.jsonld"
      ]
    },
    "label": {
      "description": "the label as given by the hosting institution",
      "type": "string"
    },
    "url": {
      "description": "URL pointing to the website of the institution",
      "type": "string",
      "pattern": "^(([^:/?#]+):)?(//([^/?#]*))?([^?#]*)(\\?([^#]*))?(#(.*))?"
    },
    "baseUrl": {
      "description": "a base URL where id can be resolved",
      "type": "string",
      "pattern": "^(([^:/?#]+):)?(//([^/?#]*))?([^?#]*)(\\?([^#]*))?(#(.*))?"
    },
    "id": {
      "description": "the identifier at the hosting institution",
      "type": "string"
    }
  },
  "required": [ "@context", "url", "baseUrl", "id" ],
  "patternProperties": {
    "^x-": {}
  },
  "additionalProperties": false
}
