{
  "$schema": "https://json-schema.org/draft/2020-12/schema",
  "$id": "image.json",
  "title": "TextAPI: Image",
  "description": "An image representing the source or its provider. It is recommended that a IIIF Image API service is available for this image for manipulations such as resizing.",
  "type": "object",
  "properties": {
    "@context": {
      "enum": [
        "https://gitlab.gwdg.de/subugoe/emo/text-api/-/raw/main/jsonld/image.jsonld",
        "https://gitlab.gwdg.de/subugoe/textapi/specs/-/raw/main/jsonld/image.jsonld"
      ]
    },
    "id": {
      "description": "URL pointing to the image",
      "type": "string",
      "pattern": "^(([^:/?#]+):)?(//([^/?#]*))?([^?#]*)(\\?([^#]*))?(#(.*))?"
    },
    "manifest": {
      "description": "URL pointing to the image’s manifest object",
      "type": "string",
      "pattern": "^(([^:/?#]+):)?(//([^/?#]*))?([^?#]*)(\\?([^#]*))?(#(.*))?"
    },
    "license": {
      "description": "the license for the image that MUST be used",
      "$ref": "license.json"
    }
  },
  "required": [ "@context", "id", "license" ],
  "patternProperties": {
    "^x-": {}
  },
  "additionalProperties": false
}
