{
    "$schema": "https://json-schema.org/draft/2020-12/schema",
    "$id": "body.json",
    "title": "AnnotationAPI: Body Object",
    "description": "",
    "type": "object",
    "properties": {
        "type": {
            "description": "the type of the object",
            "type": "string",
            "const": "TextualBody"
        },
        "value": {
            "description": "the content of the annotation",
            "type": "string",
            "minLength": 1
        },
        "format": {
            "description": "MIME type",
            "type": "string",
            "enum": [
                "text/plain",
                "text/html"
            ]
        },
        "x-content-type": {
            "description": "the semantic type of the annotation. can be chosen freely by each project, e.g. Person or Place",
            "type": "string",
            "minLength": 1
        }
    },
    "required": [
        "type",
        "value",
        "format",
        "x-content-type"
    ],
    "additionalProperties": false
}