{
  "$schema": "https://json-schema.org/draft/2020-12/schema",
  "$id": "module.json",
  "title": "TextAPI: Module",
  "description": "Gives information about which API modules are in use. If the Module Object is set, at least one module has to be selected.",
  "type": "object",
  "properties": {
    "edition-manuscripts": {
      "description": "module for editions dealing with handwritten sources",
      "type": "string",
      "enum": ["true", "false"]
    },
    "edition-prints": {
      "description": "module for editions of printed works",
      "type": "boolean"
    }
  },
  "patternProperties": {
    "^x-": {}
  },
  "additionalProperties": false
}
