{
  "$schema": "https://json-schema.org/draft/2020-12/schema",
  "$id": "sequence.json",
  "title": "TextAPI: Sequence",
  "description": "Represents a sequence of collections, manifests or items. Within a manifest it SHOULD contain items exclusively.",
  "type": "object",
  "properties": {
    "@context": {
      "enum": [
        "https://gitlab.gwdg.de/subugoe/emo/text-api/-/raw/main/jsonld/sequence.jsonld",
        "https://gitlab.gwdg.de/subugoe/textapi/specs/-/raw/main/jsonld/sequence.jsonld"
      ]
    },
    "id": {
      "description": "URL to find a Manifest Object, Collection Object or Item Object",
      "type": "string",
      "pattern": "^(([^:/?#]+):)?(//([^/?#]*))?([^?#]*)(\\?([^#]*))?(#(.*))?"
    },
    "type": {
      "type": "string",
      "enum": [ "collection", "manifest", "item" ]
    },
    "label": {
      "type": "string"
    }
  },
  "required": [ "@context", "id", "type" ],
  "patternProperties": {
    "^x-": {}
  },
  "additionalProperties": false

}
